ws-dev mailing list archives

Site index · List index
Message view « Date » · « Thread »
Top « Date » · « Thread »
From Apache Jenkins Server <jenk...@builds.apache.org>
Subject Build failed in Jenkins: wss4j-trunk » Apache WSS4J Streaming WS-Security #470
Date Mon, 01 Apr 2013 20:33:39 GMT
See <https://builds.apache.org/job/wss4j-trunk/org.apache.wss4j$wss4j-ws-security-stax/470/changes>

Changes:

[giger] cleanups

[giger] refactoring SecurityToken stuff

------------------------------------------
[...truncated 42 lines...]
public class WSSecurityTokenConstants extends SecurityTokenConstants {
[ERROR] <https://builds.apache.org/job/wss4j-trunk/org.apache.wss4j$wss4j-ws-security-stax/ws/src/main/java/org/apache/wss4j/stax/impl/securityToken/X509DefaultSecurityTokenImpl.java>:[34,82]
cannot find symbol
symbol  : class KeyIdentifier
location: class org.apache.wss4j.stax.securityToken.WSSecurityTokenConstants
[ERROR] <https://builds.apache.org/job/wss4j-trunk/org.apache.wss4j$wss4j-ws-security-stax/ws/src/main/java/org/apache/wss4j/stax/impl/securityToken/X509SecurityTokenImpl.java>:[48,60]
cannot find symbol
symbol  : class TokenType
location: class org.apache.wss4j.stax.securityToken.WSSecurityTokenConstants
[ERROR] <https://builds.apache.org/job/wss4j-trunk/org.apache.wss4j$wss4j-ws-security-stax/ws/src/main/java/org/apache/wss4j/stax/impl/securityToken/X509SecurityTokenImpl.java>:[50,60]
cannot find symbol
symbol  : class KeyIdentifier
location: class org.apache.wss4j.stax.securityToken.WSSecurityTokenConstants
[ERROR] <https://builds.apache.org/job/wss4j-trunk/org.apache.wss4j$wss4j-ws-security-stax/ws/src/main/java/org/apache/wss4j/stax/impl/securityToken/X509SecurityTokenImpl.java>:[67,63]
cannot find symbol
symbol  : class AlgorithmUsage
location: class org.apache.xml.security.stax.ext.XMLSecurityConstants
[ERROR] <https://builds.apache.org/job/wss4j-trunk/org.apache.wss4j$wss4j-ws-security-stax/ws/src/main/java/org/apache/wss4j/stax/securityToken/WSSecurityTokenConstants.java>:[26,24]
cannot find symbol
symbol  : class TokenUsage
location: class org.apache.wss4j.stax.securityToken.WSSecurityTokenConstants
[ERROR] <https://builds.apache.org/job/wss4j-trunk/org.apache.wss4j$wss4j-ws-security-stax/ws/src/main/java/org/apache/wss4j/stax/securityToken/WSSecurityTokenConstants.java>:[27,24]
cannot find symbol
symbol  : class TokenUsage
location: class org.apache.wss4j.stax.securityToken.WSSecurityTokenConstants
[ERROR] <https://builds.apache.org/job/wss4j-trunk/org.apache.wss4j$wss4j-ws-security-stax/ws/src/main/java/org/apache/wss4j/stax/securityToken/WSSecurityTokenConstants.java>:[28,24]
cannot find symbol
symbol  : class TokenUsage
location: class org.apache.wss4j.stax.securityToken.WSSecurityTokenConstants
[ERROR] <https://builds.apache.org/job/wss4j-trunk/org.apache.wss4j$wss4j-ws-security-stax/ws/src/main/java/org/apache/wss4j/stax/securityToken/WSSecurityTokenConstants.java>:[29,24]
cannot find symbol
symbol  : class TokenUsage
location: class org.apache.wss4j.stax.securityToken.WSSecurityTokenConstants
[ERROR] <https://builds.apache.org/job/wss4j-trunk/org.apache.wss4j$wss4j-ws-security-stax/ws/src/main/java/org/apache/wss4j/stax/securityToken/WSSecurityTokenConstants.java>:[30,24]
cannot find symbol
symbol  : class TokenUsage
location: class org.apache.wss4j.stax.securityToken.WSSecurityTokenConstants
[ERROR] <https://builds.apache.org/job/wss4j-trunk/org.apache.wss4j$wss4j-ws-security-stax/ws/src/main/java/org/apache/wss4j/stax/securityToken/WSSecurityTokenConstants.java>:[31,24]
cannot find symbol
symbol  : class TokenUsage
location: class org.apache.wss4j.stax.securityToken.WSSecurityTokenConstants
[ERROR] <https://builds.apache.org/job/wss4j-trunk/org.apache.wss4j$wss4j-ws-security-stax/ws/src/main/java/org/apache/wss4j/stax/securityToken/WSSecurityTokenConstants.java>:[32,24]
cannot find symbol
symbol  : class TokenUsage
location: class org.apache.wss4j.stax.securityToken.WSSecurityTokenConstants
[ERROR] <https://builds.apache.org/job/wss4j-trunk/org.apache.wss4j$wss4j-ws-security-stax/ws/src/main/java/org/apache/wss4j/stax/securityToken/WSSecurityTokenConstants.java>:[33,24]
cannot find symbol
symbol  : class TokenUsage
location: class org.apache.wss4j.stax.securityToken.WSSecurityTokenConstants
[ERROR] <https://builds.apache.org/job/wss4j-trunk/org.apache.wss4j$wss4j-ws-security-stax/ws/src/main/java/org/apache/wss4j/stax/securityToken/WSSecurityTokenConstants.java>:[34,24]
cannot find symbol
symbol  : class TokenUsage
location: class org.apache.wss4j.stax.securityToken.WSSecurityTokenConstants
[ERROR] <https://builds.apache.org/job/wss4j-trunk/org.apache.wss4j$wss4j-ws-security-stax/ws/src/main/java/org/apache/wss4j/stax/securityToken/WSSecurityTokenConstants.java>:[35,24]
cannot find symbol
symbol  : class TokenUsage
location: class org.apache.wss4j.stax.securityToken.WSSecurityTokenConstants
[ERROR] <https://builds.apache.org/job/wss4j-trunk/org.apache.wss4j$wss4j-ws-security-stax/ws/src/main/java/org/apache/wss4j/stax/securityToken/WSSecurityTokenConstants.java>:[38,24]
cannot find symbol
symbol  : class KeyIdentifier
location: class org.apache.wss4j.stax.securityToken.WSSecurityTokenConstants
[ERROR] <https://builds.apache.org/job/wss4j-trunk/org.apache.wss4j$wss4j-ws-security-stax/ws/src/main/java/org/apache/wss4j/stax/securityToken/WSSecurityTokenConstants.java>:[39,24]
cannot find symbol
symbol  : class KeyIdentifier
location: class org.apache.wss4j.stax.securityToken.WSSecurityTokenConstants
[ERROR] <https://builds.apache.org/job/wss4j-trunk/org.apache.wss4j$wss4j-ws-security-stax/ws/src/main/java/org/apache/wss4j/stax/securityToken/WSSecurityTokenConstants.java>:[40,24]
cannot find symbol
symbol  : class KeyIdentifier
location: class org.apache.wss4j.stax.securityToken.WSSecurityTokenConstants
[ERROR] <https://builds.apache.org/job/wss4j-trunk/org.apache.wss4j$wss4j-ws-security-stax/ws/src/main/java/org/apache/wss4j/stax/securityToken/WSSecurityTokenConstants.java>:[41,24]
cannot find symbol
symbol  : class KeyIdentifier
location: class org.apache.wss4j.stax.securityToken.WSSecurityTokenConstants
[ERROR] <https://builds.apache.org/job/wss4j-trunk/org.apache.wss4j$wss4j-ws-security-stax/ws/src/main/java/org/apache/wss4j/stax/securityToken/WSSecurityTokenConstants.java>:[42,24]
cannot find symbol
symbol  : class KeyIdentifier
location: class org.apache.wss4j.stax.securityToken.WSSecurityTokenConstants
[ERROR] <https://builds.apache.org/job/wss4j-trunk/org.apache.wss4j$wss4j-ws-security-stax/ws/src/main/java/org/apache/wss4j/stax/securityToken/WSSecurityTokenConstants.java>:[43,24]
cannot find symbol
symbol  : class KeyIdentifier
location: class org.apache.wss4j.stax.securityToken.WSSecurityTokenConstants
[ERROR] <https://builds.apache.org/job/wss4j-trunk/org.apache.wss4j$wss4j-ws-security-stax/ws/src/main/java/org/apache/wss4j/stax/securityToken/WSSecurityTokenConstants.java>:[44,24]
cannot find symbol
symbol  : class KeyIdentifier
location: class org.apache.wss4j.stax.securityToken.WSSecurityTokenConstants
[ERROR] <https://builds.apache.org/job/wss4j-trunk/org.apache.wss4j$wss4j-ws-security-stax/ws/src/main/java/org/apache/wss4j/stax/securityToken/WSSecurityTokenConstants.java>:[45,24]
cannot find symbol
symbol  : class KeyIdentifier
location: class org.apache.wss4j.stax.securityToken.WSSecurityTokenConstants
[ERROR] <https://builds.apache.org/job/wss4j-trunk/org.apache.wss4j$wss4j-ws-security-stax/ws/src/main/java/org/apache/wss4j/stax/securityToken/WSSecurityTokenConstants.java>:[47,24]
cannot find symbol
symbol  : class TokenType
location: class org.apache.wss4j.stax.securityToken.WSSecurityTokenConstants
[ERROR] <https://builds.apache.org/job/wss4j-trunk/org.apache.wss4j$wss4j-ws-security-stax/ws/src/main/java/org/apache/wss4j/stax/securityToken/WSSecurityTokenConstants.java>:[48,24]
cannot find symbol
symbol  : class TokenType
location: class org.apache.wss4j.stax.securityToken.WSSecurityTokenConstants
[ERROR] <https://builds.apache.org/job/wss4j-trunk/org.apache.wss4j$wss4j-ws-security-stax/ws/src/main/java/org/apache/wss4j/stax/securityToken/WSSecurityTokenConstants.java>:[49,24]
cannot find symbol
symbol  : class TokenType
location: class org.apache.wss4j.stax.securityToken.WSSecurityTokenConstants
[ERROR] <https://builds.apache.org/job/wss4j-trunk/org.apache.wss4j$wss4j-ws-security-stax/ws/src/main/java/org/apache/wss4j/stax/securityToken/WSSecurityTokenConstants.java>:[50,24]
cannot find symbol
symbol  : class TokenType
location: class org.apache.wss4j.stax.securityToken.WSSecurityTokenConstants
[ERROR] <https://builds.apache.org/job/wss4j-trunk/org.apache.wss4j$wss4j-ws-security-stax/ws/src/main/java/org/apache/wss4j/stax/securityToken/WSSecurityTokenConstants.java>:[51,24]
cannot find symbol
symbol  : class TokenType
location: class org.apache.wss4j.stax.securityToken.WSSecurityTokenConstants
[ERROR] <https://builds.apache.org/job/wss4j-trunk/org.apache.wss4j$wss4j-ws-security-stax/ws/src/main/java/org/apache/wss4j/stax/securityToken/WSSecurityTokenConstants.java>:[52,24]
cannot find symbol
symbol  : class TokenType
location: class org.apache.wss4j.stax.securityToken.WSSecurityTokenConstants
[ERROR] <https://builds.apache.org/job/wss4j-trunk/org.apache.wss4j$wss4j-ws-security-stax/ws/src/main/java/org/apache/wss4j/stax/securityToken/WSSecurityTokenConstants.java>:[53,24]
cannot find symbol
symbol  : class TokenType
location: class org.apache.wss4j.stax.securityToken.WSSecurityTokenConstants
[ERROR] <https://builds.apache.org/job/wss4j-trunk/org.apache.wss4j$wss4j-ws-security-stax/ws/src/main/java/org/apache/wss4j/stax/securityToken/WSSecurityTokenConstants.java>:[54,24]
cannot find symbol
symbol  : class TokenType
location: class org.apache.wss4j.stax.securityToken.WSSecurityTokenConstants
[ERROR] <https://builds.apache.org/job/wss4j-trunk/org.apache.wss4j$wss4j-ws-security-stax/ws/src/main/java/org/apache/wss4j/stax/securityToken/WSSecurityTokenConstants.java>:[55,24]
cannot find symbol
symbol  : class TokenType
location: class org.apache.wss4j.stax.securityToken.WSSecurityTokenConstants
[ERROR] <https://builds.apache.org/job/wss4j-trunk/org.apache.wss4j$wss4j-ws-security-stax/ws/src/main/java/org/apache/wss4j/stax/securityToken/WSSecurityTokenConstants.java>:[56,24]
cannot find symbol
symbol  : class TokenType
location: class org.apache.wss4j.stax.securityToken.WSSecurityTokenConstants
[ERROR] <https://builds.apache.org/job/wss4j-trunk/org.apache.wss4j$wss4j-ws-security-stax/ws/src/main/java/org/apache/wss4j/stax/securityToken/WSSecurityTokenConstants.java>:[57,24]
cannot find symbol
symbol  : class TokenType
location: class org.apache.wss4j.stax.securityToken.WSSecurityTokenConstants
[ERROR] <https://builds.apache.org/job/wss4j-trunk/org.apache.wss4j$wss4j-ws-security-stax/ws/src/main/java/org/apache/wss4j/stax/securityToken/WSSecurityTokenConstants.java>:[58,24]
cannot find symbol
symbol  : class TokenType
location: class org.apache.wss4j.stax.securityToken.WSSecurityTokenConstants
[ERROR] <https://builds.apache.org/job/wss4j-trunk/org.apache.wss4j$wss4j-ws-security-stax/ws/src/main/java/org/apache/wss4j/stax/ext/WSSSecurityProperties.java>:[70,36]
cannot find symbol
symbol  : class KeyIdentifier
location: class org.apache.wss4j.stax.securityToken.WSSecurityTokenConstants
[ERROR] <https://builds.apache.org/job/wss4j-trunk/org.apache.wss4j$wss4j-ws-security-stax/ws/src/main/java/org/apache/wss4j/stax/ext/WSSSecurityProperties.java>:[96,36]
cannot find symbol
symbol  : class KeyIdentifier
location: class org.apache.wss4j.stax.securityToken.WSSecurityTokenConstants
[ERROR] <https://builds.apache.org/job/wss4j-trunk/org.apache.wss4j$wss4j-ws-security-stax/ws/src/main/java/org/apache/wss4j/stax/ext/WSSSecurityProperties.java>:[174,35]
cannot find symbol
symbol  : class KeyIdentifier
location: class org.apache.wss4j.stax.securityToken.WSSecurityTokenConstants
[ERROR] <https://builds.apache.org/job/wss4j-trunk/org.apache.wss4j$wss4j-ws-security-stax/ws/src/main/java/org/apache/wss4j/stax/ext/WSSSecurityProperties.java>:[183,67]
cannot find symbol
symbol  : class KeyIdentifier
location: class org.apache.wss4j.stax.securityToken.WSSecurityTokenConstants
[ERROR] <https://builds.apache.org/job/wss4j-trunk/org.apache.wss4j$wss4j-ws-security-stax/ws/src/main/java/org/apache/wss4j/stax/ext/WSSSecurityProperties.java>:[260,35]
cannot find symbol
symbol  : class KeyIdentifier
location: class org.apache.wss4j.stax.securityToken.WSSecurityTokenConstants
[ERROR] <https://builds.apache.org/job/wss4j-trunk/org.apache.wss4j$wss4j-ws-security-stax/ws/src/main/java/org/apache/wss4j/stax/ext/WSSSecurityProperties.java>:[264,67]
cannot find symbol
symbol  : class KeyIdentifier
location: class org.apache.wss4j.stax.securityToken.WSSecurityTokenConstants
[ERROR] <https://builds.apache.org/job/wss4j-trunk/org.apache.wss4j$wss4j-ws-security-stax/ws/src/main/java/org/apache/wss4j/stax/ext/WSSConstants.java>:[286,24]
cannot find symbol
symbol  : class AlgorithmUsage
location: class org.apache.wss4j.stax.ext.WSSConstants
[ERROR] <https://builds.apache.org/job/wss4j-trunk/org.apache.wss4j$wss4j-ws-security-stax/ws/src/main/java/org/apache/wss4j/stax/ext/WSSConstants.java>:[287,24]
cannot find symbol
symbol  : class AlgorithmUsage
location: class org.apache.wss4j.stax.ext.WSSConstants
[ERROR] <https://builds.apache.org/job/wss4j-trunk/org.apache.wss4j$wss4j-ws-security-stax/ws/src/main/java/org/apache/wss4j/stax/ext/WSSConstants.java>:[288,24]
cannot find symbol
symbol  : class AlgorithmUsage
location: class org.apache.wss4j.stax.ext.WSSConstants
[ERROR] <https://builds.apache.org/job/wss4j-trunk/org.apache.wss4j$wss4j-ws-security-stax/ws/src/main/java/org/apache/wss4j/stax/ext/WSSConstants.java>:[289,24]
cannot find symbol
symbol  : class AlgorithmUsage
location: class org.apache.wss4j.stax.ext.WSSConstants
[ERROR] <https://builds.apache.org/job/wss4j-trunk/org.apache.wss4j$wss4j-ws-security-stax/ws/src/main/java/org/apache/wss4j/stax/ext/WSSConstants.java>:[290,24]
cannot find symbol
symbol  : class AlgorithmUsage
location: class org.apache.wss4j.stax.ext.WSSConstants
[ERROR] <https://builds.apache.org/job/wss4j-trunk/org.apache.wss4j$wss4j-ws-security-stax/ws/src/main/java/org/apache/wss4j/stax/ext/WSSConstants.java>:[291,24]
cannot find symbol
symbol  : class AlgorithmUsage
location: class org.apache.wss4j.stax.ext.WSSConstants
[ERROR] <https://builds.apache.org/job/wss4j-trunk/org.apache.wss4j$wss4j-ws-security-stax/ws/src/main/java/org/apache/wss4j/stax/impl/processor/output/EncryptedKeyOutputProcessor.java>:[35,49]
package org.apache.xml.security.stax.securityToken does not exist
[ERROR] <https://builds.apache.org/job/wss4j-trunk/org.apache.wss4j$wss4j-ws-security-stax/ws/src/main/java/org/apache/wss4j/stax/impl/processor/output/EncryptedKeyOutputProcessor.java>:[36,49]
package org.apache.xml.security.stax.securityToken does not exist
[ERROR] <https://builds.apache.org/job/wss4j-trunk/org.apache.wss4j$wss4j-ws-security-stax/ws/src/main/java/org/apache/wss4j/stax/impl/processor/output/EncryptedKeyOutputProcessor.java>:[153,22]
cannot find symbol
symbol  : class OutboundSecurityToken
location: class org.apache.wss4j.stax.impl.processor.output.EncryptedKeyOutputProcessor.FinalEncryptedKeyOutputProcessor
[ERROR] <https://builds.apache.org/job/wss4j-trunk/org.apache.wss4j$wss4j-ws-security-stax/ws/src/main/java/org/apache/wss4j/stax/impl/processor/output/EncryptedKeyOutputProcessor.java>:[155,41]
cannot find symbol
symbol  : class OutboundSecurityToken
location: class org.apache.wss4j.stax.impl.processor.output.EncryptedKeyOutputProcessor.FinalEncryptedKeyOutputProcessor
[ERROR] <https://builds.apache.org/job/wss4j-trunk/org.apache.wss4j$wss4j-ws-security-stax/ws/src/main/java/org/apache/wss4j/stax/impl/processor/output/EncryptedKeyOutputProcessor.java>:[312,16]
cannot find symbol
symbol  : class OutboundSecurityToken
location: class org.apache.wss4j.stax.impl.processor.output.EncryptedKeyOutputProcessor.FinalEncryptedKeyOutputProcessor
[ERROR] <https://builds.apache.org/job/wss4j-trunk/org.apache.wss4j$wss4j-ws-security-stax/ws/src/main/java/org/apache/wss4j/stax/impl/processor/output/EncryptedKeyOutputProcessor.java>:[313,40]
cannot find symbol
symbol  : class KeyIdentifier
location: class org.apache.wss4j.stax.securityToken.WSSecurityTokenConstants
[ERROR] <https://builds.apache.org/job/wss4j-trunk/org.apache.wss4j$wss4j-ws-security-stax/ws/src/main/java/org/apache/wss4j/stax/impl/securityToken/SecurityTokenReferenceImpl.java>:[28,49]
package org.apache.xml.security.stax.securityToken does not exist
[ERROR] <https://builds.apache.org/job/wss4j-trunk/org.apache.wss4j$wss4j-ws-security-stax/ws/src/main/java/org/apache/wss4j/stax/securityToken/SecurityTokenReference.java>:[22,49]
package org.apache.xml.security.stax.securityToken does not exist
[ERROR] <https://builds.apache.org/job/wss4j-trunk/org.apache.wss4j$wss4j-ws-security-stax/ws/src/main/java/org/apache/wss4j/stax/securityToken/SecurityTokenReference.java>:[26,48]
cannot find symbol
symbol: class SecurityToken
public interface SecurityTokenReference extends SecurityToken {
[ERROR] <https://builds.apache.org/job/wss4j-trunk/org.apache.wss4j$wss4j-ws-security-stax/ws/src/main/java/org/apache/wss4j/stax/impl/securityToken/SecurityTokenReferenceImpl.java>:[38,18]
cannot find symbol
symbol  : class InboundSecurityToken
location: class org.apache.wss4j.stax.impl.securityToken.SecurityTokenReferenceImpl
[ERROR] <https://builds.apache.org/job/wss4j-trunk/org.apache.wss4j$wss4j-ws-security-stax/ws/src/main/java/org/apache/wss4j/stax/impl/securityToken/SecurityTokenReferenceImpl.java>:[41,38]
cannot find symbol
symbol  : class InboundSecurityToken
location: class org.apache.wss4j.stax.impl.securityToken.SecurityTokenReferenceImpl
[ERROR] <https://builds.apache.org/job/wss4j-trunk/org.apache.wss4j$wss4j-ws-security-stax/ws/src/main/java/org/apache/wss4j/stax/impl/securityToken/SecurityTokenReferenceImpl.java>:[43,62]
cannot find symbol
symbol  : class KeyIdentifier
location: class org.apache.wss4j.stax.securityToken.WSSecurityTokenConstants
[ERROR] <https://builds.apache.org/job/wss4j-trunk/org.apache.wss4j$wss4j-ws-security-stax/ws/src/main/java/org/apache/wss4j/stax/impl/securityToken/SecurityTokenReferenceImpl.java>:[64,66]
cannot find symbol
symbol  : class AlgorithmUsage
location: class org.apache.xml.security.stax.ext.XMLSecurityConstants
[ERROR] <https://builds.apache.org/job/wss4j-trunk/org.apache.wss4j$wss4j-ws-security-stax/ws/src/main/java/org/apache/wss4j/stax/impl/securityToken/SecurityTokenReferenceImpl.java>:[75,75]
cannot find symbol
symbol  : class AlgorithmUsage
location: class org.apache.xml.security.stax.ext.XMLSecurityConstants
[ERROR] <https://builds.apache.org/job/wss4j-trunk/org.apache.wss4j$wss4j-ws-security-stax/ws/src/main/java/org/apache/wss4j/stax/impl/securityToken/SecurityTokenReferenceImpl.java>:[91,11]
cannot find symbol
symbol  : class InboundSecurityToken
location: class org.apache.wss4j.stax.impl.securityToken.SecurityTokenReferenceImpl
[ERROR] <https://builds.apache.org/job/wss4j-trunk/org.apache.wss4j$wss4j-ws-security-stax/ws/src/main/java/org/apache/wss4j/stax/impl/securityToken/SecurityTokenReferenceImpl.java>:[96,35]
cannot find symbol
symbol  : class TokenType
location: class org.apache.wss4j.stax.securityToken.WSSecurityTokenConstants
[ERROR] <https://builds.apache.org/job/wss4j-trunk/org.apache.wss4j$wss4j-ws-security-stax/ws/src/main/java/org/apache/wss4j/stax/impl/securityToken/X509DataSecurityTokenImpl.java>:[43,92]
cannot find symbol
symbol  : class KeyIdentifier
location: class org.apache.wss4j.stax.securityToken.WSSecurityTokenConstants
[ERROR] <https://builds.apache.org/job/wss4j-trunk/org.apache.wss4j$wss4j-ws-security-stax/ws/src/main/java/org/apache/wss4j/stax/securityEvent/KeyValueTokenSecurityEvent.java>:[24,66]
type org.apache.xml.security.stax.securityEvent.TokenSecurityEvent does not take parameters
[ERROR] <https://builds.apache.org/job/wss4j-trunk/org.apache.wss4j$wss4j-ws-security-stax/ws/src/main/java/org/apache/wss4j/stax/securityToken/SecureConversationSecurityToken.java>:[21,49]
package org.apache.xml.security.stax.securityToken does not exist
[ERROR] <https://builds.apache.org/job/wss4j-trunk/org.apache.wss4j$wss4j-ws-security-stax/ws/src/main/java/org/apache/wss4j/stax/securityToken/SecureConversationSecurityToken.java>:[23,57]
cannot find symbol
symbol: class SecurityToken
public interface SecureConversationSecurityToken extends SecurityToken {
[ERROR] <https://builds.apache.org/job/wss4j-trunk/org.apache.wss4j$wss4j-ws-security-stax/ws/src/main/java/org/apache/wss4j/stax/impl/securityToken/SecureConversationSecurityTokenImpl.java>:[31,71]
cannot find symbol
symbol  : class KeyIdentifier
location: class org.apache.wss4j.stax.securityToken.WSSecurityTokenConstants
[ERROR] <https://builds.apache.org/job/wss4j-trunk/org.apache.wss4j$wss4j-ws-security-stax/ws/src/main/java/org/apache/wss4j/stax/impl/securityToken/SecureConversationSecurityTokenImpl.java>:[36,35]
cannot find symbol
symbol  : class TokenType
location: class org.apache.wss4j.stax.securityToken.WSSecurityTokenConstants
[ERROR] <https://builds.apache.org/job/wss4j-trunk/org.apache.wss4j$wss4j-ws-security-stax/ws/src/main/java/org/apache/wss4j/stax/impl/securityToken/ECKeyValueSecurityTokenImpl.java>:[40,36]
cannot find symbol
symbol  : class KeyIdentifier
location: class org.apache.wss4j.stax.securityToken.WSSecurityTokenConstants
[ERROR] <https://builds.apache.org/job/wss4j-trunk/org.apache.wss4j$wss4j-ws-security-stax/ws/src/main/java/org/apache/wss4j/stax/impl/securityToken/X509PKIPathv1SecurityTokenImpl.java>:[44,69]
cannot find symbol
symbol  : class KeyIdentifier
location: class org.apache.wss4j.stax.securityToken.WSSecurityTokenConstants
[ERROR] <https://builds.apache.org/job/wss4j-trunk/org.apache.wss4j$wss4j-ws-security-stax/ws/src/main/java/org/apache/wss4j/stax/impl/securityToken/DsaKeyValueSecurityTokenImpl.java>:[40,36]
cannot find symbol
symbol  : class KeyIdentifier
location: class org.apache.wss4j.stax.securityToken.WSSecurityTokenConstants
[ERROR] <https://builds.apache.org/job/wss4j-trunk/org.apache.wss4j$wss4j-ws-security-stax/ws/src/main/java/org/apache/wss4j/stax/securityEvent/RelTokenSecurityEvent.java>:[22,49]
package org.apache.xml.security.stax.securityToken does not exist
[ERROR] <https://builds.apache.org/job/wss4j-trunk/org.apache.wss4j$wss4j-ws-security-stax/ws/src/main/java/org/apache/wss4j/stax/securityEvent/IssuedTokenSecurityEvent.java>:[23,49]
package org.apache.xml.security.stax.securityToken does not exist
[ERROR] <https://builds.apache.org/job/wss4j-trunk/org.apache.wss4j$wss4j-ws-security-stax/ws/src/main/java/org/apache/wss4j/stax/securityEvent/IssuedTokenSecurityEvent.java>:[25,98]
type org.apache.xml.security.stax.securityEvent.TokenSecurityEvent does not take parameters
[ERROR] <https://builds.apache.org/job/wss4j-trunk/org.apache.wss4j$wss4j-ws-security-stax/ws/src/main/java/org/apache/wss4j/stax/securityEvent/IssuedTokenSecurityEvent.java>:[25,57]
cannot find symbol
symbol: class SecurityToken
public abstract class IssuedTokenSecurityEvent<T extends SecurityToken> extends TokenSecurityEvent<T>
{
[ERROR] <https://builds.apache.org/job/wss4j-trunk/org.apache.wss4j$wss4j-ws-security-stax/ws/src/main/java/org/apache/wss4j/stax/securityEvent/RelTokenSecurityEvent.java>:[24,68]
cannot find symbol
symbol: class SecurityToken
public class RelTokenSecurityEvent extends IssuedTokenSecurityEvent<SecurityToken> {
[ERROR] <https://builds.apache.org/job/wss4j-trunk/org.apache.wss4j$wss4j-ws-security-stax/ws/src/main/java/org/apache/wss4j/stax/impl/processor/input/SecurityContextTokenInputHandler.java>:[33,49]
package org.apache.xml.security.stax.securityToken does not exist
[ERROR] <https://builds.apache.org/job/wss4j-trunk/org.apache.wss4j$wss4j-ws-security-stax/ws/src/main/java/org/apache/wss4j/stax/impl/processor/input/SecurityContextTokenInputHandler.java>:[34,49]
package org.apache.xml.security.stax.securityToken does not exist
[ERROR] <https://builds.apache.org/job/wss4j-trunk/org.apache.wss4j$wss4j-ws-security-stax/ws/src/main/java/org/apache/wss4j/stax/impl/processor/input/UsernameTokenInputHandler.java>:[44,49]
package org.apache.xml.security.stax.securityToken does not exist
[ERROR] <https://builds.apache.org/job/wss4j-trunk/org.apache.wss4j$wss4j-ws-security-stax/ws/src/main/java/org/apache/wss4j/stax/impl/processor/input/UsernameTokenInputHandler.java>:[45,49]
package org.apache.xml.security.stax.securityToken does not exist
[ERROR] <https://builds.apache.org/job/wss4j-trunk/org.apache.wss4j$wss4j-ws-security-stax/ws/src/main/java/org/apache/wss4j/stax/impl/processor/output/UsernameTokenOutputProcessor.java>:[34,49]
package org.apache.xml.security.stax.securityToken does not exist
[ERROR] <https://builds.apache.org/job/wss4j-trunk/org.apache.wss4j$wss4j-ws-security-stax/ws/src/main/java/org/apache/wss4j/stax/impl/processor/output/UsernameTokenOutputProcessor.java>:[35,49]
package org.apache.xml.security.stax.securityToken does not exist
[ERROR] <https://builds.apache.org/job/wss4j-trunk/org.apache.wss4j$wss4j-ws-security-stax/ws/src/main/java/org/apache/wss4j/stax/securityEvent/SecurityContextTokenSecurityEvent.java>:[22,49]
package org.apache.xml.security.stax.securityToken does not exist
[ERROR] <https://builds.apache.org/job/wss4j-trunk/org.apache.wss4j$wss4j-ws-security-stax/ws/src/main/java/org/apache/wss4j/stax/securityEvent/SecurityContextTokenSecurityEvent.java>:[24,80]
cannot find symbol
symbol: class SecurityToken
public class SecurityContextTokenSecurityEvent extends IssuedTokenSecurityEvent<SecurityToken>
{
[ERROR] <https://builds.apache.org/job/wss4j-trunk/org.apache.wss4j$wss4j-ws-security-stax/ws/src/main/java/org/apache/wss4j/stax/ext/OutboundWSSec.java>:[27,40]
cannot find symbol
symbol  : class OutboundSecurityContextImpl
location: package org.apache.xml.security.stax.impl
[ERROR] <https://builds.apache.org/job/wss4j-trunk/org.apache.wss4j$wss4j-ws-security-stax/ws/src/main/java/org/apache/wss4j/stax/securityToken/HttpsSecurityToken.java>:[22,49]
package org.apache.xml.security.stax.securityToken does not exist
[ERROR] <https://builds.apache.org/job/wss4j-trunk/org.apache.wss4j$wss4j-ws-security-stax/ws/src/main/java/org/apache/wss4j/stax/securityToken/HttpsSecurityToken.java>:[24,78]
cannot find symbol
symbol: class InboundSecurityToken
public interface HttpsSecurityToken extends SubjectAndPrincipalSecurityToken, InboundSecurityToken
{
[ERROR] <https://builds.apache.org/job/wss4j-trunk/org.apache.wss4j$wss4j-ws-security-stax/ws/src/main/java/org/apache/wss4j/stax/impl/securityToken/KerberosServiceSecurityTokenImpl.java>:[58,68]
cannot find symbol
symbol  : class KeyIdentifier
location: class org.apache.wss4j.stax.securityToken.WSSecurityTokenConstants
[ERROR] <https://builds.apache.org/job/wss4j-trunk/org.apache.wss4j$wss4j-ws-security-stax/ws/src/main/java/org/apache/wss4j/stax/impl/securityToken/KerberosServiceSecurityTokenImpl.java>:[71,35]
cannot find symbol
symbol  : class TokenType
location: class org.apache.wss4j.stax.securityToken.WSSecurityTokenConstants
[ERROR] <https://builds.apache.org/job/wss4j-trunk/org.apache.wss4j$wss4j-ws-security-stax/ws/src/main/java/org/apache/wss4j/stax/impl/securityToken/KerberosServiceSecurityTokenImpl.java>:[130,66]
cannot find symbol
symbol  : class AlgorithmUsage
location: class org.apache.xml.security.stax.ext.XMLSecurityConstants
[ERROR] <https://builds.apache.org/job/wss4j-trunk/org.apache.wss4j$wss4j-ws-security-stax/ws/src/main/java/org/apache/wss4j/stax/impl/securityToken/UsernameSecurityTokenImpl.java>:[60,61]
cannot find symbol
symbol  : class KeyIdentifier
location: class org.apache.wss4j.stax.securityToken.WSSecurityTokenConstants
[ERROR] <https://builds.apache.org/job/wss4j-trunk/org.apache.wss4j$wss4j-ws-security-stax/ws/src/main/java/org/apache/wss4j/stax/impl/securityToken/UsernameSecurityTokenImpl.java>:[78,66]
cannot find symbol
symbol  : class AlgorithmUsage
location: class org.apache.xml.security.stax.ext.XMLSecurityConstants
[ERROR] <https://builds.apache.org/job/wss4j-trunk/org.apache.wss4j$wss4j-ws-security-stax/ws/src/main/java/org/apache/wss4j/stax/impl/securityToken/UsernameSecurityTokenImpl.java>:[94,35]
cannot find symbol
symbol  : class TokenType
location: class org.apache.wss4j.stax.securityToken.WSSecurityTokenConstants
[ERROR] <https://builds.apache.org/job/wss4j-trunk/org.apache.wss4j$wss4j-ws-security-stax/ws/src/main/java/org/apache/wss4j/stax/validate/SamlTokenValidatorImpl.java>:[25,49]
package org.apache.xml.security.stax.securityToken does not exist
[INFO] 100 errors 
[INFO] -------------------------------------------------------------

---------------------------------------------------------------------
To unsubscribe, e-mail: dev-unsubscribe@ws.apache.org
For additional commands, e-mail: dev-help@ws.apache.org


Mime
View raw message