ws-dev mailing list archives

Site index · List index
Message view « Date » · « Thread »
Top « Date » · « Thread »
From Apache Jenkins Server <jenk...@builds.apache.org>
Subject Build failed in Jenkins: wss4j-trunk #486
Date Fri, 19 Apr 2013 02:45:51 GMT
See <https://builds.apache.org/job/wss4j-trunk/486/changes>

Changes:

[coheigea] Add the ability to turn off SAML Subject Confirmation validation via a property

[coheigea] Moved SAML Subject Confirmation Validation into WSS4J from CXF

------------------------------------------
[...truncated 940 lines...]
[INFO] Copying 0 resource
[INFO] skip non existing resourceDirectory <https://builds.apache.org/job/wss4j-trunk/ws/wss4j/policy/src/main/resources-filtered>
[INFO] skip non existing resourceDirectory <https://builds.apache.org/job/wss4j-trunk/ws/wss4j/policy/target/generated/src/main/resources>
[INFO] Copying 3 resources

[INFO] --- maven-resources-plugin:2.5:resources (default-resources) @ wss4j-policy ---
[INFO] [INFO] Changes detected - recompiling the module!
[INFO] Compiling 94 source files to <https://builds.apache.org/job/wss4j-trunk/ws/wss4j/policy/target/classes>

[INFO] --- maven-compiler-plugin:3.1:compile (default-compile) @ wss4j-policy ---
[debug] execute contextualize
[INFO] [INFO] Using 'UTF-8' encoding to copy filtered resources.
[INFO] Copying 0 resource

[INFO] --- maven-resources-plugin:2.5:testResources (default-testResources) @ wss4j-policy
---
[INFO] Copying 108 resources
[INFO] skip non existing resourceDirectory <https://builds.apache.org/job/wss4j-trunk/ws/wss4j/policy/target/generated/src/test/resources>
[INFO] Copying 3 resources
[INFO] [INFO] Changes detected - recompiling the module!
[INFO] Compiling 32 source files to <https://builds.apache.org/job/wss4j-trunk/ws/wss4j/policy/target/test-classes>

[INFO] --- maven-compiler-plugin:3.1:testCompile (default-testCompile) @ wss4j-policy ---
[INFO] [INFO] Surefire report directory: <https://builds.apache.org/job/wss4j-trunk/ws/wss4j/policy/target/surefire-reports>

-------------------------------------------------------
 T E S T S
-------------------------------------------------------

[INFO] --- maven-surefire-plugin:2.12:test (default-test) @ wss4j-policy ---
Running org.apache.wss4j.policy.tests.EncryptedPartsTest
Tests run: 2, Failures: 0, Errors: 0, Skipped: 0, Time elapsed: 0.236 sec
Running org.apache.wss4j.policy.tests.RecipientTokenTest
Tests run: 1, Failures: 0, Errors: 0, Skipped: 0, Time elapsed: 0.015 sec
Running org.apache.wss4j.policy.tests.SupportingTokensTest
Tests run: 1, Failures: 0, Errors: 0, Skipped: 0, Time elapsed: 0.032 sec
Running org.apache.wss4j.policy.tests.SignedElementsTest
Tests run: 2, Failures: 0, Errors: 0, Skipped: 0, Time elapsed: 0.027 sec
Running org.apache.wss4j.policy.tests.TransportBindingTest
Tests run: 1, Failures: 0, Errors: 0, Skipped: 0, Time elapsed: 0.019 sec
Running org.apache.wss4j.policy.tests.SymmetricBindingTest
Tests run: 1, Failures: 0, Errors: 0, Skipped: 0, Time elapsed: 0.028 sec
Running org.apache.wss4j.policy.tests.Wss11Test
Tests run: 1, Failures: 0, Errors: 0, Skipped: 0, Time elapsed: 0.014 sec
Running org.apache.wss4j.policy.tests.KeyValueTokenTest
Tests run: 1, Failures: 0, Errors: 0, Skipped: 0, Time elapsed: 0.01 sec
Running org.apache.wss4j.policy.tests.X509TokenTest
Tests run: 1, Failures: 0, Errors: 0, Skipped: 0, Time elapsed: 0.013 sec
Running org.apache.wss4j.policy.tests.KerberosTokenTest
Tests run: 1, Failures: 0, Errors: 0, Skipped: 0, Time elapsed: 0.01 sec
Running org.apache.wss4j.policy.tests.AlgorithmSuiteTest
Tests run: 1, Failures: 0, Errors: 0, Skipped: 0, Time elapsed: 0.01 sec
Running org.apache.wss4j.policy.tests.SignedPartsTest
Tests run: 2, Failures: 0, Errors: 0, Skipped: 0, Time elapsed: 0.02 sec
Running org.apache.wss4j.policy.tests.SamlTokenTest
Tests run: 1, Failures: 0, Errors: 0, Skipped: 0, Time elapsed: 0.013 sec
Running org.apache.wss4j.policy.tests.EncryptedElementsTest
Tests run: 1, Failures: 0, Errors: 0, Skipped: 0, Time elapsed: 0.009 sec
Running org.apache.wss4j.policy.tests.PolicyNormalizationTest
Tests run: 1, Failures: 0, Errors: 0, Skipped: 0, Time elapsed: 0.31 sec
Running org.apache.wss4j.policy.tests.ContentEncryptedElementsTest
Tests run: 1, Failures: 0, Errors: 0, Skipped: 0, Time elapsed: 0.009 sec
Running org.apache.wss4j.policy.tests.SecureConversationTokenTest
Tests run: 1, Failures: 0, Errors: 0, Skipped: 0, Time elapsed: 0.014 sec
Running org.apache.wss4j.policy.tests.RequiredPartsTest
Tests run: 1, Failures: 0, Errors: 0, Skipped: 0, Time elapsed: 0.007 sec
Running org.apache.wss4j.policy.tests.Trust13Test
Tests run: 2, Failures: 0, Errors: 0, Skipped: 0, Time elapsed: 0.022 sec
Running org.apache.wss4j.policy.tests.InitiatorTokenTest
Tests run: 1, Failures: 0, Errors: 0, Skipped: 0, Time elapsed: 0.009 sec
Running org.apache.wss4j.policy.tests.HttpsTokenTest
Tests run: 1, Failures: 0, Errors: 0, Skipped: 0, Time elapsed: 0.006 sec
Running org.apache.wss4j.policy.tests.Trust10Test
Tests run: 1, Failures: 0, Errors: 0, Skipped: 0, Time elapsed: 0.009 sec
Running org.apache.wss4j.policy.tests.SecurityContextTokenTest
Tests run: 1, Failures: 0, Errors: 0, Skipped: 0, Time elapsed: 0.008 sec
Running org.apache.wss4j.policy.tests.RequiredElementsTest
Tests run: 1, Failures: 0, Errors: 0, Skipped: 0, Time elapsed: 0.008 sec
Running org.apache.wss4j.policy.tests.SpnegoContextTokenTest
Tests run: 1, Failures: 0, Errors: 0, Skipped: 0, Time elapsed: 0.009 sec
Running org.apache.wss4j.policy.tests.Wss10Test
Tests run: 1, Failures: 0, Errors: 0, Skipped: 0, Time elapsed: 0.008 sec
Running org.apache.wss4j.policy.tests.LayoutTest
Tests run: 1, Failures: 0, Errors: 0, Skipped: 0, Time elapsed: 0.007 sec
Running org.apache.wss4j.policy.tests.AsymmetricBindingTest
Tests run: 1, Failures: 0, Errors: 0, Skipped: 0, Time elapsed: 0.019 sec
Running org.apache.wss4j.policy.tests.UsernameTokenTest
Tests run: 2, Failures: 0, Errors: 0, Skipped: 0, Time elapsed: 0.018 sec
Running org.apache.wss4j.policy.tests.IssuedTokenTest
Tests run: 1, Failures: 0, Errors: 0, Skipped: 0, Time elapsed: 0.008 sec
Running org.apache.wss4j.policy.tests.RelTokenTest
Tests run: 1, Failures: 0, Errors: 0, Skipped: 0, Time elapsed: 0.008 sec

Results :

Tests run: 36, Failures: 0, Errors: 0, Skipped: 0

[JENKINS] Recording test results
[INFO] 
[INFO] --- maven-jar-plugin:2.4:jar (default-jar) @ wss4j-policy ---
[INFO] Building jar: <https://builds.apache.org/job/wss4j-trunk/ws/wss4j/policy/target/wss4j-policy-2.0-SNAPSHOT.jar>
[INFO] 
[INFO] --- maven-site-plugin:3.1:attach-descriptor (attach-descriptor) @ wss4j-policy ---
[INFO] 
[INFO] --- maven-pmd-plugin:2.7.1:pmd (pmd) @ wss4j-policy ---
[INFO] [INFO] 

[INFO] --- maven-pmd-plugin:2.7.1:check (validate) @ wss4j-policy ---
Apr 19, 2013 2:45:16 AM hudson.maven.ExecutedMojo <init>
WARNING: Failed to getClass for org.apache.maven.plugin.source.SourceJarMojo
[INFO] 
[INFO] --- maven-source-plugin:2.2.1:jar (default) @ wss4j-policy ---
[INFO] Building jar: <https://builds.apache.org/job/wss4j-trunk/ws/wss4j/policy/target/wss4j-policy-2.0-SNAPSHOT-sources.jar>
[INFO] [INFO] Installing <https://builds.apache.org/job/wss4j-trunk/ws/wss4j/policy/target/wss4j-policy-2.0-SNAPSHOT.jar>
to /home/jenkins/jenkins-slave/maven-repositories/1/org/apache/wss4j/wss4j-policy/2.0-SNAPSHOT/wss4j-policy-2.0-SNAPSHOT.jar

[INFO] --- maven-install-plugin:2.3.1:install (default-install) @ wss4j-policy ---
[INFO] Installing <https://builds.apache.org/job/wss4j-trunk/ws/wss4j/policy/pom.xml>
to /home/jenkins/jenkins-slave/maven-repositories/1/org/apache/wss4j/wss4j-policy/2.0-SNAPSHOT/wss4j-policy-2.0-SNAPSHOT.pom
[INFO] Installing <https://builds.apache.org/job/wss4j-trunk/ws/wss4j/policy/target/wss4j-policy-2.0-SNAPSHOT-sources.jar>
to /home/jenkins/jenkins-slave/maven-repositories/1/org/apache/wss4j/wss4j-policy/2.0-SNAPSHOT/wss4j-policy-2.0-SNAPSHOT-sources.jar
[INFO] 
[INFO] --- maven-pmd-plugin:2.7.1:pmd (pmd) @ wss4j-policy ---
[INFO] ------------------------------------------------------------------------
[INFO] Reactor Summary:
[INFO] 
[INFO] Apache WSS4J ...................................... SUCCESS [34.587s]
[INFO] Apache WSS4J parent ............................... SUCCESS [6.696s]
[INFO] Apache WSS4J WSU 1.0 Binding ...................... SUCCESS [20.532s]
[INFO] Apache WSS4J WS-Security 1.0 Binding .............. SUCCESS [14.003s]
[INFO] Apache WSS4J WS-Security 1.1 Binding .............. SUCCESS [14.074s]
[INFO] Apache WSS4J WS-SecureConversation binding ........ SUCCESS [18.027s]
[INFO] Apache WSS4J Bindings ............................. SUCCESS [5.290s]
[INFO] Apache WSS4J WS-SecurityPolicy model .............. FAILURE [45.713s]
[INFO] Apache WSS4J WS-Security Common ................... SKIPPED
[INFO] Apache WSS4J DOM WS-Security ...................... SKIPPED
[INFO] Apache WSS4J Streaming WS-Security ................ SKIPPED
[INFO] Apache WSS4J WS-Security Integration .............. SKIPPED
[INFO] Apache WSS4J Streaming WS-SecurityPolicy .......... SKIPPED
[INFO] ------------------------------------------------------------------------
[INFO] BUILD FAILURE
[INFO] ------------------------------------------------------------------------
[INFO] Total time: 2:43.689s
[INFO] Finished at: Fri Apr 19 02:45:26 UTC 2013
[INFO] Final Memory: 26M/62M
[INFO] ------------------------------------------------------------------------
[JENKINS] Archiving <https://builds.apache.org/job/wss4j-trunk/ws/wss4j/bindings/wsu10-binding/pom.xml>
to /home/hudson/hudson/jobs/wss4j-trunk/modules/org.apache.wss4j$wss4j-bindings-wsu10/builds/2013-04-19_02-42-19/archive/org.apache.wss4j/wss4j-bindings-wsu10/2.0-SNAPSHOT/wss4j-bindings-wsu10-2.0-SNAPSHOT.pom
[JENKINS] Archiving <https://builds.apache.org/job/wss4j-trunk/ws/wss4j/bindings/wsu10-binding/target/wss4j-bindings-wsu10-2.0-SNAPSHOT.jar>
to /home/hudson/hudson/jobs/wss4j-trunk/modules/org.apache.wss4j$wss4j-bindings-wsu10/builds/2013-04-19_02-42-19/archive/org.apache.wss4j/wss4j-bindings-wsu10/2.0-20130419.024344-55/wss4j-bindings-wsu10-2.0-20130419.024344-55.jar
[JENKINS] Archiving <https://builds.apache.org/job/wss4j-trunk/ws/wss4j/bindings/wsu10-binding/target/wss4j-bindings-wsu10-2.0-SNAPSHOT-sources.jar>
to /home/hudson/hudson/jobs/wss4j-trunk/modules/org.apache.wss4j$wss4j-bindings-wsu10/builds/2013-04-19_02-42-19/archive/org.apache.wss4j/wss4j-bindings-wsu10/2.0-20130419.024344-55/wss4j-bindings-wsu10-2.0-20130419.024344-55-sources.jar
[JENKINS] Archiving <https://builds.apache.org/job/wss4j-trunk/ws/wss4j/parent/pom.xml>
to /home/hudson/hudson/jobs/wss4j-trunk/modules/org.apache.wss4j$wss4j-parent/builds/2013-04-19_02-42-19/archive/org.apache.wss4j/wss4j-parent/2.0-SNAPSHOT/wss4j-parent-2.0-SNAPSHOT.pom
[JENKINS] Archiving <https://builds.apache.org/job/wss4j-trunk/ws/wss4j/bindings/wssc-binding/pom.xml>
to /home/hudson/hudson/jobs/wss4j-trunk/modules/org.apache.wss4j$wss4j-bindings-wssc/builds/2013-04-19_02-42-19/archive/org.apache.wss4j/wss4j-bindings-wssc/2.0-SNAPSHOT/wss4j-bindings-wssc-2.0-SNAPSHOT.pom
[JENKINS] Archiving <https://builds.apache.org/job/wss4j-trunk/ws/wss4j/bindings/wssc-binding/target/wss4j-bindings-wssc-2.0-SNAPSHOT.jar>
to /home/hudson/hudson/jobs/wss4j-trunk/modules/org.apache.wss4j$wss4j-bindings-wssc/builds/2013-04-19_02-42-19/archive/org.apache.wss4j/wss4j-bindings-wssc/2.0-20130419.024431-55/wss4j-bindings-wssc-2.0-20130419.024431-55.jar
[JENKINS] Archiving <https://builds.apache.org/job/wss4j-trunk/ws/wss4j/bindings/wssc-binding/target/wss4j-bindings-wssc-2.0-SNAPSHOT-sources.jar>
to /home/hudson/hudson/jobs/wss4j-trunk/modules/org.apache.wss4j$wss4j-bindings-wssc/builds/2013-04-19_02-42-19/archive/org.apache.wss4j/wss4j-bindings-wssc/2.0-20130419.024431-55/wss4j-bindings-wssc-2.0-20130419.024431-55-sources.jar
[JENKINS] Archiving <https://builds.apache.org/job/wss4j-trunk/ws/wss4j/ws-security-common/pom.xml>
to /home/hudson/hudson/jobs/wss4j-trunk/modules/org.apache.wss4j$wss4j-ws-security-common/builds/2013-04-19_02-42-19/archive/org.apache.wss4j/wss4j-ws-security-common/2.0-SNAPSHOT/wss4j-ws-security-common-2.0-SNAPSHOT.pom
[JENKINS] Archiving <https://builds.apache.org/job/wss4j-trunk/ws/wss4j/ws-security-policy-stax/pom.xml>
to /home/hudson/hudson/jobs/wss4j-trunk/modules/org.apache.wss4j$wss4j-ws-security-policy-stax/builds/2013-04-19_02-42-20/archive/org.apache.wss4j/wss4j-ws-security-policy-stax/2.0-SNAPSHOT/wss4j-ws-security-policy-stax-2.0-SNAPSHOT.pom
[JENKINS] Archiving <https://builds.apache.org/job/wss4j-trunk/ws/wss4j/ws-security-stax/pom.xml>
to /home/hudson/hudson/jobs/wss4j-trunk/modules/org.apache.wss4j$wss4j-ws-security-stax/builds/2013-04-19_02-42-20/archive/org.apache.wss4j/wss4j-ws-security-stax/2.0-SNAPSHOT/wss4j-ws-security-stax-2.0-SNAPSHOT.pom
[JENKINS] Archiving <https://builds.apache.org/job/wss4j-trunk/ws/wss4j/pom.xml> to
/home/hudson/hudson/jobs/wss4j-trunk/modules/org.apache.wss4j$wss4j/builds/2013-04-19_02-42-19/archive/org.apache.wss4j/wss4j/2.0-SNAPSHOT/wss4j-2.0-SNAPSHOT.pom
[JENKINS] Archiving <https://builds.apache.org/job/wss4j-trunk/ws/wss4j/policy/pom.xml>
to /home/hudson/hudson/jobs/wss4j-trunk/modules/org.apache.wss4j$wss4j-policy/builds/2013-04-19_02-42-19/archive/org.apache.wss4j/wss4j-policy/2.0-SNAPSHOT/wss4j-policy-2.0-SNAPSHOT.pom
[JENKINS] Archiving <https://builds.apache.org/job/wss4j-trunk/ws/wss4j/policy/target/wss4j-policy-2.0-SNAPSHOT.jar>
to /home/hudson/hudson/jobs/wss4j-trunk/modules/org.apache.wss4j$wss4j-policy/builds/2013-04-19_02-42-19/archive/org.apache.wss4j/wss4j-policy/2.0-SNAPSHOT/wss4j-policy-2.0-SNAPSHOT.jar
[JENKINS] Archiving <https://builds.apache.org/job/wss4j-trunk/ws/wss4j/policy/target/wss4j-policy-2.0-SNAPSHOT-sources.jar>
to /home/hudson/hudson/jobs/wss4j-trunk/modules/org.apache.wss4j$wss4j-policy/builds/2013-04-19_02-42-19/archive/org.apache.wss4j/wss4j-policy/2.0-SNAPSHOT/wss4j-policy-2.0-SNAPSHOT-sources.jar
[JENKINS] Archiving <https://builds.apache.org/job/wss4j-trunk/ws/wss4j/integration/pom.xml>
to /home/hudson/hudson/jobs/wss4j-trunk/modules/org.apache.wss4j$integration/builds/2013-04-19_02-42-20/archive/org.apache.wss4j/integration/2.0-SNAPSHOT/integration-2.0-SNAPSHOT.pom
[JENKINS] Archiving <https://builds.apache.org/job/wss4j-trunk/ws/wss4j/bindings/pom.xml>
to /home/hudson/hudson/jobs/wss4j-trunk/modules/org.apache.wss4j$wss4j-bindings/builds/2013-04-19_02-42-19/archive/org.apache.wss4j/wss4j-bindings/2.0-SNAPSHOT/wss4j-bindings-2.0-SNAPSHOT.pom
[JENKINS] Archiving <https://builds.apache.org/job/wss4j-trunk/ws/wss4j/bindings/wss10-binding/pom.xml>
to /home/hudson/hudson/jobs/wss4j-trunk/modules/org.apache.wss4j$wss4j-bindings-wss10/builds/2013-04-19_02-42-19/archive/org.apache.wss4j/wss4j-bindings-wss10/2.0-SNAPSHOT/wss4j-bindings-wss10-2.0-SNAPSHOT.pom
[JENKINS] Archiving <https://builds.apache.org/job/wss4j-trunk/ws/wss4j/bindings/wss10-binding/target/wss4j-bindings-wss10-2.0-SNAPSHOT.jar>
to /home/hudson/hudson/jobs/wss4j-trunk/modules/org.apache.wss4j$wss4j-bindings-wss10/builds/2013-04-19_02-42-19/archive/org.apache.wss4j/wss4j-bindings-wss10/2.0-20130419.024359-55/wss4j-bindings-wss10-2.0-20130419.024359-55.jar
[JENKINS] Archiving <https://builds.apache.org/job/wss4j-trunk/ws/wss4j/bindings/wss10-binding/target/wss4j-bindings-wss10-2.0-SNAPSHOT-sources.jar>
to /home/hudson/hudson/jobs/wss4j-trunk/modules/org.apache.wss4j$wss4j-bindings-wss10/builds/2013-04-19_02-42-19/archive/org.apache.wss4j/wss4j-bindings-wss10/2.0-20130419.024359-55/wss4j-bindings-wss10-2.0-20130419.024359-55-sources.jar
[JENKINS] Archiving <https://builds.apache.org/job/wss4j-trunk/ws/wss4j/ws-security-dom/pom.xml>
to /home/hudson/hudson/jobs/wss4j-trunk/modules/org.apache.wss4j$wss4j-ws-security-dom/builds/2013-04-19_02-42-19/archive/org.apache.wss4j/wss4j-ws-security-dom/2.0-SNAPSHOT/wss4j-ws-security-dom-2.0-SNAPSHOT.pom
[JENKINS] Archiving <https://builds.apache.org/job/wss4j-trunk/ws/wss4j/bindings/wss11-binding/pom.xml>
to /home/hudson/hudson/jobs/wss4j-trunk/modules/org.apache.wss4j$wss4j-bindings-wss11/builds/2013-04-19_02-42-19/archive/org.apache.wss4j/wss4j-bindings-wss11/2.0-SNAPSHOT/wss4j-bindings-wss11-2.0-SNAPSHOT.pom
[JENKINS] Archiving <https://builds.apache.org/job/wss4j-trunk/ws/wss4j/bindings/wss11-binding/target/wss4j-bindings-wss11-2.0-SNAPSHOT.jar>
to /home/hudson/hudson/jobs/wss4j-trunk/modules/org.apache.wss4j$wss4j-bindings-wss11/builds/2013-04-19_02-42-19/archive/org.apache.wss4j/wss4j-bindings-wss11/2.0-20130419.024413-55/wss4j-bindings-wss11-2.0-20130419.024413-55.jar
[JENKINS] Archiving <https://builds.apache.org/job/wss4j-trunk/ws/wss4j/bindings/wss11-binding/target/wss4j-bindings-wss11-2.0-SNAPSHOT-sources.jar>
to /home/hudson/hudson/jobs/wss4j-trunk/modules/org.apache.wss4j$wss4j-bindings-wss11/builds/2013-04-19_02-42-19/archive/org.apache.wss4j/wss4j-bindings-wss11/2.0-20130419.024413-55/wss4j-bindings-wss11-2.0-20130419.024413-55-sources.jar
[WARNING] The requested profile "deploy" could not be activated because it does not exist.
Waiting for Jenkins to finish collecting data
mavenExecutionResult exceptions not empty
message : Internal error: java.lang.reflect.UndeclaredThrowableException
cause : null
Stack trace : 
org.apache.maven.InternalErrorException: Internal error: java.lang.reflect.UndeclaredThrowableException
	at org.apache.maven.lifecycle.internal.BuilderCommon.handleBuildError(BuilderCommon.java:128)
	at org.apache.maven.lifecycle.internal.LifecycleModuleBuilder.buildProject(LifecycleModuleBuilder.java:95)
	at org.apache.maven.lifecycle.internal.LifecycleModuleBuilder.buildProject(LifecycleModuleBuilder.java:59)
	at org.apache.maven.lifecycle.internal.LifecycleStarter.singleThreadedBuild(LifecycleStarter.java:183)
	at org.apache.maven.lifecycle.internal.LifecycleStarter.execute(LifecycleStarter.java:161)
	at org.apache.maven.DefaultMaven.doExecute(DefaultMaven.java:320)
	at org.apache.maven.DefaultMaven.execute(DefaultMaven.java:156)
	at org.jvnet.hudson.maven3.launcher.Maven3Launcher.main(Maven3Launcher.java:79)
	at sun.reflect.NativeMethodAccessorImpl.invoke0(Native Method)
	at sun.reflect.NativeMethodAccessorImpl.invoke(NativeMethodAccessorImpl.java:39)
	at sun.reflect.DelegatingMethodAccessorImpl.invoke(DelegatingMethodAccessorImpl.java:25)
	at java.lang.reflect.Method.invoke(Method.java:597)
	at org.codehaus.plexus.classworlds.launcher.Launcher.launchStandard(Launcher.java:329)
	at org.codehaus.plexus.classworlds.launcher.Launcher.launch(Launcher.java:239)
	at org.jvnet.hudson.maven3.agent.Maven3Main.launch(Maven3Main.java:158)
	at hudson.maven.Maven3Builder.call(Maven3Builder.java:100)
	at hudson.maven.Maven3Builder.call(Maven3Builder.java:66)
	at hudson.remoting.UserRequest.perform(UserRequest.java:118)
	at hudson.remoting.UserRequest.perform(UserRequest.java:48)
	at hudson.remoting.Request$2.run(Request.java:326)
	at hudson.remoting.InterceptingExecutorService$1.call(InterceptingExecutorService.java:72)
	at java.util.concurrent.FutureTask$Sync.innerRun(FutureTask.java:303)
	at java.util.concurrent.FutureTask.run(FutureTask.java:138)
	at java.util.concurrent.ThreadPoolExecutor$Worker.runTask(ThreadPoolExecutor.java:886)
	at java.util.concurrent.ThreadPoolExecutor$Worker.run(ThreadPoolExecutor.java:908)
	at java.lang.Thread.run(Thread.java:619)
Caused by: java.lang.reflect.UndeclaredThrowableException
	at $Proxy2.setExecutedMojos(Unknown Source)
	at hudson.maven.MavenBuildProxy$Filter.setExecutedMojos(MavenBuildProxy.java:243)
	at hudson.maven.Maven3Builder$MavenExecutionListener.recordMojoEnded(Maven3Builder.java:439)
	at hudson.maven.Maven3Builder$MavenExecutionListener.mojoSucceeded(Maven3Builder.java:425)
	at org.apache.maven.lifecycle.internal.DefaultExecutionEventCatapult.fire(DefaultExecutionEventCatapult.java:87)
	at org.apache.maven.lifecycle.internal.DefaultExecutionEventCatapult.fire(DefaultExecutionEventCatapult.java:42)
	at org.apache.maven.lifecycle.internal.MojoExecutor.execute(MojoExecutor.java:228)
	at org.apache.maven.lifecycle.internal.MojoExecutor.execute(MojoExecutor.java:153)
	at org.apache.maven.lifecycle.internal.MojoExecutor.execute(MojoExecutor.java:145)
	at org.apache.maven.lifecycle.internal.MojoExecutor.executeForkedExecutions(MojoExecutor.java:365)
	at org.apache.maven.lifecycle.internal.MojoExecutor.execute(MojoExecutor.java:199)
	at org.apache.maven.lifecycle.internal.MojoExecutor.execute(MojoExecutor.java:153)
	at org.apache.maven.lifecycle.internal.MojoExecutor.execute(MojoExecutor.java:145)
	at org.apache.maven.lifecycle.internal.LifecycleModuleBuilder.buildProject(LifecycleModuleBuilder.java:84)
	... 24 more
Caused by: java.io.StreamCorruptedException: invalid type code: 6A
	at java.io.ObjectInputStream.readObject0(ObjectInputStream.java:1374)
	at java.io.ObjectInputStream.defaultReadFields(ObjectInputStream.java:1970)
	at java.io.ObjectInputStream.readSerialData(ObjectInputStream.java:1894)
	at java.io.ObjectInputStream.readOrdinaryObject(ObjectInputStream.java:1777)
	at java.io.ObjectInputStream.readObject0(ObjectInputStream.java:1347)
	at java.io.ObjectInputStream.readArray(ObjectInputStream.java:1685)
	at java.io.ObjectInputStream.readObject0(ObjectInputStream.java:1341)
	at java.io.ObjectInputStream.defaultReadFields(ObjectInputStream.java:1970)
	at java.io.ObjectInputStream.defaultReadObject(ObjectInputStream.java:498)
	at java.lang.Throwable.readObject(Throwable.java:913)
	at sun.reflect.GeneratedMethodAccessor80697.invoke(Unknown Source)
	at sun.reflect.DelegatingMethodAccessorImpl.invoke(DelegatingMethodAccessorImpl.java:43)
	at java.lang.reflect.Method.invoke(Method.java:601)
	at java.io.ObjectStreamClass.invokeReadObject(ObjectStreamClass.java:1004)
	at java.io.ObjectInputStream.readSerialData(ObjectInputStream.java:1872)
	at java.io.ObjectInputStream.readOrdinaryObject(ObjectInputStream.java:1777)
	at java.io.ObjectInputStream.readObject0(ObjectInputStream.java:1347)
	at java.io.ObjectInputStream.defaultReadFields(ObjectInputStream.java:1970)
	at java.io.ObjectInputStream.readSerialData(ObjectInputStream.java:1894)
	at java.io.ObjectInputStream.readOrdinaryObject(ObjectInputStream.java:1777)
	at java.io.ObjectInputStream.readObject0(ObjectInputStream.java:1347)
	at java.io.ObjectInputStream.readObject(ObjectInputStream.java:369)
	at hudson.remoting.UserRequest.deserialize(UserRequest.java:182)
	at hudson.remoting.UserRequest.perform(UserRequest.java:98)
	at hudson.remoting.UserRequest.perform(UserRequest.java:48)
	at hudson.remoting.Request$2.run(Request.java:326)
	at hudson.remoting.InterceptingExecutorService$1.call(InterceptingExecutorService.java:72)
	at java.util.concurrent.FutureTask$Sync.innerRun(FutureTask.java:334)
	at java.util.concurrent.FutureTask.run(FutureTask.java:166)
	at java.util.concurrent.ThreadPoolExecutor.runWorker(ThreadPoolExecutor.java:1145)
	at java.util.concurrent.ThreadPoolExecutor$Worker.run(ThreadPoolExecutor.java:615)
	at java.lang.Thread.run(Thread.java:722)
Sending e-mails to: dev@ws.apache.org
channel stopped

---------------------------------------------------------------------
To unsubscribe, e-mail: dev-unsubscribe@ws.apache.org
For additional commands, e-mail: dev-help@ws.apache.org


Mime
View raw message