ws-dev mailing list archives

Site index · List index
Message view « Date » · « Thread »
Top « Date » · « Thread »
From Apache Jenkins Server <jenk...@builds.apache.org>
Subject Build failed in Jenkins: wss4j-trunk #576
Date Wed, 31 Jul 2013 15:59:04 GMT
See <https://builds.apache.org/job/wss4j-trunk/576/changes>

Changes:

[giger] WSS-472 - Incorrect Symmetric Key Derivation Length validation

------------------------------------------
[...truncated 954 lines...]
Running org.apache.wss4j.policy.tests.RelTokenTest
Tests run: 1, Failures: 0, Errors: 0, Skipped: 0, Time elapsed: 0.009 sec

Results :

Tests run: 36, Failures: 0, Errors: 0, Skipped: 0

[JENKINS] Recording test results
[INFO] [jar:jar {execution: default-jar}]
[INFO] Building jar: <https://builds.apache.org/job/wss4j-trunk/ws/wss4j/policy/target/wss4j-policy-2.0-SNAPSHOT.jar>
[INFO] Preparing source:jar
[WARNING] Removing: jar from forked lifecycle, to prevent recursive invocation.
[WARNING] Removing: check from forked lifecycle, to prevent recursive invocation.
[JENKINS] Archiving <https://builds.apache.org/job/wss4j-trunk/ws/wss4j/policy/target/wss4j-policy-2.0-SNAPSHOT.jar>
to /home/hudson/hudson/jobs/wss4j-trunk/modules/org.apache.wss4j$wss4j-policy/builds/2013-07-31_15-53-37/archive/org.apache.wss4j/wss4j-policy/2.0-SNAPSHOT/wss4j-policy-2.0-SNAPSHOT.jar
[INFO] [bundle:cleanVersions {execution: versions}]
ERROR: Could not find local repository for 2.2.1
[INFO] [source:jar {execution: default}]
[INFO] Building jar: <https://builds.apache.org/job/wss4j-trunk/ws/wss4j/policy/target/wss4j-policy-2.0-SNAPSHOT-sources.jar>
[INFO] [install:install {execution: default-install}]
[INFO] Installing <https://builds.apache.org/job/wss4j-trunk/ws/wss4j/policy/target/wss4j-policy-2.0-SNAPSHOT.jar>
to /home/jenkins/jenkins-slave/maven-repositories/1/org/apache/wss4j/wss4j-policy/2.0-SNAPSHOT/wss4j-policy-2.0-SNAPSHOT.jar
[INFO] Installing <https://builds.apache.org/job/wss4j-trunk/ws/wss4j/policy/target/wss4j-policy-2.0-SNAPSHOT-sources.jar>
to /home/jenkins/jenkins-slave/maven-repositories/1/org/apache/wss4j/wss4j-policy/2.0-SNAPSHOT/wss4j-policy-2.0-SNAPSHOT-sources.jar
[INFO] Preparing pmd:check
[JENKINS] Archiving <https://builds.apache.org/job/wss4j-trunk/ws/wss4j/policy/target/wss4j-policy-2.0-SNAPSHOT-sources.jar>
to /home/hudson/hudson/jobs/wss4j-trunk/modules/org.apache.wss4j$wss4j-policy/builds/2013-07-31_15-53-37/archive/org.apache.wss4j/wss4j-policy/2.0-SNAPSHOT/wss4j-policy-2.0-SNAPSHOT-sources.jar
[INFO] [pmd:pmd {execution: pmd}]
ERROR: Could not find local repository for 2.2.1
[INFO] [pmd:check {execution: validate}]
[INFO] 
[INFO] [bundle:cleanVersions {execution: versions}]
[WARNING] The parameter expression: 'project.build.resources' used in mojo: 'process' has
been deprecated. Use 'project.resources' instead.
[INFO] [remote-resources:process {execution: default}]
[debug] execute contextualize
[INFO] [resources:resources {execution: default-resources}]
[INFO] Using 'UTF-8' encoding to copy filtered resources.
[INFO] Copying 0 resource
[INFO] Copying 0 resource
[INFO] skip non existing resourceDirectory <https://builds.apache.org/job/wss4j-trunk/ws/wss4j/policy/src/main/resources-filtered>
[INFO] skip non existing resourceDirectory <https://builds.apache.org/job/wss4j-trunk/ws/wss4j/policy/target/generated/src/main/resources>
[INFO] Copying 3 resources
[INFO] Copying 3 resources
[INFO] [compiler:compile {execution: default-compile}]
[INFO] Nothing to compile - all classes are up to date
[INFO] [bundle:manifest {execution: bundle-manifest}]
[debug] execute contextualize
[INFO] [resources:testResources {execution: default-testResources}]
[INFO] Using 'UTF-8' encoding to copy filtered resources.
[INFO] Copying 0 resource
[INFO] Copying 108 resources
[INFO] skip non existing resourceDirectory <https://builds.apache.org/job/wss4j-trunk/ws/wss4j/policy/target/generated/src/test/resources>
[INFO] Copying 3 resources
[INFO] Copying 3 resources
[INFO] [compiler:testCompile {execution: default-testCompile}]
[INFO] Nothing to compile - all classes are up to date
[INFO] [surefire:test {execution: default-test}]
[INFO] Skipping execution of surefire because it has already been run for this configuration
[JENKINS] Recording test results
[INFO] [jar:jar {execution: default-jar}]
[INFO] Building jar: <https://builds.apache.org/job/wss4j-trunk/ws/wss4j/policy/target/wss4j-policy-2.0-SNAPSHOT.jar>
[INFO] Preparing source:jar
[WARNING] Removing: jar from forked lifecycle, to prevent recursive invocation.
[WARNING] Removing: check from forked lifecycle, to prevent recursive invocation.
[JENKINS] Re-archiving <https://builds.apache.org/job/wss4j-trunk/ws/wss4j/policy/target/wss4j-policy-2.0-SNAPSHOT.jar>
[INFO] [bundle:cleanVersions {execution: versions}]
ERROR: Could not find local repository for 2.2.1
[INFO] [source:jar {execution: default}]
[INFO] Building jar: <https://builds.apache.org/job/wss4j-trunk/ws/wss4j/policy/target/wss4j-policy-2.0-SNAPSHOT-sources.jar>
[INFO] [install:install {execution: default-install}]
[INFO] Installing <https://builds.apache.org/job/wss4j-trunk/ws/wss4j/policy/target/wss4j-policy-2.0-SNAPSHOT.jar>
to /home/jenkins/jenkins-slave/maven-repositories/1/org/apache/wss4j/wss4j-policy/2.0-SNAPSHOT/wss4j-policy-2.0-SNAPSHOT.jar
[INFO] Installing <https://builds.apache.org/job/wss4j-trunk/ws/wss4j/policy/target/wss4j-policy-2.0-SNAPSHOT-sources.jar>
to /home/jenkins/jenkins-slave/maven-repositories/1/org/apache/wss4j/wss4j-policy/2.0-SNAPSHOT/wss4j-policy-2.0-SNAPSHOT-sources.jar
[INFO] Installing <https://builds.apache.org/job/wss4j-trunk/ws/wss4j/policy/target/wss4j-policy-2.0-SNAPSHOT-sources.jar>
to /home/jenkins/jenkins-slave/maven-repositories/1/org/apache/wss4j/wss4j-policy/2.0-SNAPSHOT/wss4j-policy-2.0-SNAPSHOT-sources.jar
[INFO] [deploy:deploy {execution: default-deploy}]
[INFO] Retrieving previous build number from apache.snapshots.https
[WARNING] *** CHECKSUM FAILED - Checksum failed on download: local = '2613cefcbc3a11d03f45559f72d4dcd09f577c73';
remote = 'befb2ec81ab444b2abf951a169faa3c015412f2e' - RETRYING
[WARNING] *** CHECKSUM FAILED - Checksum failed on download: local = '2613cefcbc3a11d03f45559f72d4dcd09f577c73';
remote = 'befb2ec81ab444b2abf951a169faa3c015412f2e' - IGNORING
Uploading: https://repository.apache.org/content/repositories/snapshots/org/apache/wss4j/wss4j-policy/2.0-SNAPSHOT/wss4j-policy-2.0-20130731.155421-163.jar
191K uploaded  (wss4j-policy-2.0-20130731.155421-163.jar)
[INFO] Retrieving previous metadata from apache.snapshots.https
[INFO] Uploading repository metadata for: 'artifact org.apache.wss4j:wss4j-policy'
[INFO] Retrieving previous metadata from apache.snapshots.https
[WARNING] *** CHECKSUM FAILED - Checksum failed on download: local = '2613cefcbc3a11d03f45559f72d4dcd09f577c73';
remote = 'befb2ec81ab444b2abf951a169faa3c015412f2e' - RETRYING
[WARNING] *** CHECKSUM FAILED - Checksum failed on download: local = '2613cefcbc3a11d03f45559f72d4dcd09f577c73';
remote = 'befb2ec81ab444b2abf951a169faa3c015412f2e' - IGNORING
[INFO] Uploading repository metadata for: 'snapshot org.apache.wss4j:wss4j-policy:2.0-SNAPSHOT'
[INFO] Uploading project information for wss4j-policy 2.0-20130731.155421-163
[INFO] Retrieving previous build number from apache.snapshots.https
Uploading: https://repository.apache.org/content/repositories/snapshots/org/apache/wss4j/wss4j-policy/2.0-SNAPSHOT/wss4j-policy-2.0-20130731.155421-163-sources.jar
133K uploaded  (wss4j-policy-2.0-20130731.155421-163-sources.jar)
[INFO] Retrieving previous build number from apache.snapshots.https
Uploading: https://repository.apache.org/content/repositories/snapshots/org/apache/wss4j/wss4j-policy/2.0-SNAPSHOT/wss4j-policy-2.0-20130731.155421-163-sources.jar
133K uploaded  (wss4j-policy-2.0-20130731.155421-163-sources.jar)
[JENKINS] Archiving <https://builds.apache.org/job/wss4j-trunk/ws/wss4j/policy/target/wss4j-policy-2.0-SNAPSHOT.jar>
to /home/hudson/hudson/jobs/wss4j-trunk/modules/org.apache.wss4j$wss4j-policy/builds/2013-07-31_15-53-37/archive/org.apache.wss4j/wss4j-policy/2.0-20130731.155421-163/wss4j-policy-2.0-20130731.155421-163.jar
[JENKINS] Archiving <https://builds.apache.org/job/wss4j-trunk/ws/wss4j/policy/target/wss4j-policy-2.0-SNAPSHOT-sources.jar>
to /home/hudson/hudson/jobs/wss4j-trunk/modules/org.apache.wss4j$wss4j-policy/builds/2013-07-31_15-53-37/archive/org.apache.wss4j/wss4j-policy/2.0-20130731.155421-163/wss4j-policy-2.0-20130731.155421-163-sources.jar
[INFO] ------------------------------------------------------------------------
[INFO] Building Apache WSS4J WS-Security Common
[INFO]    task-segment: [clean, install, deploy]
[INFO] ------------------------------------------------------------------------
[INFO] [clean:clean {execution: default-clean}]
[INFO] Deleting <https://builds.apache.org/job/wss4j-trunk/ws/wss4j/ws-security-common/target>
[INFO] Preparing pmd:check
[JENKINS] Archiving <https://builds.apache.org/job/wss4j-trunk/ws/wss4j/ws-security-common/pom.xml>
to /home/hudson/hudson/jobs/wss4j-trunk/modules/org.apache.wss4j$wss4j-ws-security-common/builds/2013-07-31_15-53-37/archive/org.apache.wss4j/wss4j-ws-security-common/2.0-SNAPSHOT/wss4j-ws-security-common-2.0-SNAPSHOT.pom
[INFO] [pmd:pmd {execution: pmd}]
ERROR: Could not find local repository for 2.2.1
[INFO] [pmd:check {execution: validate}]
[INFO] 
[INFO] [bundle:cleanVersions {execution: versions}]
[WARNING] The parameter expression: 'project.build.resources' used in mojo: 'process' has
been deprecated. Use 'project.resources' instead.
[INFO] [remote-resources:process {execution: default}]
[debug] execute contextualize
[INFO] [resources:resources {execution: default-resources}]
[INFO] Using 'UTF-8' encoding to copy filtered resources.
[INFO] Copying 0 resource
[INFO] Copying 4 resources
[INFO] Copying 3 resources
[INFO] [compiler:compile {execution: default-compile}]
[INFO] Changes detected - recompiling the module!
[INFO] Compiling 83 source files to <https://builds.apache.org/job/wss4j-trunk/ws/wss4j/ws-security-common/target/classes>
[WARNING] Note: <https://builds.apache.org/job/wss4j-trunk/ws/wss4j/ws-security-common/src/main/java/org/apache/wss4j/common/cache/EHCacheReplayCache.java>
uses or overrides a deprecated API.
[WARNING] Note: Recompile with -Xlint:deprecation for details.
[INFO] [bundle:manifest {execution: bundle-manifest}]
[debug] execute contextualize
[INFO] [resources:testResources {execution: default-testResources}]
[INFO] Using 'UTF-8' encoding to copy filtered resources.
[INFO] Copying 0 resource
[INFO] Copying 68 resources
[INFO] Copying 3 resources
[INFO] [compiler:testCompile {execution: default-testCompile}]
[INFO] Changes detected - recompiling the module!
[INFO] Compiling 3 source files to <https://builds.apache.org/job/wss4j-trunk/ws/wss4j/ws-security-common/target/test-classes>
[INFO] [surefire:test {execution: default-test}]
[INFO] Surefire report directory: <https://builds.apache.org/job/wss4j-trunk/ws/wss4j/ws-security-common/target/surefire-reports>

-------------------------------------------------------
 T E S T S
-------------------------------------------------------
Running org.apache.wss4j.common.crypto.X509NameTokenizerTest
Tests run: 2, Failures: 0, Errors: 0, Skipped: 0, Time elapsed: 0.045 sec
Running org.apache.wss4j.common.crypto.SKITest
Tests run: 2, Failures: 0, Errors: 0, Skipped: 0, Time elapsed: 0.423 sec
Running org.apache.wss4j.common.cache.EHCacheManagerHolderTest
Tests run: 1, Failures: 0, Errors: 0, Skipped: 0, Time elapsed: 0.309 sec

Results :

Tests run: 5, Failures: 0, Errors: 0, Skipped: 0

[JENKINS] Recording test results
[INFO] [jar:jar {execution: default-jar}]
[INFO] Building jar: <https://builds.apache.org/job/wss4j-trunk/ws/wss4j/ws-security-common/target/wss4j-ws-security-common-2.0-SNAPSHOT.jar>
[INFO] Preparing source:jar
[WARNING] Removing: jar from forked lifecycle, to prevent recursive invocation.
[WARNING] Removing: check from forked lifecycle, to prevent recursive invocation.
[JENKINS] Archiving <https://builds.apache.org/job/wss4j-trunk/ws/wss4j/ws-security-common/target/wss4j-ws-security-common-2.0-SNAPSHOT.jar>
to /home/hudson/hudson/jobs/wss4j-trunk/modules/org.apache.wss4j$wss4j-ws-security-common/builds/2013-07-31_15-53-37/archive/org.apache.wss4j/wss4j-ws-security-common/2.0-SNAPSHOT/wss4j-ws-security-common-2.0-SNAPSHOT.jar
[INFO] [bundle:cleanVersions {execution: versions}]
ERROR: Could not find local repository for 2.2.1
[INFO] [source:jar {execution: default}]
[INFO] Building jar: <https://builds.apache.org/job/wss4j-trunk/ws/wss4j/ws-security-common/target/wss4j-ws-security-common-2.0-SNAPSHOT-sources.jar>
[INFO] [jar:test-jar {execution: default}]
[INFO] Building jar: <https://builds.apache.org/job/wss4j-trunk/ws/wss4j/ws-security-common/target/wss4j-ws-security-common-2.0-SNAPSHOT-tests.jar>
[INFO] [install:install {execution: default-install}]
[INFO] Installing <https://builds.apache.org/job/wss4j-trunk/ws/wss4j/ws-security-common/target/wss4j-ws-security-common-2.0-SNAPSHOT.jar>
to /home/jenkins/jenkins-slave/maven-repositories/1/org/apache/wss4j/wss4j-ws-security-common/2.0-SNAPSHOT/wss4j-ws-security-common-2.0-SNAPSHOT.jar
[INFO] Installing <https://builds.apache.org/job/wss4j-trunk/ws/wss4j/ws-security-common/target/wss4j-ws-security-common-2.0-SNAPSHOT-sources.jar>
to /home/jenkins/jenkins-slave/maven-repositories/1/org/apache/wss4j/wss4j-ws-security-common/2.0-SNAPSHOT/wss4j-ws-security-common-2.0-SNAPSHOT-sources.jar
[INFO] Installing <https://builds.apache.org/job/wss4j-trunk/ws/wss4j/ws-security-common/target/wss4j-ws-security-common-2.0-SNAPSHOT-tests.jar>
to /home/jenkins/jenkins-slave/maven-repositories/1/org/apache/wss4j/wss4j-ws-security-common/2.0-SNAPSHOT/wss4j-ws-security-common-2.0-SNAPSHOT-tests.jar
[INFO] Preparing pmd:check
[JENKINS] Archiving <https://builds.apache.org/job/wss4j-trunk/ws/wss4j/ws-security-common/target/wss4j-ws-security-common-2.0-SNAPSHOT-sources.jar>
to /home/hudson/hudson/jobs/wss4j-trunk/modules/org.apache.wss4j$wss4j-ws-security-common/builds/2013-07-31_15-53-37/archive/org.apache.wss4j/wss4j-ws-security-common/2.0-SNAPSHOT/wss4j-ws-security-common-2.0-SNAPSHOT-sources.jar
[JENKINS] Archiving <https://builds.apache.org/job/wss4j-trunk/ws/wss4j/ws-security-common/target/wss4j-ws-security-common-2.0-SNAPSHOT-tests.jar>
to /home/hudson/hudson/jobs/wss4j-trunk/modules/org.apache.wss4j$wss4j-ws-security-common/builds/2013-07-31_15-53-37/archive/org.apache.wss4j/wss4j-ws-security-common/2.0-SNAPSHOT/wss4j-ws-security-common-2.0-SNAPSHOT-tests.jar
[INFO] [pmd:pmd {execution: pmd}]
ERROR: Could not find local repository for 2.2.1
[INFO] [pmd:check {execution: validate}]
[INFO] 
[INFO] [bundle:cleanVersions {execution: versions}]
[WARNING] The parameter expression: 'project.build.resources' used in mojo: 'process' has
been deprecated. Use 'project.resources' instead.
[INFO] [remote-resources:process {execution: default}]
[debug] execute contextualize
[INFO] [resources:resources {execution: default-resources}]
[INFO] Using 'UTF-8' encoding to copy filtered resources.
[INFO] Copying 0 resource
[INFO] Copying 4 resources
[INFO] Copying 3 resources
[INFO] Copying 3 resources
[INFO] [compiler:compile {execution: default-compile}]
[INFO] Nothing to compile - all classes are up to date
[INFO] [bundle:manifest {execution: bundle-manifest}]
[debug] execute contextualize
[INFO] [resources:testResources {execution: default-testResources}]
[INFO] Using 'UTF-8' encoding to copy filtered resources.
[INFO] Copying 0 resource
[INFO] Copying 68 resources
[INFO] Copying 3 resources
[INFO] Copying 3 resources
[INFO] [compiler:testCompile {execution: default-testCompile}]
[INFO] Nothing to compile - all classes are up to date
[INFO] [surefire:test {execution: default-test}]
[INFO] Skipping execution of surefire because it has already been run for this configuration
[JENKINS] Recording test results
[INFO] [jar:jar {execution: default-jar}]
[INFO] Building jar: <https://builds.apache.org/job/wss4j-trunk/ws/wss4j/ws-security-common/target/wss4j-ws-security-common-2.0-SNAPSHOT.jar>
[INFO] Preparing source:jar
[WARNING] Removing: jar from forked lifecycle, to prevent recursive invocation.
[WARNING] Removing: check from forked lifecycle, to prevent recursive invocation.
[JENKINS] Re-archiving <https://builds.apache.org/job/wss4j-trunk/ws/wss4j/ws-security-common/target/wss4j-ws-security-common-2.0-SNAPSHOT.jar>
[INFO] [bundle:cleanVersions {execution: versions}]
ERROR: Could not find local repository for 2.2.1
[INFO] [source:jar {execution: default}]
[INFO] Building jar: <https://builds.apache.org/job/wss4j-trunk/ws/wss4j/ws-security-common/target/wss4j-ws-security-common-2.0-SNAPSHOT-sources.jar>
[INFO] [jar:test-jar {execution: default}]
[INFO] Building jar: <https://builds.apache.org/job/wss4j-trunk/ws/wss4j/ws-security-common/target/wss4j-ws-security-common-2.0-SNAPSHOT-tests.jar>
[INFO] [install:install {execution: default-install}]
[INFO] Installing <https://builds.apache.org/job/wss4j-trunk/ws/wss4j/ws-security-common/target/wss4j-ws-security-common-2.0-SNAPSHOT.jar>
to /home/jenkins/jenkins-slave/maven-repositories/1/org/apache/wss4j/wss4j-ws-security-common/2.0-SNAPSHOT/wss4j-ws-security-common-2.0-SNAPSHOT.jar
[INFO] Installing <https://builds.apache.org/job/wss4j-trunk/ws/wss4j/ws-security-common/target/wss4j-ws-security-common-2.0-SNAPSHOT-sources.jar>
to /home/jenkins/jenkins-slave/maven-repositories/1/org/apache/wss4j/wss4j-ws-security-common/2.0-SNAPSHOT/wss4j-ws-security-common-2.0-SNAPSHOT-sources.jar
[INFO] Installing <https://builds.apache.org/job/wss4j-trunk/ws/wss4j/ws-security-common/target/wss4j-ws-security-common-2.0-SNAPSHOT-tests.jar>
to /home/jenkins/jenkins-slave/maven-repositories/1/org/apache/wss4j/wss4j-ws-security-common/2.0-SNAPSHOT/wss4j-ws-security-common-2.0-SNAPSHOT-tests.jar
[INFO] Installing <https://builds.apache.org/job/wss4j-trunk/ws/wss4j/ws-security-common/target/wss4j-ws-security-common-2.0-SNAPSHOT-sources.jar>
to /home/jenkins/jenkins-slave/maven-repositories/1/org/apache/wss4j/wss4j-ws-security-common/2.0-SNAPSHOT/wss4j-ws-security-common-2.0-SNAPSHOT-sources.jar
[INFO] Installing <https://builds.apache.org/job/wss4j-trunk/ws/wss4j/ws-security-common/target/wss4j-ws-security-common-2.0-SNAPSHOT-tests.jar>
to /home/jenkins/jenkins-slave/maven-repositories/1/org/apache/wss4j/wss4j-ws-security-common/2.0-SNAPSHOT/wss4j-ws-security-common-2.0-SNAPSHOT-tests.jar
[INFO] [deploy:deploy {execution: default-deploy}]
[INFO] Retrieving previous build number from apache.snapshots.https
[WARNING] *** CHECKSUM FAILED - Checksum failed on download: local = 'f87a22028ff8e9fedf12c734f099bd0dd9c85a2b';
remote = '6e0a82035ad4c8b47529e068cfc2c34220764de0' - RETRYING
[WARNING] *** CHECKSUM FAILED - Checksum failed on download: local = 'f87a22028ff8e9fedf12c734f099bd0dd9c85a2b';
remote = '6e0a82035ad4c8b47529e068cfc2c34220764de0' - IGNORING
Uploading: https://repository.apache.org/content/repositories/snapshots/org/apache/wss4j/wss4j-ws-security-common/2.0-SNAPSHOT/wss4j-ws-security-common-2.0-20130731.155421-162.jar
192K uploaded  (wss4j-ws-security-common-2.0-20130731.155421-162.jar)
[INFO] Retrieving previous metadata from apache.snapshots.https
[WARNING] *** CHECKSUM FAILED - Checksum failed on download: local = 'f87a22028ff8e9fedf12c734f099bd0dd9c85a2b';
remote = '6e0a82035ad4c8b47529e068cfc2c34220764de0' - RETRYING
[WARNING] *** CHECKSUM FAILED - Checksum failed on download: local = 'f87a22028ff8e9fedf12c734f099bd0dd9c85a2b';
remote = '6e0a82035ad4c8b47529e068cfc2c34220764de0' - IGNORING
[INFO] Uploading repository metadata for: 'snapshot org.apache.wss4j:wss4j-ws-security-common:2.0-SNAPSHOT'
[INFO] Uploading project information for wss4j-ws-security-common 2.0-20130731.155421-162
[INFO] Retrieving previous metadata from apache.snapshots.https
[INFO] Uploading repository metadata for: 'artifact org.apache.wss4j:wss4j-ws-security-common'
[INFO] Retrieving previous build number from apache.snapshots.https
Uploading: https://repository.apache.org/content/repositories/snapshots/org/apache/wss4j/wss4j-ws-security-common/2.0-SNAPSHOT/wss4j-ws-security-common-2.0-20130731.155421-162-sources.jar
168K uploaded  (wss4j-ws-security-common-2.0-20130731.155421-162-sources.jar)
[INFO] Retrieving previous build number from apache.snapshots.https
Uploading: https://repository.apache.org/content/repositories/snapshots/org/apache/wss4j/wss4j-ws-security-common/2.0-SNAPSHOT/wss4j-ws-security-common-2.0-20130731.155421-162-tests.jar
106K uploaded  (wss4j-ws-security-common-2.0-20130731.155421-162-tests.jar)
[INFO] Retrieving previous build number from apache.snapshots.https
Uploading: https://repository.apache.org/content/repositories/snapshots/org/apache/wss4j/wss4j-ws-security-common/2.0-SNAPSHOT/wss4j-ws-security-common-2.0-20130731.155421-162-sources.jar
168K uploaded  (wss4j-ws-security-common-2.0-20130731.155421-162-sources.jar)
[INFO] Retrieving previous build number from apache.snapshots.https
Uploading: https://repository.apache.org/content/repositories/snapshots/org/apache/wss4j/wss4j-ws-security-common/2.0-SNAPSHOT/wss4j-ws-security-common-2.0-20130731.155421-162-tests.jar
106K uploaded  (wss4j-ws-security-common-2.0-20130731.155421-162-tests.jar)
[JENKINS] Archiving <https://builds.apache.org/job/wss4j-trunk/ws/wss4j/ws-security-common/target/wss4j-ws-security-common-2.0-SNAPSHOT.jar>
to /home/hudson/hudson/jobs/wss4j-trunk/modules/org.apache.wss4j$wss4j-ws-security-common/builds/2013-07-31_15-53-37/archive/org.apache.wss4j/wss4j-ws-security-common/2.0-20130731.155421-162/wss4j-ws-security-common-2.0-20130731.155421-162.jar
[JENKINS] Archiving <https://builds.apache.org/job/wss4j-trunk/ws/wss4j/ws-security-common/target/wss4j-ws-security-common-2.0-SNAPSHOT-sources.jar>
to /home/hudson/hudson/jobs/wss4j-trunk/modules/org.apache.wss4j$wss4j-ws-security-common/builds/2013-07-31_15-53-37/archive/org.apache.wss4j/wss4j-ws-security-common/2.0-20130731.155421-162/wss4j-ws-security-common-2.0-20130731.155421-162-sources.jar
[JENKINS] Archiving <https://builds.apache.org/job/wss4j-trunk/ws/wss4j/ws-security-common/target/wss4j-ws-security-common-2.0-SNAPSHOT-tests.jar>
to /home/hudson/hudson/jobs/wss4j-trunk/modules/org.apache.wss4j$wss4j-ws-security-common/builds/2013-07-31_15-53-37/archive/org.apache.wss4j/wss4j-ws-security-common/2.0-20130731.155421-162/wss4j-ws-security-common-2.0-20130731.155421-162-tests.jar
[INFO] ------------------------------------------------------------------------
[INFO] Building Apache WSS4J DOM WS-Security
[INFO]    task-segment: [clean, install, deploy]
[INFO] ------------------------------------------------------------------------
[INFO] [clean:clean {execution: default-clean}]
[INFO] Deleting <https://builds.apache.org/job/wss4j-trunk/ws/wss4j/ws-security-dom/target>
[INFO] Preparing pmd:check
[JENKINS] Archiving <https://builds.apache.org/job/wss4j-trunk/ws/wss4j/ws-security-dom/pom.xml>
to /home/hudson/hudson/jobs/wss4j-trunk/modules/org.apache.wss4j$wss4j-ws-security-dom/builds/2013-07-31_15-53-37/archive/org.apache.wss4j/wss4j-ws-security-dom/2.0-SNAPSHOT/wss4j-ws-security-dom-2.0-SNAPSHOT.pom
[INFO] [pmd:pmd {execution: pmd}]
ERROR: Maven JVM terminated unexpectedly with exit code 143


---------------------------------------------------------------------
To unsubscribe, e-mail: dev-unsubscribe@ws.apache.org
For additional commands, e-mail: dev-help@ws.apache.org


Mime
View raw message