ws-dev mailing list archives

Site index · List index
Message view « Date » · « Thread »
Top « Date » · « Thread »
From Apache Jenkins Server <jenk...@builds.apache.org>
Subject Build failed in Jenkins: wss4j-trunk #561
Date Wed, 17 Jul 2013 12:16:55 GMT
See <https://builds.apache.org/job/wss4j-trunk/561/changes>

Changes:

[coheigea] Don't throw an Exception on getting a Crypto instance from the security properties

[coheigea] Refactor Crypto "verifyTrust" interface

------------------------------------------
[...truncated 1225 lines...]
[INFO] [bundle:manifest {execution: bundle-manifest}]
[debug] execute contextualize
[INFO] [resources:testResources {execution: default-testResources}]
[INFO] Using 'UTF-8' encoding to copy filtered resources.
[INFO] Copying 0 resource
[INFO] Copying 64 resources
[INFO] Copying 3 resources
[INFO] [compiler:testCompile {execution: default-testCompile}]
[INFO] Changes detected - recompiling the module!
[INFO] Compiling 79 source files to <https://builds.apache.org/job/wss4j-trunk/ws/wss4j/ws-security-dom/target/test-classes>
[INFO] [surefire:test {execution: default-test}]
[INFO] Surefire report directory: <https://builds.apache.org/job/wss4j-trunk/ws/wss4j/ws-security-dom/target/surefire-reports>

-------------------------------------------------------
 T E S T S
-------------------------------------------------------
Running org.apache.wss4j.dom.saml.SignedSamlTokenHOKTest
Tests run: 8, Failures: 0, Errors: 0, Skipped: 0, Time elapsed: 5.203 sec
Running org.apache.wss4j.dom.saml.SamlTokenDerivedTest
Tests run: 1, Failures: 0, Errors: 0, Skipped: 0, Time elapsed: 0.007 sec
Running org.apache.wss4j.dom.saml.SamlAlgorithmSuiteTest
Tests run: 3, Failures: 0, Errors: 0, Skipped: 0, Time elapsed: 0.092 sec
Running org.apache.wss4j.dom.saml.SamlTokenHOKTest
Tests run: 4, Failures: 0, Errors: 0, Skipped: 0, Time elapsed: 0.131 sec
Running org.apache.wss4j.dom.saml.SamlTokenTest
Tests run: 17, Failures: 0, Errors: 0, Skipped: 0, Time elapsed: 0.112 sec
Running org.apache.wss4j.dom.saml.SamlNegativeTest
Tests run: 6, Failures: 0, Errors: 0, Skipped: 0, Time elapsed: 0.116 sec
Running org.apache.wss4j.dom.saml.SamlConditionsTest
Tests run: 4, Failures: 0, Errors: 0, Skipped: 0, Time elapsed: 0.021 sec
Running org.apache.wss4j.dom.saml.SamlTokenSVTest
Tests run: 5, Failures: 0, Errors: 0, Skipped: 0, Time elapsed: 0.162 sec
Running org.apache.wss4j.dom.saml.ext.AssertionSigningTest
Tests run: 2, Failures: 0, Errors: 0, Skipped: 0, Time elapsed: 0.007 sec
Running org.apache.wss4j.dom.saml.SamlReferenceTest
Tests run: 13, Failures: 0, Errors: 0, Skipped: 0, Time elapsed: 0.515 sec
Running org.apache.wss4j.dom.saml.SamlTokenCustomSignatureTest
Tests run: 2, Failures: 0, Errors: 0, Skipped: 0, Time elapsed: 0.212 sec
Running org.apache.wss4j.dom.misc.SecurityHeaderTest
Tests run: 3, Failures: 0, Errors: 0, Skipped: 0, Time elapsed: 0.004 sec
Running org.apache.wss4j.dom.misc.PrincipalTest
Tests run: 6, Failures: 0, Errors: 0, Skipped: 0, Time elapsed: 0.079 sec
Running org.apache.wss4j.dom.misc.FaultCodeTest
Tests run: 6, Failures: 0, Errors: 0, Skipped: 0, Time elapsed: 0.02 sec
Running org.apache.wss4j.dom.components.crypto.CryptoTest
Tests run: 5, Failures: 0, Errors: 0, Skipped: 0, Time elapsed: 0.03 sec
Running org.apache.wss4j.dom.components.crypto.CryptoProviderTest
Tests run: 3, Failures: 0, Errors: 0, Skipped: 0, Time elapsed: 0.087 sec
Running org.apache.wss4j.dom.components.crypto.CertificateStoreTest
Tests run: 6, Failures: 0, Errors: 0, Skipped: 0, Time elapsed: 0.101 sec
Running org.apache.wss4j.dom.validate.ValidatorTest
Tests run: 5, Failures: 0, Errors: 0, Skipped: 0, Time elapsed: 0.063 sec
Running org.apache.wss4j.dom.message.DerivedKeyTest
Tests run: 7, Failures: 0, Errors: 0, Skipped: 0, Time elapsed: 0.113 sec
Running org.apache.wss4j.dom.message.token.BinarySecurityTokenTest
Tests run: 3, Failures: 0, Errors: 0, Skipped: 0, Time elapsed: 0.008 sec
Running org.apache.wss4j.dom.message.token.SecurityTokenReferenceTest
Tests run: 8, Failures: 0, Errors: 0, Skipped: 0, Time elapsed: 0.008 sec
Running org.apache.wss4j.dom.message.token.WCFUsernameTokenTest
Tests run: 2, Failures: 0, Errors: 0, Skipped: 0, Time elapsed: 0.008 sec
Running org.apache.wss4j.dom.message.token.BSTKerberosTest
Tests run: 9, Failures: 0, Errors: 0, Skipped: 0, Time elapsed: 0.133 sec
Running org.apache.wss4j.dom.message.token.ReferenceTest
Tests run: 4, Failures: 0, Errors: 0, Skipped: 0, Time elapsed: 0.014 sec
Running org.apache.wss4j.dom.message.token.DerivedKeyTokenTest
Tests run: 2, Failures: 0, Errors: 0, Skipped: 0, Time elapsed: 0.007 sec
Running org.apache.wss4j.dom.message.CertErrorTest
Tests run: 2, Failures: 0, Errors: 0, Skipped: 0, Time elapsed: 0.021 sec
Running org.apache.wss4j.dom.message.NoSoapPrefixSignatureTest
Tests run: 1, Failures: 0, Errors: 0, Skipped: 0, Time elapsed: 0.016 sec
Running org.apache.wss4j.dom.message.SignatureCertTest
Tests run: 6, Failures: 0, Errors: 0, Skipped: 1, Time elapsed: 0.448 sec
Running org.apache.wss4j.dom.message.TimestampTest
Tests run: 16, Failures: 0, Errors: 0, Skipped: 0, Time elapsed: 0.034 sec
Running org.apache.wss4j.dom.message.RequireSignedEncryptedDataElementsTest
Tests run: 7, Failures: 0, Errors: 0, Skipped: 0, Time elapsed: 0.418 sec
Running org.apache.wss4j.dom.message.ReplayTest
Tests run: 8, Failures: 0, Errors: 0, Skipped: 0, Time elapsed: 0.163 sec
Running org.apache.wss4j.dom.message.EncryptionPartsTest
Tests run: 10, Failures: 0, Errors: 0, Skipped: 0, Time elapsed: 0.159 sec
Running org.apache.wss4j.dom.message.SignatureAlgorithmSuiteTest
Tests run: 5, Failures: 0, Errors: 0, Skipped: 0, Time elapsed: 0.111 sec
Running org.apache.wss4j.dom.message.UTDerivedKeyTest
Tests run: 15, Failures: 0, Errors: 0, Skipped: 0, Time elapsed: 0.294 sec
Running org.apache.wss4j.dom.message.UTSignatureTest
Tests run: 4, Failures: 0, Errors: 0, Skipped: 0, Time elapsed: 0.091 sec
Running org.apache.wss4j.dom.message.EncryptionTest
Tests run: 12, Failures: 0, Errors: 0, Skipped: 0, Time elapsed: 0.158 sec
Running org.apache.wss4j.dom.message.SignatureEncryptionTest
Tests run: 7, Failures: 0, Errors: 0, Skipped: 0, Time elapsed: 0.141 sec
Running org.apache.wss4j.dom.message.EncryptionCRLTest
Tests run: 2, Failures: 0, Errors: 0, Skipped: 0, Time elapsed: 0.018 sec
Running org.apache.wss4j.dom.message.SignatureTest
Tests run: 23, Failures: 0, Errors: 0, Skipped: 0, Time elapsed: 0.469 sec
Running org.apache.wss4j.dom.message.STRSignatureTest
Tests run: 4, Failures: 0, Errors: 0, Skipped: 0, Time elapsed: 0.066 sec
Running org.apache.wss4j.dom.message.SignedBSTTest
Tests run: 1, Failures: 0, Errors: 0, Skipped: 0, Time elapsed: 0.015 sec
Running org.apache.wss4j.dom.message.SignatureKeyValueTest
Tests run: 3, Failures: 0, Errors: 0, Skipped: 0, Time elapsed: 0.04 sec
Running org.apache.wss4j.dom.message.SKISignatureTest
Tests run: 3, Failures: 0, Errors: 0, Skipped: 0, Time elapsed: 0.043 sec
Running org.apache.wss4j.dom.message.ModifiedRequestTest
[Fatal Error] :1:244: Invalid byte 1 of 1-byte UTF-8 sequence.
Tests run: 10, Failures: 0, Errors: 0, Skipped: 0, Time elapsed: 0.395 sec
Running org.apache.wss4j.dom.message.SecurityContextTokenTest
Tests run: 7, Failures: 0, Errors: 0, Skipped: 0, Time elapsed: 0.051 sec
Running org.apache.wss4j.dom.message.PasswordTypeTest
Tests run: 3, Failures: 0, Errors: 0, Skipped: 0, Time elapsed: 0.033 sec
Running org.apache.wss4j.dom.message.SymmetricSignatureTest
Tests run: 4, Failures: 0, Errors: 0, Skipped: 0, Time elapsed: 0.048 sec
Running org.apache.wss4j.dom.message.SignatureCertConstraintsTest
Tests run: 2, Failures: 0, Errors: 0, Skipped: 0, Time elapsed: 0.031 sec
Running org.apache.wss4j.dom.message.EncryptionGCMTest
Tests run: 3, Failures: 0, Errors: 0, Skipped: 0, Time elapsed: 0.039 sec
Running org.apache.wss4j.dom.message.SignaturePartsTest
Tests run: 10, Failures: 0, Errors: 0, Skipped: 0, Time elapsed: 0.172 sec
Running org.apache.wss4j.dom.message.SignatureCRLTest
Tests run: 3, Failures: 0, Errors: 0, Skipped: 0, Time elapsed: 0.035 sec
Running org.apache.wss4j.dom.message.EncryptedDataInHeaderTest
Tests run: 1, Failures: 0, Errors: 0, Skipped: 0, Time elapsed: 0.018 sec
Running org.apache.wss4j.dom.message.EncryptionAlgorithmSuiteTest
Tests run: 4, Failures: 0, Errors: 0, Skipped: 0, Time elapsed: 0.046 sec
Running org.apache.wss4j.dom.message.UsernameTokenTest
Tests run: 30, Failures: 0, Errors: 0, Skipped: 0, Time elapsed: 0.158 sec
Running org.apache.wss4j.dom.processor.EncryptedKeyDataRefTest
Tests run: 1, Failures: 0, Errors: 0, Skipped: 0, Time elapsed: 0.01 sec
Running org.apache.wss4j.dom.processor.ReferenceListDataRefTest
Tests run: 1, Failures: 0, Errors: 0, Skipped: 0, Time elapsed: 0.009 sec
Running org.apache.wss4j.dom.handler.WSHandlerGetPasswordTest
Tests run: 3, Failures: 0, Errors: 0, Skipped: 0, Time elapsed: 0.003 sec
Running org.apache.wss4j.dom.handler.SignatureUTAliasTest
Tests run: 1, Failures: 0, Errors: 0, Skipped: 0, Time elapsed: 0.018 sec
Running org.apache.wss4j.dom.handler.SignatureConfirmationTest
Tests run: 5, Failures: 0, Errors: 0, Skipped: 0, Time elapsed: 0.107 sec
Running org.apache.wss4j.dom.handler.ResultsOrderTest
Tests run: 9, Failures: 0, Errors: 0, Skipped: 0, Time elapsed: 0.002 sec
Running org.apache.wss4j.dom.handler.CallbackRefTest
Tests run: 2, Failures: 0, Errors: 0, Skipped: 0, Time elapsed: 0.002 sec
Running org.apache.wss4j.dom.handler.CustomActionProcessorTest
Tests run: 5, Failures: 0, Errors: 0, Skipped: 0, Time elapsed: 0.054 sec

Results :

Tests run: 367, Failures: 0, Errors: 0, Skipped: 1

[JENKINS] Recording test results
[INFO] [jar:jar {execution: default-jar}]
[INFO] Building jar: <https://builds.apache.org/job/wss4j-trunk/ws/wss4j/ws-security-dom/target/wss4j-ws-security-dom-2.0-SNAPSHOT.jar>
[INFO] Preparing source:jar
[WARNING] Removing: jar from forked lifecycle, to prevent recursive invocation.
[WARNING] Removing: check from forked lifecycle, to prevent recursive invocation.
[JENKINS] Archiving <https://builds.apache.org/job/wss4j-trunk/ws/wss4j/ws-security-dom/target/wss4j-ws-security-dom-2.0-SNAPSHOT.jar>
to /home/hudson/hudson/jobs/wss4j-trunk/modules/org.apache.wss4j$wss4j-ws-security-dom/builds/2013-07-17_12-09-55/archive/org.apache.wss4j/wss4j-ws-security-dom/2.0-SNAPSHOT/wss4j-ws-security-dom-2.0-SNAPSHOT.jar
[INFO] [bundle:cleanVersions {execution: versions}]
[INFO] [source:jar {execution: default}]
[INFO] Building jar: <https://builds.apache.org/job/wss4j-trunk/ws/wss4j/ws-security-dom/target/wss4j-ws-security-dom-2.0-SNAPSHOT-sources.jar>
[INFO] [jar:test-jar {execution: default}]
[INFO] Building jar: <https://builds.apache.org/job/wss4j-trunk/ws/wss4j/ws-security-dom/target/wss4j-ws-security-dom-2.0-SNAPSHOT-tests.jar>
[INFO] [install:install {execution: default-install}]
[INFO] Installing <https://builds.apache.org/job/wss4j-trunk/ws/wss4j/ws-security-dom/target/wss4j-ws-security-dom-2.0-SNAPSHOT.jar>
to /home/jenkins/jenkins-slave/maven-repositories/1/org/apache/wss4j/wss4j-ws-security-dom/2.0-SNAPSHOT/wss4j-ws-security-dom-2.0-SNAPSHOT.jar
[INFO] Installing <https://builds.apache.org/job/wss4j-trunk/ws/wss4j/ws-security-dom/target/wss4j-ws-security-dom-2.0-SNAPSHOT-sources.jar>
to /home/jenkins/jenkins-slave/maven-repositories/1/org/apache/wss4j/wss4j-ws-security-dom/2.0-SNAPSHOT/wss4j-ws-security-dom-2.0-SNAPSHOT-sources.jar
[INFO] Installing <https://builds.apache.org/job/wss4j-trunk/ws/wss4j/ws-security-dom/target/wss4j-ws-security-dom-2.0-SNAPSHOT-tests.jar>
to /home/jenkins/jenkins-slave/maven-repositories/1/org/apache/wss4j/wss4j-ws-security-dom/2.0-SNAPSHOT/wss4j-ws-security-dom-2.0-SNAPSHOT-tests.jar
[INFO] Preparing pmd:check
[JENKINS] Archiving <https://builds.apache.org/job/wss4j-trunk/ws/wss4j/ws-security-dom/target/wss4j-ws-security-dom-2.0-SNAPSHOT-sources.jar>
to /home/hudson/hudson/jobs/wss4j-trunk/modules/org.apache.wss4j$wss4j-ws-security-dom/builds/2013-07-17_12-09-55/archive/org.apache.wss4j/wss4j-ws-security-dom/2.0-SNAPSHOT/wss4j-ws-security-dom-2.0-SNAPSHOT-sources.jar
[JENKINS] Archiving <https://builds.apache.org/job/wss4j-trunk/ws/wss4j/ws-security-dom/target/wss4j-ws-security-dom-2.0-SNAPSHOT-tests.jar>
to /home/hudson/hudson/jobs/wss4j-trunk/modules/org.apache.wss4j$wss4j-ws-security-dom/builds/2013-07-17_12-09-55/archive/org.apache.wss4j/wss4j-ws-security-dom/2.0-SNAPSHOT/wss4j-ws-security-dom-2.0-SNAPSHOT-tests.jar
[INFO] [pmd:pmd {execution: pmd}]
[INFO] [pmd:check {execution: validate}]
[INFO] 
[INFO] [bundle:cleanVersions {execution: versions}]
[WARNING] The parameter expression: 'project.build.resources' used in mojo: 'process' has
been deprecated. Use 'project.resources' instead.
[INFO] [remote-resources:process {execution: default}]
[debug] execute contextualize
[INFO] [resources:resources {execution: default-resources}]
[INFO] Using 'UTF-8' encoding to copy filtered resources.
[INFO] Copying 0 resource
[INFO] Copying 1 resource
[INFO] Copying 3 resources
[INFO] Copying 3 resources
[INFO] [compiler:compile {execution: default-compile}]
[INFO] Nothing to compile - all classes are up to date
[INFO] [bundle:manifest {execution: bundle-manifest}]
[debug] execute contextualize
[INFO] [resources:testResources {execution: default-testResources}]
[INFO] Using 'UTF-8' encoding to copy filtered resources.
[INFO] Copying 0 resource
[INFO] Copying 64 resources
[INFO] Copying 3 resources
[INFO] Copying 3 resources
[INFO] [compiler:testCompile {execution: default-testCompile}]
[INFO] Nothing to compile - all classes are up to date
[INFO] [surefire:test {execution: default-test}]
[INFO] Skipping execution of surefire because it has already been run for this configuration
[JENKINS] Recording test results
[INFO] [jar:jar {execution: default-jar}]
[INFO] Building jar: <https://builds.apache.org/job/wss4j-trunk/ws/wss4j/ws-security-dom/target/wss4j-ws-security-dom-2.0-SNAPSHOT.jar>
[INFO] Preparing source:jar
[WARNING] Removing: jar from forked lifecycle, to prevent recursive invocation.
[WARNING] Removing: check from forked lifecycle, to prevent recursive invocation.
[JENKINS] Re-archiving <https://builds.apache.org/job/wss4j-trunk/ws/wss4j/ws-security-dom/target/wss4j-ws-security-dom-2.0-SNAPSHOT.jar>
[INFO] [bundle:cleanVersions {execution: versions}]
[INFO] [source:jar {execution: default}]
[INFO] Building jar: <https://builds.apache.org/job/wss4j-trunk/ws/wss4j/ws-security-dom/target/wss4j-ws-security-dom-2.0-SNAPSHOT-sources.jar>
[INFO] [jar:test-jar {execution: default}]
[INFO] Building jar: <https://builds.apache.org/job/wss4j-trunk/ws/wss4j/ws-security-dom/target/wss4j-ws-security-dom-2.0-SNAPSHOT-tests.jar>
[INFO] [install:install {execution: default-install}]
[INFO] Installing <https://builds.apache.org/job/wss4j-trunk/ws/wss4j/ws-security-dom/target/wss4j-ws-security-dom-2.0-SNAPSHOT.jar>
to /home/jenkins/jenkins-slave/maven-repositories/1/org/apache/wss4j/wss4j-ws-security-dom/2.0-SNAPSHOT/wss4j-ws-security-dom-2.0-SNAPSHOT.jar
[INFO] Installing <https://builds.apache.org/job/wss4j-trunk/ws/wss4j/ws-security-dom/target/wss4j-ws-security-dom-2.0-SNAPSHOT-sources.jar>
to /home/jenkins/jenkins-slave/maven-repositories/1/org/apache/wss4j/wss4j-ws-security-dom/2.0-SNAPSHOT/wss4j-ws-security-dom-2.0-SNAPSHOT-sources.jar
[INFO] Installing <https://builds.apache.org/job/wss4j-trunk/ws/wss4j/ws-security-dom/target/wss4j-ws-security-dom-2.0-SNAPSHOT-tests.jar>
to /home/jenkins/jenkins-slave/maven-repositories/1/org/apache/wss4j/wss4j-ws-security-dom/2.0-SNAPSHOT/wss4j-ws-security-dom-2.0-SNAPSHOT-tests.jar
[INFO] Installing <https://builds.apache.org/job/wss4j-trunk/ws/wss4j/ws-security-dom/target/wss4j-ws-security-dom-2.0-SNAPSHOT-sources.jar>
to /home/jenkins/jenkins-slave/maven-repositories/1/org/apache/wss4j/wss4j-ws-security-dom/2.0-SNAPSHOT/wss4j-ws-security-dom-2.0-SNAPSHOT-sources.jar
[INFO] Installing <https://builds.apache.org/job/wss4j-trunk/ws/wss4j/ws-security-dom/target/wss4j-ws-security-dom-2.0-SNAPSHOT-tests.jar>
to /home/jenkins/jenkins-slave/maven-repositories/1/org/apache/wss4j/wss4j-ws-security-dom/2.0-SNAPSHOT/wss4j-ws-security-dom-2.0-SNAPSHOT-tests.jar
[INFO] [deploy:deploy {execution: default-deploy}]
[INFO] Retrieving previous build number from apache.snapshots.https
[WARNING] *** CHECKSUM FAILED - Checksum failed on download: local = '03a706c34484005c68f8b6da1945728c1bc0bf75';
remote = '8104a663361bb2be90a55bcb36abedb8e55f3cc9' - RETRYING
[WARNING] *** CHECKSUM FAILED - Checksum failed on download: local = '03a706c34484005c68f8b6da1945728c1bc0bf75';
remote = '8104a663361bb2be90a55bcb36abedb8e55f3cc9' - IGNORING
Uploading: https://repository.apache.org/content/repositories/snapshots/org/apache/wss4j/wss4j-ws-security-dom/2.0-SNAPSHOT/wss4j-ws-security-dom-2.0-20130717.121059-142.jar
294K uploaded  (wss4j-ws-security-dom-2.0-20130717.121059-142.jar)
[INFO] Uploading project information for wss4j-ws-security-dom 2.0-20130717.121059-142
[INFO] Retrieving previous metadata from apache.snapshots.https
[INFO] Uploading repository metadata for: 'artifact org.apache.wss4j:wss4j-ws-security-dom'
[INFO] Retrieving previous metadata from apache.snapshots.https
[WARNING] *** CHECKSUM FAILED - Checksum failed on download: local = '03a706c34484005c68f8b6da1945728c1bc0bf75';
remote = '8104a663361bb2be90a55bcb36abedb8e55f3cc9' - RETRYING
[WARNING] *** CHECKSUM FAILED - Checksum failed on download: local = '03a706c34484005c68f8b6da1945728c1bc0bf75';
remote = '8104a663361bb2be90a55bcb36abedb8e55f3cc9' - IGNORING
[INFO] Uploading repository metadata for: 'snapshot org.apache.wss4j:wss4j-ws-security-dom:2.0-SNAPSHOT'
[INFO] Retrieving previous build number from apache.snapshots.https
Uploading: https://repository.apache.org/content/repositories/snapshots/org/apache/wss4j/wss4j-ws-security-dom/2.0-SNAPSHOT/wss4j-ws-security-dom-2.0-20130717.121059-142-sources.jar
248K uploaded  (wss4j-ws-security-dom-2.0-20130717.121059-142-sources.jar)
[INFO] Retrieving previous build number from apache.snapshots.https
Uploading: https://repository.apache.org/content/repositories/snapshots/org/apache/wss4j/wss4j-ws-security-dom/2.0-SNAPSHOT/wss4j-ws-security-dom-2.0-20130717.121059-142-tests.jar
384K uploaded  (wss4j-ws-security-dom-2.0-20130717.121059-142-tests.jar)
[INFO] Retrieving previous build number from apache.snapshots.https
Uploading: https://repository.apache.org/content/repositories/snapshots/org/apache/wss4j/wss4j-ws-security-dom/2.0-SNAPSHOT/wss4j-ws-security-dom-2.0-20130717.121059-142-sources.jar
248K uploaded  (wss4j-ws-security-dom-2.0-20130717.121059-142-sources.jar)
[INFO] Retrieving previous build number from apache.snapshots.https
Uploading: https://repository.apache.org/content/repositories/snapshots/org/apache/wss4j/wss4j-ws-security-dom/2.0-SNAPSHOT/wss4j-ws-security-dom-2.0-20130717.121059-142-tests.jar
384K uploaded  (wss4j-ws-security-dom-2.0-20130717.121059-142-tests.jar)
[JENKINS] Archiving <https://builds.apache.org/job/wss4j-trunk/ws/wss4j/ws-security-dom/target/wss4j-ws-security-dom-2.0-SNAPSHOT.jar>
to /home/hudson/hudson/jobs/wss4j-trunk/modules/org.apache.wss4j$wss4j-ws-security-dom/builds/2013-07-17_12-09-55/archive/org.apache.wss4j/wss4j-ws-security-dom/2.0-20130717.121059-142/wss4j-ws-security-dom-2.0-20130717.121059-142.jar
[JENKINS] Archiving <https://builds.apache.org/job/wss4j-trunk/ws/wss4j/ws-security-dom/target/wss4j-ws-security-dom-2.0-SNAPSHOT-sources.jar>
to /home/hudson/hudson/jobs/wss4j-trunk/modules/org.apache.wss4j$wss4j-ws-security-dom/builds/2013-07-17_12-09-55/archive/org.apache.wss4j/wss4j-ws-security-dom/2.0-20130717.121059-142/wss4j-ws-security-dom-2.0-20130717.121059-142-sources.jar
[JENKINS] Archiving <https://builds.apache.org/job/wss4j-trunk/ws/wss4j/ws-security-dom/target/wss4j-ws-security-dom-2.0-SNAPSHOT-tests.jar>
to /home/hudson/hudson/jobs/wss4j-trunk/modules/org.apache.wss4j$wss4j-ws-security-dom/builds/2013-07-17_12-09-55/archive/org.apache.wss4j/wss4j-ws-security-dom/2.0-20130717.121059-142/wss4j-ws-security-dom-2.0-20130717.121059-142-tests.jar
[INFO] ------------------------------------------------------------------------
[INFO] Building Apache WSS4J Streaming WS-Security
[INFO]    task-segment: [clean, install, deploy]
[INFO] ------------------------------------------------------------------------
[INFO] [clean:clean {execution: default-clean}]
[INFO] Deleting <https://builds.apache.org/job/wss4j-trunk/ws/wss4j/ws-security-stax/target>
[INFO] Preparing pmd:check
[JENKINS] Archiving <https://builds.apache.org/job/wss4j-trunk/ws/wss4j/ws-security-stax/pom.xml>
to /home/hudson/hudson/jobs/wss4j-trunk/modules/org.apache.wss4j$wss4j-ws-security-stax/builds/2013-07-17_12-09-55/archive/org.apache.wss4j/wss4j-ws-security-stax/2.0-SNAPSHOT/wss4j-ws-security-stax-2.0-SNAPSHOT.pom
[INFO] [pmd:pmd {execution: pmd}]
ERROR: Maven JVM terminated unexpectedly with exit code 143


---------------------------------------------------------------------
To unsubscribe, e-mail: dev-unsubscribe@ws.apache.org
For additional commands, e-mail: dev-help@ws.apache.org


Mime
View raw message