ws-dev mailing list archives

Site index · List index
Message view « Date » · « Thread »
Top « Date » · « Thread »
From Apache Jenkins Server <jenk...@builds.apache.org>
Subject Build failed in Jenkins: wss4j-trunk #552
Date Tue, 09 Jul 2013 11:30:35 GMT
See <https://builds.apache.org/job/wss4j-trunk/552/changes>

Changes:

[giger] WSS-458 - Allow no security header in certain use-cases

------------------------------------------
[...truncated 1156 lines...]
[INFO] [bundle:manifest {execution: bundle-manifest}]
[debug] execute contextualize
[INFO] [resources:testResources {execution: default-testResources}]
[INFO] Using 'UTF-8' encoding to copy filtered resources.
[INFO] Copying 0 resource
[INFO] Copying 64 resources
[INFO] Copying 3 resources
[INFO] [compiler:testCompile {execution: default-testCompile}]
[INFO] Changes detected - recompiling the module!
[INFO] Compiling 78 source files to <https://builds.apache.org/job/wss4j-trunk/ws/wss4j/ws-security-dom/target/test-classes>
[INFO] [surefire:test {execution: default-test}]
[INFO] Surefire report directory: <https://builds.apache.org/job/wss4j-trunk/ws/wss4j/ws-security-dom/target/surefire-reports>

-------------------------------------------------------
 T E S T S
-------------------------------------------------------
Running org.apache.wss4j.dom.saml.SamlTokenTest
Tests run: 17, Failures: 0, Errors: 0, Skipped: 0, Time elapsed: 3.302 sec
Running org.apache.wss4j.dom.saml.SamlNegativeTest
Tests run: 6, Failures: 0, Errors: 0, Skipped: 0, Time elapsed: 1.799 sec
Running org.apache.wss4j.dom.saml.SamlTokenHOKTest
Tests run: 4, Failures: 0, Errors: 0, Skipped: 0, Time elapsed: 0.191 sec
Running org.apache.wss4j.dom.saml.ext.AssertionSigningTest
Tests run: 2, Failures: 0, Errors: 0, Skipped: 0, Time elapsed: 0.009 sec
Running org.apache.wss4j.dom.saml.SamlConditionsTest
Tests run: 4, Failures: 0, Errors: 0, Skipped: 0, Time elapsed: 0.023 sec
Running org.apache.wss4j.dom.saml.SamlReferenceTest
Tests run: 13, Failures: 0, Errors: 0, Skipped: 0, Time elapsed: 0.6 sec
Running org.apache.wss4j.dom.saml.SamlTokenCustomSignatureTest
Tests run: 2, Failures: 0, Errors: 0, Skipped: 0, Time elapsed: 0.196 sec
Running org.apache.wss4j.dom.saml.SamlTokenSVTest
Tests run: 5, Failures: 0, Errors: 0, Skipped: 0, Time elapsed: 0.149 sec
Running org.apache.wss4j.dom.saml.SamlAlgorithmSuiteTest
Tests run: 3, Failures: 0, Errors: 0, Skipped: 0, Time elapsed: 0.073 sec
Running org.apache.wss4j.dom.saml.SamlTokenDerivedTest
Tests run: 1, Failures: 0, Errors: 0, Skipped: 0, Time elapsed: 0.037 sec
Running org.apache.wss4j.dom.saml.SignedSamlTokenHOKTest
Tests run: 8, Failures: 0, Errors: 0, Skipped: 0, Time elapsed: 0.289 sec
Running org.apache.wss4j.dom.handler.ResultsOrderTest
Tests run: 9, Failures: 0, Errors: 0, Skipped: 0, Time elapsed: 0.003 sec
Running org.apache.wss4j.dom.handler.SignatureConfirmationTest
Tests run: 5, Failures: 0, Errors: 0, Skipped: 0, Time elapsed: 0.126 sec
Running org.apache.wss4j.dom.handler.SignatureUTAliasTest
Tests run: 1, Failures: 0, Errors: 0, Skipped: 0, Time elapsed: 0.197 sec
Running org.apache.wss4j.dom.handler.CustomActionProcessorTest
Tests run: 5, Failures: 0, Errors: 0, Skipped: 0, Time elapsed: 0.063 sec
Running org.apache.wss4j.dom.handler.WSHandlerGetPasswordTest
Tests run: 3, Failures: 0, Errors: 0, Skipped: 0, Time elapsed: 0.004 sec
Running org.apache.wss4j.dom.handler.CallbackRefTest
Tests run: 2, Failures: 0, Errors: 0, Skipped: 0, Time elapsed: 0.003 sec
Running org.apache.wss4j.dom.processor.ReferenceListDataRefTest
Tests run: 1, Failures: 0, Errors: 0, Skipped: 0, Time elapsed: 0.012 sec
Running org.apache.wss4j.dom.processor.EncryptedKeyDataRefTest
Tests run: 1, Failures: 0, Errors: 0, Skipped: 0, Time elapsed: 0.011 sec
Running org.apache.wss4j.dom.validate.ValidatorTest
Tests run: 5, Failures: 0, Errors: 0, Skipped: 0, Time elapsed: 0.093 sec
Running org.apache.wss4j.dom.misc.FaultCodeTest
Tests run: 6, Failures: 0, Errors: 0, Skipped: 0, Time elapsed: 0.019 sec
Running org.apache.wss4j.dom.misc.PrincipalTest
Tests run: 6, Failures: 0, Errors: 0, Skipped: 0, Time elapsed: 0.036 sec
Running org.apache.wss4j.dom.misc.SecurityHeaderTest
Tests run: 3, Failures: 0, Errors: 0, Skipped: 0, Time elapsed: 0.003 sec
Running org.apache.wss4j.dom.message.EncryptionCRLTest
Tests run: 2, Failures: 0, Errors: 0, Skipped: 0, Time elapsed: 0.02 sec
Running org.apache.wss4j.dom.message.SignatureEncryptionTest
Tests run: 7, Failures: 0, Errors: 0, Skipped: 0, Time elapsed: 0.162 sec
Running org.apache.wss4j.dom.message.DerivedKeyTest
Tests run: 7, Failures: 0, Errors: 0, Skipped: 0, Time elapsed: 0.104 sec
Running org.apache.wss4j.dom.message.EncryptionAlgorithmSuiteTest
Tests run: 4, Failures: 0, Errors: 0, Skipped: 0, Time elapsed: 0.051 sec
Running org.apache.wss4j.dom.message.UTSignatureTest
Tests run: 4, Failures: 0, Errors: 0, Skipped: 0, Time elapsed: 0.097 sec
Running org.apache.wss4j.dom.message.SignatureCertConstraintsTest
Tests run: 2, Failures: 0, Errors: 0, Skipped: 0, Time elapsed: 0.036 sec
Running org.apache.wss4j.dom.message.EncryptedDataInHeaderTest
Tests run: 1, Failures: 0, Errors: 0, Skipped: 0, Time elapsed: 0.021 sec
Running org.apache.wss4j.dom.message.CertErrorTest
Tests run: 2, Failures: 0, Errors: 0, Skipped: 0, Time elapsed: 0.02 sec
Running org.apache.wss4j.dom.message.STRSignatureTest
Tests run: 4, Failures: 0, Errors: 0, Skipped: 0, Time elapsed: 0.074 sec
Running org.apache.wss4j.dom.message.NoSoapPrefixSignatureTest
Tests run: 1, Failures: 0, Errors: 0, Skipped: 0, Time elapsed: 0.016 sec
Running org.apache.wss4j.dom.message.EncryptionPartsTest
Tests run: 10, Failures: 0, Errors: 0, Skipped: 0, Time elapsed: 0.151 sec
Running org.apache.wss4j.dom.message.SignatureAlgorithmSuiteTest
Tests run: 5, Failures: 0, Errors: 0, Skipped: 0, Time elapsed: 0.109 sec
Running org.apache.wss4j.dom.message.SecurityContextTokenTest
Tests run: 7, Failures: 0, Errors: 0, Skipped: 0, Time elapsed: 0.061 sec
Running org.apache.wss4j.dom.message.EncryptionGCMTest
Tests run: 3, Failures: 0, Errors: 0, Skipped: 0, Time elapsed: 0.043 sec
Running org.apache.wss4j.dom.message.SignaturePartsTest
Tests run: 10, Failures: 0, Errors: 0, Skipped: 0, Time elapsed: 0.2 sec
Running org.apache.wss4j.dom.message.TimestampTest
Tests run: 16, Failures: 0, Errors: 0, Skipped: 0, Time elapsed: 0.035 sec
Running org.apache.wss4j.dom.message.EncryptionTest
Tests run: 12, Failures: 0, Errors: 0, Skipped: 0, Time elapsed: 0.138 sec
Running org.apache.wss4j.dom.message.SKISignatureTest
Tests run: 3, Failures: 0, Errors: 0, Skipped: 0, Time elapsed: 0.048 sec
Running org.apache.wss4j.dom.message.RequireSignedEncryptedDataElementsTest
Tests run: 7, Failures: 0, Errors: 0, Skipped: 0, Time elapsed: 0 sec
Running org.apache.wss4j.dom.message.SignatureCRLTest
Tests run: 3, Failures: 0, Errors: 0, Skipped: 0, Time elapsed: 0 sec
Running org.apache.wss4j.dom.message.UTDerivedKeyTest
Tests run: 15, Failures: 0, Errors: 0, Skipped: 0, Time elapsed: 0.27 sec
Running org.apache.wss4j.dom.message.SymmetricSignatureTest
Tests run: 4, Failures: 0, Errors: 0, Skipped: 0, Time elapsed: 0.04 sec
Running org.apache.wss4j.dom.message.token.BSTKerberosTest
Tests run: 9, Failures: 0, Errors: 0, Skipped: 0, Time elapsed: 0.109 sec
Running org.apache.wss4j.dom.message.token.SecurityTokenReferenceTest
Tests run: 8, Failures: 0, Errors: 0, Skipped: 0, Time elapsed: 0.006 sec
Running org.apache.wss4j.dom.message.token.ReferenceTest
Tests run: 4, Failures: 0, Errors: 0, Skipped: 0, Time elapsed: 0.012 sec
Running org.apache.wss4j.dom.message.token.BinarySecurityTokenTest
Tests run: 3, Failures: 0, Errors: 0, Skipped: 0, Time elapsed: 0.006 sec
Running org.apache.wss4j.dom.message.token.WCFUsernameTokenTest
Tests run: 2, Failures: 0, Errors: 0, Skipped: 0, Time elapsed: 0.006 sec
Running org.apache.wss4j.dom.message.token.DerivedKeyTokenTest
Tests run: 2, Failures: 0, Errors: 0, Skipped: 0, Time elapsed: 0.006 sec
Running org.apache.wss4j.dom.message.SignatureCertTest
Tests run: 6, Failures: 0, Errors: 0, Skipped: 1, Time elapsed: 0.06 sec
Running org.apache.wss4j.dom.message.SignatureTest
Tests run: 23, Failures: 0, Errors: 0, Skipped: 0, Time elapsed: 0.447 sec
Running org.apache.wss4j.dom.message.UsernameTokenTest
Tests run: 30, Failures: 0, Errors: 0, Skipped: 0, Time elapsed: 0.154 sec
Running org.apache.wss4j.dom.message.SignatureKeyValueTest
Tests run: 3, Failures: 0, Errors: 0, Skipped: 0, Time elapsed: 0.067 sec
Running org.apache.wss4j.dom.message.SignedBSTTest
Tests run: 1, Failures: 0, Errors: 0, Skipped: 0, Time elapsed: 0.014 sec
Running org.apache.wss4j.dom.message.ModifiedRequestTest
[Fatal Error] :1:244: Invalid byte 1 of 1-byte UTF-8 sequence.
Tests run: 10, Failures: 0, Errors: 0, Skipped: 0, Time elapsed: 0.194 sec
Running org.apache.wss4j.dom.message.ReplayTest
Tests run: 8, Failures: 0, Errors: 0, Skipped: 0, Time elapsed: 0.152 sec
Running org.apache.wss4j.dom.message.PasswordTypeTest
Tests run: 3, Failures: 0, Errors: 0, Skipped: 0, Time elapsed: 0.033 sec
Running org.apache.wss4j.dom.components.crypto.CryptoTest
Tests run: 5, Failures: 0, Errors: 0, Skipped: 0, Time elapsed: 0.027 sec
Running org.apache.wss4j.dom.components.crypto.CryptoProviderTest
Tests run: 3, Failures: 0, Errors: 0, Skipped: 0, Time elapsed: 0.035 sec
Running org.apache.wss4j.dom.components.crypto.CertificateStoreTest
Tests run: 6, Failures: 0, Errors: 0, Skipped: 0, Time elapsed: 0.077 sec

Results :

Tests run: 367, Failures: 0, Errors: 0, Skipped: 1

[JENKINS] Recording test results
[INFO] [jar:jar {execution: default-jar}]
[INFO] Building jar: <https://builds.apache.org/job/wss4j-trunk/ws/wss4j/ws-security-dom/target/wss4j-ws-security-dom-2.0-SNAPSHOT.jar>
[INFO] Preparing source:jar
[WARNING] Removing: jar from forked lifecycle, to prevent recursive invocation.
[WARNING] Removing: check from forked lifecycle, to prevent recursive invocation.
[JENKINS] Archiving <https://builds.apache.org/job/wss4j-trunk/ws/wss4j/ws-security-dom/target/wss4j-ws-security-dom-2.0-SNAPSHOT.jar>
to /home/hudson/hudson/jobs/wss4j-trunk/modules/org.apache.wss4j$wss4j-ws-security-dom/builds/2013-07-09_11-23-46/archive/org.apache.wss4j/wss4j-ws-security-dom/2.0-SNAPSHOT/wss4j-ws-security-dom-2.0-SNAPSHOT.jar
[INFO] [bundle:cleanVersions {execution: versions}]
[INFO] [source:jar {execution: default}]
[INFO] Building jar: <https://builds.apache.org/job/wss4j-trunk/ws/wss4j/ws-security-dom/target/wss4j-ws-security-dom-2.0-SNAPSHOT-sources.jar>
[INFO] [jar:test-jar {execution: default}]
[INFO] Building jar: <https://builds.apache.org/job/wss4j-trunk/ws/wss4j/ws-security-dom/target/wss4j-ws-security-dom-2.0-SNAPSHOT-tests.jar>
[INFO] [install:install {execution: default-install}]
[INFO] Installing <https://builds.apache.org/job/wss4j-trunk/ws/wss4j/ws-security-dom/target/wss4j-ws-security-dom-2.0-SNAPSHOT.jar>
to /home/jenkins/jenkins-slave/maven-repositories/0/org/apache/wss4j/wss4j-ws-security-dom/2.0-SNAPSHOT/wss4j-ws-security-dom-2.0-SNAPSHOT.jar
[INFO] Installing <https://builds.apache.org/job/wss4j-trunk/ws/wss4j/ws-security-dom/target/wss4j-ws-security-dom-2.0-SNAPSHOT-sources.jar>
to /home/jenkins/jenkins-slave/maven-repositories/0/org/apache/wss4j/wss4j-ws-security-dom/2.0-SNAPSHOT/wss4j-ws-security-dom-2.0-SNAPSHOT-sources.jar
[INFO] Installing <https://builds.apache.org/job/wss4j-trunk/ws/wss4j/ws-security-dom/target/wss4j-ws-security-dom-2.0-SNAPSHOT-tests.jar>
to /home/jenkins/jenkins-slave/maven-repositories/0/org/apache/wss4j/wss4j-ws-security-dom/2.0-SNAPSHOT/wss4j-ws-security-dom-2.0-SNAPSHOT-tests.jar
[INFO] Preparing pmd:check
[JENKINS] Archiving <https://builds.apache.org/job/wss4j-trunk/ws/wss4j/ws-security-dom/target/wss4j-ws-security-dom-2.0-SNAPSHOT-sources.jar>
to /home/hudson/hudson/jobs/wss4j-trunk/modules/org.apache.wss4j$wss4j-ws-security-dom/builds/2013-07-09_11-23-46/archive/org.apache.wss4j/wss4j-ws-security-dom/2.0-SNAPSHOT/wss4j-ws-security-dom-2.0-SNAPSHOT-sources.jar
[JENKINS] Archiving <https://builds.apache.org/job/wss4j-trunk/ws/wss4j/ws-security-dom/target/wss4j-ws-security-dom-2.0-SNAPSHOT-tests.jar>
to /home/hudson/hudson/jobs/wss4j-trunk/modules/org.apache.wss4j$wss4j-ws-security-dom/builds/2013-07-09_11-23-46/archive/org.apache.wss4j/wss4j-ws-security-dom/2.0-SNAPSHOT/wss4j-ws-security-dom-2.0-SNAPSHOT-tests.jar
[INFO] [pmd:pmd {execution: pmd}]
[INFO] [pmd:check {execution: validate}]
[INFO] 
[INFO] [bundle:cleanVersions {execution: versions}]
[WARNING] The parameter expression: 'project.build.resources' used in mojo: 'process' has
been deprecated. Use 'project.resources' instead.
[INFO] [remote-resources:process {execution: default}]
[debug] execute contextualize
[INFO] [resources:resources {execution: default-resources}]
[INFO] Using 'UTF-8' encoding to copy filtered resources.
[INFO] Copying 0 resource
[INFO] Copying 1 resource
[INFO] Copying 3 resources
[INFO] Copying 3 resources
[INFO] [compiler:compile {execution: default-compile}]
[INFO] Nothing to compile - all classes are up to date
[INFO] [bundle:manifest {execution: bundle-manifest}]
[debug] execute contextualize
[INFO] [resources:testResources {execution: default-testResources}]
[INFO] Using 'UTF-8' encoding to copy filtered resources.
[INFO] Copying 0 resource
[INFO] Copying 64 resources
[INFO] Copying 3 resources
[INFO] Copying 3 resources
[INFO] [compiler:testCompile {execution: default-testCompile}]
[INFO] Nothing to compile - all classes are up to date
[INFO] [surefire:test {execution: default-test}]
[INFO] Skipping execution of surefire because it has already been run for this configuration
[JENKINS] Recording test results
[INFO] [jar:jar {execution: default-jar}]
[INFO] Building jar: <https://builds.apache.org/job/wss4j-trunk/ws/wss4j/ws-security-dom/target/wss4j-ws-security-dom-2.0-SNAPSHOT.jar>
[INFO] Preparing source:jar
[WARNING] Removing: jar from forked lifecycle, to prevent recursive invocation.
[WARNING] Removing: check from forked lifecycle, to prevent recursive invocation.
[JENKINS] Re-archiving <https://builds.apache.org/job/wss4j-trunk/ws/wss4j/ws-security-dom/target/wss4j-ws-security-dom-2.0-SNAPSHOT.jar>
[INFO] [bundle:cleanVersions {execution: versions}]
[INFO] [source:jar {execution: default}]
[INFO] Building jar: <https://builds.apache.org/job/wss4j-trunk/ws/wss4j/ws-security-dom/target/wss4j-ws-security-dom-2.0-SNAPSHOT-sources.jar>
[INFO] [jar:test-jar {execution: default}]
[INFO] Building jar: <https://builds.apache.org/job/wss4j-trunk/ws/wss4j/ws-security-dom/target/wss4j-ws-security-dom-2.0-SNAPSHOT-tests.jar>
[INFO] [install:install {execution: default-install}]
[INFO] Installing <https://builds.apache.org/job/wss4j-trunk/ws/wss4j/ws-security-dom/target/wss4j-ws-security-dom-2.0-SNAPSHOT.jar>
to /home/jenkins/jenkins-slave/maven-repositories/0/org/apache/wss4j/wss4j-ws-security-dom/2.0-SNAPSHOT/wss4j-ws-security-dom-2.0-SNAPSHOT.jar
[INFO] Installing <https://builds.apache.org/job/wss4j-trunk/ws/wss4j/ws-security-dom/target/wss4j-ws-security-dom-2.0-SNAPSHOT-sources.jar>
to /home/jenkins/jenkins-slave/maven-repositories/0/org/apache/wss4j/wss4j-ws-security-dom/2.0-SNAPSHOT/wss4j-ws-security-dom-2.0-SNAPSHOT-sources.jar
[INFO] Installing <https://builds.apache.org/job/wss4j-trunk/ws/wss4j/ws-security-dom/target/wss4j-ws-security-dom-2.0-SNAPSHOT-tests.jar>
to /home/jenkins/jenkins-slave/maven-repositories/0/org/apache/wss4j/wss4j-ws-security-dom/2.0-SNAPSHOT/wss4j-ws-security-dom-2.0-SNAPSHOT-tests.jar
[INFO] Installing <https://builds.apache.org/job/wss4j-trunk/ws/wss4j/ws-security-dom/target/wss4j-ws-security-dom-2.0-SNAPSHOT-sources.jar>
to /home/jenkins/jenkins-slave/maven-repositories/0/org/apache/wss4j/wss4j-ws-security-dom/2.0-SNAPSHOT/wss4j-ws-security-dom-2.0-SNAPSHOT-sources.jar
[INFO] Installing <https://builds.apache.org/job/wss4j-trunk/ws/wss4j/ws-security-dom/target/wss4j-ws-security-dom-2.0-SNAPSHOT-tests.jar>
to /home/jenkins/jenkins-slave/maven-repositories/0/org/apache/wss4j/wss4j-ws-security-dom/2.0-SNAPSHOT/wss4j-ws-security-dom-2.0-SNAPSHOT-tests.jar
[INFO] [deploy:deploy {execution: default-deploy}]
[INFO] Retrieving previous build number from apache.snapshots.https
[WARNING] *** CHECKSUM FAILED - Checksum failed on download: local = 'd68d7918e0a8356b8fd7f730d64ae059e33269ee';
remote = 'c9004adf3f2d78200832d36bbd81d479d75a8eef' - RETRYING
[WARNING] *** CHECKSUM FAILED - Checksum failed on download: local = 'd68d7918e0a8356b8fd7f730d64ae059e33269ee';
remote = 'c9004adf3f2d78200832d36bbd81d479d75a8eef' - IGNORING
Uploading: https://repository.apache.org/content/repositories/snapshots/org/apache/wss4j/wss4j-ws-security-dom/2.0-SNAPSHOT/wss4j-ws-security-dom-2.0-20130709.112441-129.jar
295K uploaded  (wss4j-ws-security-dom-2.0-20130709.112441-129.jar)
[INFO] Uploading project information for wss4j-ws-security-dom 2.0-20130709.112441-129
[INFO] Retrieving previous metadata from apache.snapshots.https
[INFO] Uploading repository metadata for: 'artifact org.apache.wss4j:wss4j-ws-security-dom'
[INFO] Retrieving previous metadata from apache.snapshots.https
[WARNING] *** CHECKSUM FAILED - Checksum failed on download: local = 'd68d7918e0a8356b8fd7f730d64ae059e33269ee';
remote = 'c9004adf3f2d78200832d36bbd81d479d75a8eef' - RETRYING
[WARNING] *** CHECKSUM FAILED - Checksum failed on download: local = 'd68d7918e0a8356b8fd7f730d64ae059e33269ee';
remote = 'c9004adf3f2d78200832d36bbd81d479d75a8eef' - IGNORING
[INFO] Uploading repository metadata for: 'snapshot org.apache.wss4j:wss4j-ws-security-dom:2.0-SNAPSHOT'
[INFO] Retrieving previous build number from apache.snapshots.https
Uploading: https://repository.apache.org/content/repositories/snapshots/org/apache/wss4j/wss4j-ws-security-dom/2.0-SNAPSHOT/wss4j-ws-security-dom-2.0-20130709.112441-129-sources.jar
249K uploaded  (wss4j-ws-security-dom-2.0-20130709.112441-129-sources.jar)
[INFO] Retrieving previous build number from apache.snapshots.https
Uploading: https://repository.apache.org/content/repositories/snapshots/org/apache/wss4j/wss4j-ws-security-dom/2.0-SNAPSHOT/wss4j-ws-security-dom-2.0-20130709.112441-129-tests.jar
379K uploaded  (wss4j-ws-security-dom-2.0-20130709.112441-129-tests.jar)
[INFO] Retrieving previous build number from apache.snapshots.https
Uploading: https://repository.apache.org/content/repositories/snapshots/org/apache/wss4j/wss4j-ws-security-dom/2.0-SNAPSHOT/wss4j-ws-security-dom-2.0-20130709.112441-129-sources.jar
249K uploaded  (wss4j-ws-security-dom-2.0-20130709.112441-129-sources.jar)
[INFO] Retrieving previous build number from apache.snapshots.https
Uploading: https://repository.apache.org/content/repositories/snapshots/org/apache/wss4j/wss4j-ws-security-dom/2.0-SNAPSHOT/wss4j-ws-security-dom-2.0-20130709.112441-129-tests.jar
379K uploaded  (wss4j-ws-security-dom-2.0-20130709.112441-129-tests.jar)
[JENKINS] Archiving <https://builds.apache.org/job/wss4j-trunk/ws/wss4j/ws-security-dom/target/wss4j-ws-security-dom-2.0-SNAPSHOT.jar>
to /home/hudson/hudson/jobs/wss4j-trunk/modules/org.apache.wss4j$wss4j-ws-security-dom/builds/2013-07-09_11-23-46/archive/org.apache.wss4j/wss4j-ws-security-dom/2.0-20130709.112441-129/wss4j-ws-security-dom-2.0-20130709.112441-129.jar
[JENKINS] Archiving <https://builds.apache.org/job/wss4j-trunk/ws/wss4j/ws-security-dom/target/wss4j-ws-security-dom-2.0-SNAPSHOT-sources.jar>
to /home/hudson/hudson/jobs/wss4j-trunk/modules/org.apache.wss4j$wss4j-ws-security-dom/builds/2013-07-09_11-23-46/archive/org.apache.wss4j/wss4j-ws-security-dom/2.0-20130709.112441-129/wss4j-ws-security-dom-2.0-20130709.112441-129-sources.jar
[JENKINS] Archiving <https://builds.apache.org/job/wss4j-trunk/ws/wss4j/ws-security-dom/target/wss4j-ws-security-dom-2.0-SNAPSHOT-tests.jar>
to /home/hudson/hudson/jobs/wss4j-trunk/modules/org.apache.wss4j$wss4j-ws-security-dom/builds/2013-07-09_11-23-46/archive/org.apache.wss4j/wss4j-ws-security-dom/2.0-20130709.112441-129/wss4j-ws-security-dom-2.0-20130709.112441-129-tests.jar
[INFO] ------------------------------------------------------------------------
[INFO] Building Apache WSS4J Streaming WS-Security
[INFO]    task-segment: [clean, install, deploy]
[INFO] ------------------------------------------------------------------------
[INFO] [clean:clean {execution: default-clean}]
[INFO] Deleting <https://builds.apache.org/job/wss4j-trunk/ws/wss4j/ws-security-stax/target>
[INFO] Preparing pmd:check
[JENKINS] Archiving <https://builds.apache.org/job/wss4j-trunk/ws/wss4j/ws-security-stax/pom.xml>
to /home/hudson/hudson/jobs/wss4j-trunk/modules/org.apache.wss4j$wss4j-ws-security-stax/builds/2013-07-09_11-23-46/archive/org.apache.wss4j/wss4j-ws-security-stax/2.0-SNAPSHOT/wss4j-ws-security-stax-2.0-SNAPSHOT.pom
[INFO] [pmd:pmd {execution: pmd}]
ERROR: Maven JVM terminated unexpectedly with exit code 143


---------------------------------------------------------------------
To unsubscribe, e-mail: dev-unsubscribe@ws.apache.org
For additional commands, e-mail: dev-help@ws.apache.org


Mime
View raw message