ws-dev mailing list archives

Site index · List index
Message view « Date » · « Thread »
Top « Date » · « Thread »
From Apache Jenkins Server <jenk...@builds.apache.org>
Subject Build failed in Jenkins: wss4j-trunk #605
Date Mon, 30 Sep 2013 10:51:56 GMT
See <https://builds.apache.org/job/wss4j-trunk/605/changes>

Changes:

[coheigea] Adding a configuration tag for HandlerAction objects

------------------------------------------
[...truncated 1349 lines...]
ERROR: Could not find local repository for 2.2.1
[INFO] [source:jar {execution: default}]
[INFO] Building jar: <https://builds.apache.org/job/wss4j-trunk/ws/wss4j/ws-security-dom/target/wss4j-ws-security-dom-2.0-SNAPSHOT-sources.jar>
[INFO] [jar:test-jar {execution: default}]
[INFO] Building jar: <https://builds.apache.org/job/wss4j-trunk/ws/wss4j/ws-security-dom/target/wss4j-ws-security-dom-2.0-SNAPSHOT-tests.jar>
[INFO] [install:install {execution: default-install}]
[INFO] Installing <https://builds.apache.org/job/wss4j-trunk/ws/wss4j/ws-security-dom/target/wss4j-ws-security-dom-2.0-SNAPSHOT.jar>
to /home/jenkins/jenkins-slave/maven-repositories/1/org/apache/wss4j/wss4j-ws-security-dom/2.0-SNAPSHOT/wss4j-ws-security-dom-2.0-SNAPSHOT.jar
[INFO] Installing <https://builds.apache.org/job/wss4j-trunk/ws/wss4j/ws-security-dom/target/wss4j-ws-security-dom-2.0-SNAPSHOT-sources.jar>
to /home/jenkins/jenkins-slave/maven-repositories/1/org/apache/wss4j/wss4j-ws-security-dom/2.0-SNAPSHOT/wss4j-ws-security-dom-2.0-SNAPSHOT-sources.jar
[INFO] Installing <https://builds.apache.org/job/wss4j-trunk/ws/wss4j/ws-security-dom/target/wss4j-ws-security-dom-2.0-SNAPSHOT-tests.jar>
to /home/jenkins/jenkins-slave/maven-repositories/1/org/apache/wss4j/wss4j-ws-security-dom/2.0-SNAPSHOT/wss4j-ws-security-dom-2.0-SNAPSHOT-tests.jar
[INFO] Installing <https://builds.apache.org/job/wss4j-trunk/ws/wss4j/ws-security-dom/target/wss4j-ws-security-dom-2.0-SNAPSHOT-sources.jar>
to /home/jenkins/jenkins-slave/maven-repositories/1/org/apache/wss4j/wss4j-ws-security-dom/2.0-SNAPSHOT/wss4j-ws-security-dom-2.0-SNAPSHOT-sources.jar
[INFO] Installing <https://builds.apache.org/job/wss4j-trunk/ws/wss4j/ws-security-dom/target/wss4j-ws-security-dom-2.0-SNAPSHOT-tests.jar>
to /home/jenkins/jenkins-slave/maven-repositories/1/org/apache/wss4j/wss4j-ws-security-dom/2.0-SNAPSHOT/wss4j-ws-security-dom-2.0-SNAPSHOT-tests.jar
[INFO] [deploy:deploy {execution: default-deploy}]
[INFO] Retrieving previous build number from apache.snapshots.https
[WARNING] *** CHECKSUM FAILED - Checksum failed on download: local = '9db2c260c0562a037d8753e5ff5d6db4f63c3756';
remote = 'da33d422137b395b60314ac3839ef86a723c3c1b' - RETRYING
[JENKINS] Archiving <https://builds.apache.org/job/wss4j-trunk/ws/wss4j/ws-security-dom/target/wss4j-ws-security-dom-2.0-SNAPSHOT.jar>
to /home/hudson/hudson/jobs/wss4j-trunk/modules/org.apache.wss4j$wss4j-ws-security-dom/builds/2013-09-30_10-43-28/archive/org.apache.wss4j/wss4j-ws-security-dom/2.0-20130930.104401-198/wss4j-ws-security-dom-2.0-20130930.104401-198.jar[WARNING]
*** CHECKSUM FAILED - Checksum failed on download: local = '9db2c260c0562a037d8753e5ff5d6db4f63c3756';
remote = 'da33d422137b395b60314ac3839ef86a723c3c1b' - IGNORING
Uploading: https://repository.apache.org/content/repositories/snapshots/org/apache/wss4j/wss4j-ws-security-dom/2.0-SNAPSHOT/wss4j-ws-security-dom-2.0-20130930.104401-198.jar

296K uploaded  (wss4j-ws-security-dom-2.0-20130930.104401-198.jar)
[INFO] Uploading project information for wss4j-ws-security-dom 2.0-20130930.104401-198
[INFO] Retrieving previous metadata from apache.snapshots.https
[INFO] Uploading repository metadata for: 'artifact org.apache.wss4j:wss4j-ws-security-dom'
[INFO] Retrieving previous metadata from apache.snapshots.https
[WARNING] *** CHECKSUM FAILED - Checksum failed on download: local = '9db2c260c0562a037d8753e5ff5d6db4f63c3756';
remote = 'da33d422137b395b60314ac3839ef86a723c3c1b' - RETRYING
[WARNING] *** CHECKSUM FAILED - Checksum failed on download: local = '9db2c260c0562a037d8753e5ff5d6db4f63c3756';
remote = 'da33d422137b395b60314ac3839ef86a723c3c1b' - IGNORING
[INFO] Uploading repository metadata for: 'snapshot org.apache.wss4j:wss4j-ws-security-dom:2.0-SNAPSHOT'
[INFO] Retrieving previous build number from apache.snapshots.https
Uploading: https://repository.apache.org/content/repositories/snapshots/org/apache/wss4j/wss4j-ws-security-dom/2.0-SNAPSHOT/wss4j-ws-security-dom-2.0-20130930.104401-198-sources.jar
249K uploaded  (wss4j-ws-security-dom-2.0-20130930.104401-198-sources.jar)
[INFO] Retrieving previous build number from apache.snapshots.https
Uploading: https://repository.apache.org/content/repositories/snapshots/org/apache/wss4j/wss4j-ws-security-dom/2.0-SNAPSHOT/wss4j-ws-security-dom-2.0-20130930.104401-198-tests.jar
400K uploaded  (wss4j-ws-security-dom-2.0-20130930.104401-198-tests.jar)
[INFO] Retrieving previous build number from apache.snapshots.https
Uploading: https://repository.apache.org/content/repositories/snapshots/org/apache/wss4j/wss4j-ws-security-dom/2.0-SNAPSHOT/wss4j-ws-security-dom-2.0-20130930.104401-198-sources.jar
249K uploaded  (wss4j-ws-security-dom-2.0-20130930.104401-198-sources.jar)
[INFO] Retrieving previous build number from apache.snapshots.https
Uploading: https://repository.apache.org/content/repositories/snapshots/org/apache/wss4j/wss4j-ws-security-dom/2.0-SNAPSHOT/wss4j-ws-security-dom-2.0-20130930.104401-198-tests.jar
400K uploaded  (wss4j-ws-security-dom-2.0-20130930.104401-198-tests.jar)
[JENKINS] Archiving <https://builds.apache.org/job/wss4j-trunk/ws/wss4j/ws-security-dom/target/wss4j-ws-security-dom-2.0-SNAPSHOT-sources.jar>
to /home/hudson/hudson/jobs/wss4j-trunk/modules/org.apache.wss4j$wss4j-ws-security-dom/builds/2013-09-30_10-43-28/archive/org.apache.wss4j/wss4j-ws-security-dom/2.0-20130930.104401-198/wss4j-ws-security-dom-2.0-20130930.104401-198-sources.jar
[JENKINS] Archiving <https://builds.apache.org/job/wss4j-trunk/ws/wss4j/ws-security-dom/target/wss4j-ws-security-dom-2.0-SNAPSHOT-tests.jar>
to /home/hudson/hudson/jobs/wss4j-trunk/modules/org.apache.wss4j$wss4j-ws-security-dom/builds/2013-09-30_10-43-28/archive/org.apache.wss4j/wss4j-ws-security-dom/2.0-20130930.104401-198/wss4j-ws-security-dom-2.0-20130930.104401-198-tests.jar
[INFO] ------------------------------------------------------------------------
[INFO] Building Apache WSS4J Streaming WS-Security
[INFO]    task-segment: [clean, install, deploy]
[INFO] ------------------------------------------------------------------------
[INFO] [clean:clean {execution: default-clean}]
[JENKINS] Archiving <https://builds.apache.org/job/wss4j-trunk/ws/wss4j/ws-security-stax/pom.xml>
to /home/hudson/hudson/jobs/wss4j-trunk/modules/org.apache.wss4j$wss4j-ws-security-stax/builds/2013-09-30_10-43-28/archive/org.apache.wss4j/wss4j-ws-security-stax/2.0-SNAPSHOT/wss4j-ws-security-stax-2.0-SNAPSHOT.pom[INFO]
Deleting <https://builds.apache.org/job/wss4j-trunk/ws/wss4j/ws-security-stax/target>
[INFO] Preparing pmd:check
[INFO] snapshot org.apache.wss4j:wss4j-bindings-wss11:2.0-SNAPSHOT: checking for updates from
apache.snapshots
Downloading: http://repository.apache.org/snapshots/org/apache/wss4j/wss4j-bindings-wss11/2.0-SNAPSHOT/wss4j-bindings-wss11-2.0-20130930.104848-207.jar
32K downloaded  (wss4j-bindings-wss11-2.0-20130930.104848-207.jar)

[INFO] snapshot org.apache.wss4j:wss4j-bindings-wssc:2.0-SNAPSHOT: checking for updates from
apache.snapshots
Downloading: http://repository.apache.org/snapshots/org/apache/wss4j/wss4j-bindings-wssc/2.0-SNAPSHOT/wss4j-bindings-wssc-2.0-20130930.104902-206.jar
59K downloaded  (wss4j-bindings-wssc-2.0-20130930.104902-206.jar)
[INFO] snapshot org.apache.wss4j:wss4j-ws-security-dom:2.0-SNAPSHOT: checking for updates
from apache.snapshots
[INFO] [pmd:pmd {execution: pmd}]
ERROR: Could not find local repository for 2.2.1
[INFO] [pmd:check {execution: validate}]
[INFO] 
[INFO] [bundle:cleanVersions {execution: versions}]
[WARNING] The parameter expression: 'project.build.resources' used in mojo: 'process' has
been deprecated. Use 'project.resources' instead.
[INFO] [remote-resources:process {execution: default}]
[debug] execute contextualize
[INFO] [resources:resources {execution: default-resources}]
[INFO] Using 'UTF-8' encoding to copy filtered resources.
[INFO] Copying 0 resource
[INFO] Copying 3 resources
[INFO] skip non existing resourceDirectory <https://builds.apache.org/job/wss4j-trunk/ws/wss4j/ws-security-stax/src/main/resources-filtered>
[INFO] skip non existing resourceDirectory <https://builds.apache.org/job/wss4j-trunk/ws/wss4j/ws-security-stax/target/generated/src/main/resources>
[INFO] Copying 3 resources
[INFO] [compiler:compile {execution: default-compile}]
[INFO] Changes detected - recompiling the module!
[INFO] Compiling 119 source files to <https://builds.apache.org/job/wss4j-trunk/ws/wss4j/ws-security-stax/target/classes>
[INFO] [bundle:manifest {execution: bundle-manifest}]
[debug] execute contextualize
[INFO] [resources:testResources {execution: default-testResources}]
[INFO] Using 'UTF-8' encoding to copy filtered resources.
[INFO] Copying 0 resource
[INFO] Copying 18 resources
[INFO] skip non existing resourceDirectory <https://builds.apache.org/job/wss4j-trunk/ws/wss4j/ws-security-stax/target/generated/src/test/resources>
[INFO] Copying 3 resources
[INFO] [compiler:testCompile {execution: default-testCompile}]
[INFO] Changes detected - recompiling the module!
[INFO] Compiling 41 source files to <https://builds.apache.org/job/wss4j-trunk/ws/wss4j/ws-security-stax/target/test-classes>
[INFO] [surefire:test {execution: default-test}]
[INFO] Surefire report directory: <https://builds.apache.org/job/wss4j-trunk/ws/wss4j/ws-security-stax/target/surefire-reports>

-------------------------------------------------------
 T E S T S
-------------------------------------------------------
Running TestSuite
Configuring TestNG with: TestNG652Configurator
Tests run: 394, Failures: 0, Errors: 0, Skipped: 0, Time elapsed: 39.29 sec - in TestSuite

Results :

Tests run: 394, Failures: 0, Errors: 0, Skipped: 0

[JENKINS] Recording test results
[INFO] [jar:jar {execution: default-jar}]
[INFO] Building jar: <https://builds.apache.org/job/wss4j-trunk/ws/wss4j/ws-security-stax/target/wss4j-ws-security-stax-2.0-SNAPSHOT.jar>
[INFO] Preparing source:jar
[WARNING] Removing: jar from forked lifecycle, to prevent recursive invocation.
[WARNING] Removing: check from forked lifecycle, to prevent recursive invocation.
[JENKINS] Archiving <https://builds.apache.org/job/wss4j-trunk/ws/wss4j/ws-security-stax/target/wss4j-ws-security-stax-2.0-SNAPSHOT.jar>
to /home/hudson/hudson/jobs/wss4j-trunk/modules/org.apache.wss4j$wss4j-ws-security-stax/builds/2013-09-30_10-43-28/archive/org.apache.wss4j/wss4j-ws-security-stax/2.0-SNAPSHOT/wss4j-ws-security-stax-2.0-SNAPSHOT.jar
[INFO] [bundle:cleanVersions {execution: versions}]
ERROR: Could not find local repository for 2.2.1
[INFO] [source:jar {execution: default}]
[INFO] Building jar: <https://builds.apache.org/job/wss4j-trunk/ws/wss4j/ws-security-stax/target/wss4j-ws-security-stax-2.0-SNAPSHOT-sources.jar>
[INFO] [jar:test-jar {execution: default}]
[INFO] Building jar: <https://builds.apache.org/job/wss4j-trunk/ws/wss4j/ws-security-stax/target/wss4j-ws-security-stax-2.0-SNAPSHOT-tests.jar>
[JENKINS] Archiving <https://builds.apache.org/job/wss4j-trunk/ws/wss4j/ws-security-stax/target/wss4j-ws-security-stax-2.0-SNAPSHOT-sources.jar>
to /home/hudson/hudson/jobs/wss4j-trunk/modules/org.apache.wss4j$wss4j-ws-security-stax/builds/2013-09-30_10-43-28/archive/org.apache.wss4j/wss4j-ws-security-stax/2.0-SNAPSHOT/wss4j-ws-security-stax-2.0-SNAPSHOT-sources.jar[INFO]
[install:install {execution: default-install}]

[INFO] Installing <https://builds.apache.org/job/wss4j-trunk/ws/wss4j/ws-security-stax/target/wss4j-ws-security-stax-2.0-SNAPSHOT.jar>
to /home/jenkins/jenkins-slave/maven-repositories/1/org/apache/wss4j/wss4j-ws-security-stax/2.0-SNAPSHOT/wss4j-ws-security-stax-2.0-SNAPSHOT.jar
[INFO] Installing <https://builds.apache.org/job/wss4j-trunk/ws/wss4j/ws-security-stax/target/wss4j-ws-security-stax-2.0-SNAPSHOT-sources.jar>
to /home/jenkins/jenkins-slave/maven-repositories/1/org/apache/wss4j/wss4j-ws-security-stax/2.0-SNAPSHOT/wss4j-ws-security-stax-2.0-SNAPSHOT-sources.jar
[INFO] Installing <https://builds.apache.org/job/wss4j-trunk/ws/wss4j/ws-security-stax/target/wss4j-ws-security-stax-2.0-SNAPSHOT-tests.jar>
to /home/jenkins/jenkins-slave/maven-repositories/1/org/apache/wss4j/wss4j-ws-security-stax/2.0-SNAPSHOT/wss4j-ws-security-stax-2.0-SNAPSHOT-tests.jar
[INFO] Preparing pmd:check
[JENKINS] Archiving <https://builds.apache.org/job/wss4j-trunk/ws/wss4j/ws-security-stax/target/wss4j-ws-security-stax-2.0-SNAPSHOT-tests.jar>
to /home/hudson/hudson/jobs/wss4j-trunk/modules/org.apache.wss4j$wss4j-ws-security-stax/builds/2013-09-30_10-43-28/archive/org.apache.wss4j/wss4j-ws-security-stax/2.0-SNAPSHOT/wss4j-ws-security-stax-2.0-SNAPSHOT-tests.jar
[INFO] [pmd:pmd {execution: pmd}]
ERROR: Could not find local repository for 2.2.1
[INFO] [pmd:check {execution: validate}]
[INFO] 
[INFO] [bundle:cleanVersions {execution: versions}]
[JENKINS] Recording test results[WARNING] The parameter expression: 'project.build.resources'
used in mojo: 'process' has been deprecated. Use 'project.resources' instead.

[INFO] [remote-resources:process {execution: default}]
[debug] execute contextualize
[INFO] [resources:resources {execution: default-resources}]
[INFO] Using 'UTF-8' encoding to copy filtered resources.
[INFO] Copying 0 resource
[INFO] Copying 3 resources
[INFO] skip non existing resourceDirectory <https://builds.apache.org/job/wss4j-trunk/ws/wss4j/ws-security-stax/src/main/resources-filtered>
[INFO] skip non existing resourceDirectory <https://builds.apache.org/job/wss4j-trunk/ws/wss4j/ws-security-stax/target/generated/src/main/resources>
[INFO] Copying 3 resources
[INFO] Copying 3 resources
[INFO] [compiler:compile {execution: default-compile}]
[INFO] Nothing to compile - all classes are up to date
[INFO] [bundle:manifest {execution: bundle-manifest}]
[debug] execute contextualize
[INFO] [resources:testResources {execution: default-testResources}]
[INFO] Using 'UTF-8' encoding to copy filtered resources.
[INFO] Copying 0 resource
[INFO] Copying 18 resources
[INFO] skip non existing resourceDirectory <https://builds.apache.org/job/wss4j-trunk/ws/wss4j/ws-security-stax/target/generated/src/test/resources>
[INFO] Copying 3 resources
[INFO] Copying 3 resources
[INFO] [compiler:testCompile {execution: default-testCompile}]
[INFO] Nothing to compile - all classes are up to date
[INFO] [surefire:test {execution: default-test}]
[INFO] Skipping execution of surefire because it has already been run for this configuration
[INFO] [jar:jar {execution: default-jar}]
[INFO] Building jar: <https://builds.apache.org/job/wss4j-trunk/ws/wss4j/ws-security-stax/target/wss4j-ws-security-stax-2.0-SNAPSHOT.jar>
[INFO] Preparing source:jar
[WARNING] Removing: jar from forked lifecycle, to prevent recursive invocation.
[WARNING] Removing: check from forked lifecycle, to prevent recursive invocation.
[JENKINS] Re-archiving <https://builds.apache.org/job/wss4j-trunk/ws/wss4j/ws-security-stax/target/wss4j-ws-security-stax-2.0-SNAPSHOT.jar>
[INFO] [bundle:cleanVersions {execution: versions}]
ERROR: Could not find local repository for 2.2.1
[INFO] [source:jar {execution: default}]
[INFO] Building jar: <https://builds.apache.org/job/wss4j-trunk/ws/wss4j/ws-security-stax/target/wss4j-ws-security-stax-2.0-SNAPSHOT-sources.jar>
[INFO] [jar:test-jar {execution: default}]
[INFO] Building jar: <https://builds.apache.org/job/wss4j-trunk/ws/wss4j/ws-security-stax/target/wss4j-ws-security-stax-2.0-SNAPSHOT-tests.jar>
[INFO] [install:install {execution: default-install}]
[INFO] Installing <https://builds.apache.org/job/wss4j-trunk/ws/wss4j/ws-security-stax/target/wss4j-ws-security-stax-2.0-SNAPSHOT.jar>
to /home/jenkins/jenkins-slave/maven-repositories/1/org/apache/wss4j/wss4j-ws-security-stax/2.0-SNAPSHOT/wss4j-ws-security-stax-2.0-SNAPSHOT.jar
[INFO] Installing <https://builds.apache.org/job/wss4j-trunk/ws/wss4j/ws-security-stax/target/wss4j-ws-security-stax-2.0-SNAPSHOT-sources.jar>
to /home/jenkins/jenkins-slave/maven-repositories/1/org/apache/wss4j/wss4j-ws-security-stax/2.0-SNAPSHOT/wss4j-ws-security-stax-2.0-SNAPSHOT-sources.jar
[INFO] Installing <https://builds.apache.org/job/wss4j-trunk/ws/wss4j/ws-security-stax/target/wss4j-ws-security-stax-2.0-SNAPSHOT-tests.jar>
to /home/jenkins/jenkins-slave/maven-repositories/1/org/apache/wss4j/wss4j-ws-security-stax/2.0-SNAPSHOT/wss4j-ws-security-stax-2.0-SNAPSHOT-tests.jar
[INFO] Installing <https://builds.apache.org/job/wss4j-trunk/ws/wss4j/ws-security-stax/target/wss4j-ws-security-stax-2.0-SNAPSHOT-sources.jar>
to /home/jenkins/jenkins-slave/maven-repositories/1/org/apache/wss4j/wss4j-ws-security-stax/2.0-SNAPSHOT/wss4j-ws-security-stax-2.0-SNAPSHOT-sources.jar
[INFO] Installing <https://builds.apache.org/job/wss4j-trunk/ws/wss4j/ws-security-stax/target/wss4j-ws-security-stax-2.0-SNAPSHOT-tests.jar>
to /home/jenkins/jenkins-slave/maven-repositories/1/org/apache/wss4j/wss4j-ws-security-stax/2.0-SNAPSHOT/wss4j-ws-security-stax-2.0-SNAPSHOT-tests.jar
[INFO] [deploy:deploy {execution: default-deploy}]
[INFO] Retrieving previous build number from apache.snapshots.https
[WARNING] *** CHECKSUM FAILED - Checksum failed on download: local = '2ab60c9cec272c19ab24173f5edaf6f78a5a0c1e';
remote = '5597a8884f0aa7641bcc28e21c9219c74f77d701' - RETRYING
[JENKINS] Archiving <https://builds.apache.org/job/wss4j-trunk/ws/wss4j/ws-security-stax/target/wss4j-ws-security-stax-2.0-SNAPSHOT.jar>
to /home/hudson/hudson/jobs/wss4j-trunk/modules/org.apache.wss4j$wss4j-ws-security-stax/builds/2013-09-30_10-43-28/archive/org.apache.wss4j/wss4j-ws-security-stax/2.0-20130930.104401-191/wss4j-ws-security-stax-2.0-20130930.104401-191.jar[WARNING]
*** CHECKSUM FAILED - Checksum failed on download: local = '2ab60c9cec272c19ab24173f5edaf6f78a5a0c1e';
remote = '5597a8884f0aa7641bcc28e21c9219c74f77d701' - IGNORING

Uploading: https://repository.apache.org/content/repositories/snapshots/org/apache/wss4j/wss4j-ws-security-stax/2.0-SNAPSHOT/wss4j-ws-security-stax-2.0-20130930.104401-191.jar
330K uploaded  (wss4j-ws-security-stax-2.0-20130930.104401-191.jar)
[INFO] Uploading project information for wss4j-ws-security-stax 2.0-20130930.104401-191
[INFO] Retrieving previous metadata from apache.snapshots.https
[WARNING] *** CHECKSUM FAILED - Checksum failed on download: local = '2ab60c9cec272c19ab24173f5edaf6f78a5a0c1e';
remote = '5597a8884f0aa7641bcc28e21c9219c74f77d701' - RETRYING
[WARNING] *** CHECKSUM FAILED - Checksum failed on download: local = '2ab60c9cec272c19ab24173f5edaf6f78a5a0c1e';
remote = '5597a8884f0aa7641bcc28e21c9219c74f77d701' - IGNORING
[INFO] Uploading repository metadata for: 'snapshot org.apache.wss4j:wss4j-ws-security-stax:2.0-SNAPSHOT'
[INFO] Retrieving previous metadata from apache.snapshots.https
[INFO] Uploading repository metadata for: 'artifact org.apache.wss4j:wss4j-ws-security-stax'
[INFO] Retrieving previous build number from apache.snapshots.https
Uploading: https://repository.apache.org/content/repositories/snapshots/org/apache/wss4j/wss4j-ws-security-stax/2.0-SNAPSHOT/wss4j-ws-security-stax-2.0-20130930.104401-191-sources.jar
212K uploaded  (wss4j-ws-security-stax-2.0-20130930.104401-191-sources.jar)
[INFO] Retrieving previous build number from apache.snapshots.https
Uploading: https://repository.apache.org/content/repositories/snapshots/org/apache/wss4j/wss4j-ws-security-stax/2.0-SNAPSHOT/wss4j-ws-security-stax-2.0-20130930.104401-191-tests.jar
297K uploaded  (wss4j-ws-security-stax-2.0-20130930.104401-191-tests.jar)
[INFO] Retrieving previous build number from apache.snapshots.https
Uploading: https://repository.apache.org/content/repositories/snapshots/org/apache/wss4j/wss4j-ws-security-stax/2.0-SNAPSHOT/wss4j-ws-security-stax-2.0-20130930.104401-191-sources.jar
212K uploaded  (wss4j-ws-security-stax-2.0-20130930.104401-191-sources.jar)
[INFO] Retrieving previous build number from apache.snapshots.https
Uploading: https://repository.apache.org/content/repositories/snapshots/org/apache/wss4j/wss4j-ws-security-stax/2.0-SNAPSHOT/wss4j-ws-security-stax-2.0-20130930.104401-191-tests.jar
297K uploaded  (wss4j-ws-security-stax-2.0-20130930.104401-191-tests.jar)
[JENKINS] Archiving <https://builds.apache.org/job/wss4j-trunk/ws/wss4j/ws-security-stax/target/wss4j-ws-security-stax-2.0-SNAPSHOT-sources.jar>
to /home/hudson/hudson/jobs/wss4j-trunk/modules/org.apache.wss4j$wss4j-ws-security-stax/builds/2013-09-30_10-43-28/archive/org.apache.wss4j/wss4j-ws-security-stax/2.0-20130930.104401-191/wss4j-ws-security-stax-2.0-20130930.104401-191-sources.jar
[JENKINS] Archiving <https://builds.apache.org/job/wss4j-trunk/ws/wss4j/ws-security-stax/target/wss4j-ws-security-stax-2.0-SNAPSHOT-tests.jar>
to /home/hudson/hudson/jobs/wss4j-trunk/modules/org.apache.wss4j$wss4j-ws-security-stax/builds/2013-09-30_10-43-28/archive/org.apache.wss4j/wss4j-ws-security-stax/2.0-20130930.104401-191/wss4j-ws-security-stax-2.0-20130930.104401-191-tests.jar
[INFO] ------------------------------------------------------------------------
[INFO] Building Apache WSS4J WS-Security Integration
[INFO]    task-segment: [clean, install, deploy]
[INFO] ------------------------------------------------------------------------
[INFO] [clean:clean {execution: default-clean}]
[JENKINS] Archiving <https://builds.apache.org/job/wss4j-trunk/ws/wss4j/integration/pom.xml>
to /home/hudson/hudson/jobs/wss4j-trunk/modules/org.apache.wss4j$integration/builds/2013-09-30_10-43-28/archive/org.apache.wss4j/integration/2.0-SNAPSHOT/integration-2.0-SNAPSHOT.pom[INFO]
Deleting <https://builds.apache.org/job/wss4j-trunk/ws/wss4j/integration/target>
[INFO] Preparing pmd:check

[INFO] snapshot org.apache.wss4j:wss4j-ws-security-stax:2.0-SNAPSHOT: checking for updates
from apache.snapshots
Downloading: http://repository.apache.org/snapshots/org/apache/wss4j/wss4j-ws-security-stax/2.0-SNAPSHOT/wss4j-ws-security-stax-2.0-20130930.105108-192.jar
334K downloaded  (wss4j-ws-security-stax-2.0-20130930.105108-192.jar)
Downloading: http://repository.apache.org/snapshots/org/apache/wss4j/wss4j-ws-security-stax/2.0-SNAPSHOT/wss4j-ws-security-stax-2.0-20130930.105108-192-tests.jar
[INFO] ------------------------------------------------------------------------
[ERROR] BUILD ERROR
[INFO] ------------------------------------------------------------------------
[INFO] Failed to resolve artifact.

Missing:
----------
1) org.apache.wss4j:wss4j-ws-security-stax:jar:tests:2.0-SNAPSHOT

  Try downloading the file manually from the project website.

  Then, install it using the command: 
      mvn install:install-file -DgroupId=org.apache.wss4j -DartifactId=wss4j-ws-security-stax
-Dversion=2.0-20130930.105108-192 -Dclassifier=tests -Dpackaging=jar -Dfile=/path/to/file

  Alternatively, if you host your own repository you can deploy the file there: 
      mvn deploy:deploy-file -DgroupId=org.apache.wss4j -DartifactId=wss4j-ws-security-stax
-Dversion=2.0-20130930.105108-192 -Dclassifier=tests -Dpackaging=jar -Dfile=/path/to/file
-Durl=[url] -DrepositoryId=[id]

  Path to dependency: 
  	1) org.apache.wss4j:integration:jar:2.0-SNAPSHOT
  	2) org.apache.wss4j:wss4j-ws-security-stax:jar:tests:2.0-SNAPSHOT

----------
1 required artifact is missing.

for artifact: 
  org.apache.wss4j:integration:jar:2.0-SNAPSHOT

from the specified remote repositories:
  central (http://repo1.maven.org/maven2),
  Nexus (http://repository.apache.org/snapshots)



[INFO] ------------------------------------------------------------------------
[INFO] For more information, run Maven with the -e switch
[INFO] ------------------------------------------------------------------------
[INFO] Total time: 7 minutes 53 seconds
[INFO] Finished at: Mon Sep 30 10:51:27 UTC 2013
[INFO] Final Memory: 123M/343M
[INFO] ------------------------------------------------------------------------
Waiting for Jenkins to finish collecting data
channel stopped

---------------------------------------------------------------------
To unsubscribe, e-mail: dev-unsubscribe@ws.apache.org
For additional commands, e-mail: dev-help@ws.apache.org


Mime
View raw message