ws-dev mailing list archives

Site index · List index
Message view « Date » · « Thread »
Top « Date » · « Thread »
From Apache Jenkins Server <jenk...@builds.apache.org>
Subject Build failed in Jenkins: wss4j-trunk #652
Date Mon, 25 Nov 2013 19:55:44 GMT
See <https://builds.apache.org/job/wss4j-trunk/652/changes>

Changes:

[coheigea] [WSS-485] - Patch applied
 - Thanks to Andrei Shakirin for the patch

[coheigea] [WSS-430] - SecurityPolicy validation support for encrypted/signed attachments

------------------------------------------
[...truncated 304 lines...]
[INFO] [resources:testResources {execution: default-testResources}]
[INFO] Using 'UTF-8' encoding to copy filtered resources.
[INFO] skip non existing resourceDirectory <https://builds.apache.org/job/wss4j-trunk/ws/wss4j/bindings/wss10-binding/src/test/java>
[INFO] skip non existing resourceDirectory <https://builds.apache.org/job/wss4j-trunk/ws/wss4j/bindings/wss10-binding/src/test/resources>
[INFO] skip non existing resourceDirectory <https://builds.apache.org/job/wss4j-trunk/ws/wss4j/bindings/wss10-binding/target/generated/src/test/resources>
[INFO] Copying 3 resources
[INFO] [compiler:testCompile {execution: default-testCompile}]
[INFO] No sources to compile
[INFO] [surefire:test {execution: default-test}]
[JENKINS] Recording test results
[INFO] [jar:jar {execution: default-jar}]
[INFO] Building jar: <https://builds.apache.org/job/wss4j-trunk/ws/wss4j/bindings/wss10-binding/target/wss4j-bindings-wss10-2.0-SNAPSHOT.jar>
[INFO] Preparing source:jar
[WARNING] Removing: jar from forked lifecycle, to prevent recursive invocation.
[WARNING] Removing: check from forked lifecycle, to prevent recursive invocation.
[INFO] [bundle:cleanVersions {execution: versions}]
[INFO] [jaxb2:generate {execution: wss10}]
[INFO] Skipped XJC execution. Generated sources were up-to-date.
ERROR: Could not find local repository for 2.2.1
[INFO] [source:jar {execution: default}]
[INFO] Building jar: <https://builds.apache.org/job/wss4j-trunk/ws/wss4j/bindings/wss10-binding/target/wss4j-bindings-wss10-2.0-SNAPSHOT-sources.jar>
[INFO] [install:install {execution: default-install}]
[INFO] Installing <https://builds.apache.org/job/wss4j-trunk/ws/wss4j/bindings/wss10-binding/target/wss4j-bindings-wss10-2.0-SNAPSHOT.jar>
to /home/jenkins/jenkins-slave/maven-repositories/0/org/apache/wss4j/wss4j-bindings-wss10/2.0-SNAPSHOT/wss4j-bindings-wss10-2.0-SNAPSHOT.jar
[INFO] Installing <https://builds.apache.org/job/wss4j-trunk/ws/wss4j/bindings/wss10-binding/target/wss4j-bindings-wss10-2.0-SNAPSHOT-sources.jar>
to /home/jenkins/jenkins-slave/maven-repositories/0/org/apache/wss4j/wss4j-bindings-wss10/2.0-SNAPSHOT/wss4j-bindings-wss10-2.0-SNAPSHOT-sources.jar
[INFO] Preparing pmd:check
[INFO] [pmd:pmd {execution: pmd}]
ERROR: Could not find local repository for 2.2.1
[INFO] [pmd:check {execution: validate}]
[INFO] 
[INFO] [bundle:cleanVersions {execution: versions}]
[INFO] [jaxb2:generate {execution: wss10}]
[INFO] Skipped XJC execution. Generated sources were up-to-date.
[INFO] [remote-resources:process {execution: default}]
[INFO] [resources:resources {execution: default-resources}]
[INFO] Using 'UTF-8' encoding to copy filtered resources.
[INFO] skip non existing resourceDirectory <https://builds.apache.org/job/wss4j-trunk/ws/wss4j/bindings/wss10-binding/src/main/java>
[INFO] Copying 8 resources
[INFO] skip non existing resourceDirectory <https://builds.apache.org/job/wss4j-trunk/ws/wss4j/bindings/wss10-binding/src/main/resources-filtered>
[INFO] skip non existing resourceDirectory <https://builds.apache.org/job/wss4j-trunk/ws/wss4j/bindings/wss10-binding/target/generated/src/main/resources>
[INFO] Copying 1 resource
[INFO] Copying 3 resources
[INFO] Copying 1 resource
[INFO] Copying 3 resources
[INFO] [compiler:compile {execution: default-compile}]
[INFO] Nothing to compile - all classes are up to date
[INFO] [bundle:manifest {execution: bundle-manifest}]
[INFO] [resources:testResources {execution: default-testResources}]
[INFO] Using 'UTF-8' encoding to copy filtered resources.
[INFO] skip non existing resourceDirectory <https://builds.apache.org/job/wss4j-trunk/ws/wss4j/bindings/wss10-binding/src/test/java>
[INFO] skip non existing resourceDirectory <https://builds.apache.org/job/wss4j-trunk/ws/wss4j/bindings/wss10-binding/src/test/resources>
[INFO] skip non existing resourceDirectory <https://builds.apache.org/job/wss4j-trunk/ws/wss4j/bindings/wss10-binding/target/generated/src/test/resources>
[INFO] Copying 3 resources
[INFO] Copying 3 resources
[INFO] [compiler:testCompile {execution: default-testCompile}]
[INFO] No sources to compile
[INFO] [surefire:test {execution: default-test}]
[INFO] Skipping execution of surefire because it has already been run for this configuration
[JENKINS] Recording test results
[INFO] [jar:jar {execution: default-jar}]
[INFO] Building jar: <https://builds.apache.org/job/wss4j-trunk/ws/wss4j/bindings/wss10-binding/target/wss4j-bindings-wss10-2.0-SNAPSHOT.jar>
[INFO] Preparing source:jar
[WARNING] Removing: jar from forked lifecycle, to prevent recursive invocation.
[WARNING] Removing: check from forked lifecycle, to prevent recursive invocation.
[INFO] [bundle:cleanVersions {execution: versions}]
[INFO] [jaxb2:generate {execution: wss10}]
[INFO] Skipped XJC execution. Generated sources were up-to-date.
ERROR: Could not find local repository for 2.2.1
[INFO] [source:jar {execution: default}]
[INFO] Building jar: <https://builds.apache.org/job/wss4j-trunk/ws/wss4j/bindings/wss10-binding/target/wss4j-bindings-wss10-2.0-SNAPSHOT-sources.jar>
[INFO] [install:install {execution: default-install}]
[INFO] Installing <https://builds.apache.org/job/wss4j-trunk/ws/wss4j/bindings/wss10-binding/target/wss4j-bindings-wss10-2.0-SNAPSHOT.jar>
to /home/jenkins/jenkins-slave/maven-repositories/0/org/apache/wss4j/wss4j-bindings-wss10/2.0-SNAPSHOT/wss4j-bindings-wss10-2.0-SNAPSHOT.jar
[INFO] Installing <https://builds.apache.org/job/wss4j-trunk/ws/wss4j/bindings/wss10-binding/target/wss4j-bindings-wss10-2.0-SNAPSHOT-sources.jar>
to /home/jenkins/jenkins-slave/maven-repositories/0/org/apache/wss4j/wss4j-bindings-wss10/2.0-SNAPSHOT/wss4j-bindings-wss10-2.0-SNAPSHOT-sources.jar
[INFO] Installing <https://builds.apache.org/job/wss4j-trunk/ws/wss4j/bindings/wss10-binding/target/wss4j-bindings-wss10-2.0-SNAPSHOT-sources.jar>
to /home/jenkins/jenkins-slave/maven-repositories/0/org/apache/wss4j/wss4j-bindings-wss10/2.0-SNAPSHOT/wss4j-bindings-wss10-2.0-SNAPSHOT-sources.jar
[INFO] [deploy:deploy {execution: default-deploy}]
[INFO] Retrieving previous build number from apache.snapshots.https
[WARNING] *** CHECKSUM FAILED - Checksum failed on download: local = 'aa1c1ee0b5937ab313a6186815377e24428758d6';
remote = 'ea26318893ae9e095c649d1ca53c9e39dd218e21' - RETRYING
[WARNING] *** CHECKSUM FAILED - Checksum failed on download: local = 'aa1c1ee0b5937ab313a6186815377e24428758d6';
remote = 'ea26318893ae9e095c649d1ca53c9e39dd218e21' - IGNORING
Uploading: https://repository.apache.org/content/repositories/snapshots/org/apache/wss4j/wss4j-bindings-wss10/2.0-SNAPSHOT/wss4j-bindings-wss10-2.0-20131125.194857-261.jar
34K uploaded  (wss4j-bindings-wss10-2.0-20131125.194857-261.jar)
[INFO] Uploading project information for wss4j-bindings-wss10 2.0-20131125.194857-261
[INFO] Retrieving previous metadata from apache.snapshots.https
[WARNING] *** CHECKSUM FAILED - Checksum failed on download: local = 'aa1c1ee0b5937ab313a6186815377e24428758d6';
remote = 'ea26318893ae9e095c649d1ca53c9e39dd218e21' - RETRYING
[WARNING] *** CHECKSUM FAILED - Checksum failed on download: local = 'aa1c1ee0b5937ab313a6186815377e24428758d6';
remote = 'ea26318893ae9e095c649d1ca53c9e39dd218e21' - IGNORING
[INFO] Uploading repository metadata for: 'snapshot org.apache.wss4j:wss4j-bindings-wss10:2.0-SNAPSHOT'
[INFO] Retrieving previous metadata from apache.snapshots.https
[INFO] Uploading repository metadata for: 'artifact org.apache.wss4j:wss4j-bindings-wss10'
[INFO] Retrieving previous build number from apache.snapshots.https
Uploading: https://repository.apache.org/content/repositories/snapshots/org/apache/wss4j/wss4j-bindings-wss10/2.0-SNAPSHOT/wss4j-bindings-wss10-2.0-20131125.194857-261-sources.jar
37K uploaded  (wss4j-bindings-wss10-2.0-20131125.194857-261-sources.jar)
[INFO] Retrieving previous build number from apache.snapshots.https
Uploading: https://repository.apache.org/content/repositories/snapshots/org/apache/wss4j/wss4j-bindings-wss10/2.0-SNAPSHOT/wss4j-bindings-wss10-2.0-20131125.194857-261-sources.jar
37K uploaded  (wss4j-bindings-wss10-2.0-20131125.194857-261-sources.jar)
[INFO] ------------------------------------------------------------------------
[INFO] Building Apache WSS4J WS-Security 1.1 Binding
[INFO]    task-segment: [clean, install, deploy]
[INFO] ------------------------------------------------------------------------
[INFO] [clean:clean {execution: default-clean}]
[INFO] Deleting <https://builds.apache.org/job/wss4j-trunk/ws/wss4j/bindings/wss11-binding/target>
[INFO] Preparing pmd:check
[INFO] [pmd:pmd {execution: pmd}]
ERROR: Could not find local repository for 2.2.1
[INFO] [pmd:check {execution: validate}]
[INFO] 
[INFO] [bundle:cleanVersions {execution: versions}]
[INFO] [jaxb2:generate {execution: wss11}]
[WARNING] DEPRECATED [tasks]: Use target instead
[INFO] [antrun:run {execution: default}]
[WARNING] Parameter tasks is deprecated, use target instead
[INFO] Executing tasks

main:
     [xslt] Processing <https://builds.apache.org/job/wss4j-trunk/ws/wss4j/bindings/wss11-binding/target/wss11.episode>
to <https://builds.apache.org/job/wss4j-trunk/ws/wss4j/bindings/wss11-binding/target/wss11.episode.tmp>
     [xslt] Loading stylesheet <https://builds.apache.org/job/wss4j-trunk/ws/wss4j/bindings/wss11-binding/src/etc/bindings.xsl>
[INFO] Executed tasks
[INFO] [remote-resources:process {execution: default}]
[INFO] [resources:resources {execution: default-resources}]
[INFO] Using 'UTF-8' encoding to copy filtered resources.
[INFO] Copying 11 resources
[INFO] Copying 1 resource
[INFO] Copying 3 resources
[INFO] [compiler:compile {execution: default-compile}]
[INFO] Changes detected - recompiling the module!
[INFO] Compiling 5 source files to <https://builds.apache.org/job/wss4j-trunk/ws/wss4j/bindings/wss11-binding/target/classes>
[INFO] [bundle:manifest {execution: bundle-manifest}]
[INFO] [resources:testResources {execution: default-testResources}]
[INFO] Using 'UTF-8' encoding to copy filtered resources.
[INFO] skip non existing resourceDirectory <https://builds.apache.org/job/wss4j-trunk/ws/wss4j/bindings/wss11-binding/src/test/java>
[INFO] skip non existing resourceDirectory <https://builds.apache.org/job/wss4j-trunk/ws/wss4j/bindings/wss11-binding/src/test/resources>
[INFO] skip non existing resourceDirectory <https://builds.apache.org/job/wss4j-trunk/ws/wss4j/bindings/wss11-binding/target/generated/src/test/resources>
[INFO] Copying 3 resources
[INFO] [compiler:testCompile {execution: default-testCompile}]
[INFO] No sources to compile
[INFO] [surefire:test {execution: default-test}]
[JENKINS] Recording test results
[INFO] [jar:jar {execution: default-jar}]
[INFO] Building jar: <https://builds.apache.org/job/wss4j-trunk/ws/wss4j/bindings/wss11-binding/target/wss4j-bindings-wss11-2.0-SNAPSHOT.jar>
[INFO] Preparing source:jar
[WARNING] Removing: jar from forked lifecycle, to prevent recursive invocation.
[WARNING] Removing: check from forked lifecycle, to prevent recursive invocation.
[INFO] [bundle:cleanVersions {execution: versions}]
[INFO] [jaxb2:generate {execution: wss11}]
[INFO] Skipped XJC execution. Generated sources were up-to-date.
[WARNING] DEPRECATED [tasks]: Use target instead
[INFO] [antrun:run {execution: default}]
[WARNING] Parameter tasks is deprecated, use target instead
[INFO] Executing tasks

main:
[INFO] Executed tasks
ERROR: Could not find local repository for 2.2.1
[INFO] [source:jar {execution: default}]
[INFO] Building jar: <https://builds.apache.org/job/wss4j-trunk/ws/wss4j/bindings/wss11-binding/target/wss4j-bindings-wss11-2.0-SNAPSHOT-sources.jar>
[INFO] [install:install {execution: default-install}]
[INFO] Installing <https://builds.apache.org/job/wss4j-trunk/ws/wss4j/bindings/wss11-binding/target/wss4j-bindings-wss11-2.0-SNAPSHOT.jar>
to /home/jenkins/jenkins-slave/maven-repositories/0/org/apache/wss4j/wss4j-bindings-wss11/2.0-SNAPSHOT/wss4j-bindings-wss11-2.0-SNAPSHOT.jar
[INFO] Installing <https://builds.apache.org/job/wss4j-trunk/ws/wss4j/bindings/wss11-binding/target/wss4j-bindings-wss11-2.0-SNAPSHOT-sources.jar>
to /home/jenkins/jenkins-slave/maven-repositories/0/org/apache/wss4j/wss4j-bindings-wss11/2.0-SNAPSHOT/wss4j-bindings-wss11-2.0-SNAPSHOT-sources.jar
[INFO] Preparing pmd:check
[INFO] [pmd:pmd {execution: pmd}]
ERROR: Could not find local repository for 2.2.1
[INFO] [pmd:check {execution: validate}]
[INFO] 
[INFO] [bundle:cleanVersions {execution: versions}]
[INFO] [jaxb2:generate {execution: wss11}]
[INFO] Skipped XJC execution. Generated sources were up-to-date.
[WARNING] DEPRECATED [tasks]: Use target instead
[INFO] [antrun:run {execution: default}]
[WARNING] Parameter tasks is deprecated, use target instead
[INFO] Executing tasks

main:
[INFO] Executed tasks
[INFO] [remote-resources:process {execution: default}]
[INFO] [resources:resources {execution: default-resources}]
[INFO] Using 'UTF-8' encoding to copy filtered resources.
[INFO] Copying 11 resources
[INFO] Copying 1 resource
[INFO] Copying 3 resources
[INFO] Copying 3 resources
[INFO] [compiler:compile {execution: default-compile}]
[INFO] Nothing to compile - all classes are up to date
[INFO] [bundle:manifest {execution: bundle-manifest}]
[INFO] [resources:testResources {execution: default-testResources}]
[INFO] Using 'UTF-8' encoding to copy filtered resources.
[INFO] skip non existing resourceDirectory <https://builds.apache.org/job/wss4j-trunk/ws/wss4j/bindings/wss11-binding/src/test/java>
[INFO] skip non existing resourceDirectory <https://builds.apache.org/job/wss4j-trunk/ws/wss4j/bindings/wss11-binding/src/test/resources>
[INFO] skip non existing resourceDirectory <https://builds.apache.org/job/wss4j-trunk/ws/wss4j/bindings/wss11-binding/target/generated/src/test/resources>
[INFO] Copying 3 resources
[INFO] Copying 3 resources
[INFO] [compiler:testCompile {execution: default-testCompile}]
[INFO] No sources to compile
[INFO] [surefire:test {execution: default-test}]
[INFO] Skipping execution of surefire because it has already been run for this configuration
[JENKINS] Recording test results
[INFO] [jar:jar {execution: default-jar}]
[INFO] Building jar: <https://builds.apache.org/job/wss4j-trunk/ws/wss4j/bindings/wss11-binding/target/wss4j-bindings-wss11-2.0-SNAPSHOT.jar>
[INFO] Preparing source:jar
[WARNING] Removing: jar from forked lifecycle, to prevent recursive invocation.
[WARNING] Removing: check from forked lifecycle, to prevent recursive invocation.
[INFO] [bundle:cleanVersions {execution: versions}]
[INFO] [jaxb2:generate {execution: wss11}]
[INFO] Skipped XJC execution. Generated sources were up-to-date.
[WARNING] DEPRECATED [tasks]: Use target instead
[INFO] [antrun:run {execution: default}]
[WARNING] Parameter tasks is deprecated, use target instead
[INFO] Executing tasks

main:
[INFO] Executed tasks
ERROR: Could not find local repository for 2.2.1
[INFO] [source:jar {execution: default}]
[INFO] Building jar: <https://builds.apache.org/job/wss4j-trunk/ws/wss4j/bindings/wss11-binding/target/wss4j-bindings-wss11-2.0-SNAPSHOT-sources.jar>
[INFO] [install:install {execution: default-install}]
[INFO] Installing <https://builds.apache.org/job/wss4j-trunk/ws/wss4j/bindings/wss11-binding/target/wss4j-bindings-wss11-2.0-SNAPSHOT.jar>
to /home/jenkins/jenkins-slave/maven-repositories/0/org/apache/wss4j/wss4j-bindings-wss11/2.0-SNAPSHOT/wss4j-bindings-wss11-2.0-SNAPSHOT.jar
[INFO] Installing <https://builds.apache.org/job/wss4j-trunk/ws/wss4j/bindings/wss11-binding/target/wss4j-bindings-wss11-2.0-SNAPSHOT-sources.jar>
to /home/jenkins/jenkins-slave/maven-repositories/0/org/apache/wss4j/wss4j-bindings-wss11/2.0-SNAPSHOT/wss4j-bindings-wss11-2.0-SNAPSHOT-sources.jar
[INFO] Installing <https://builds.apache.org/job/wss4j-trunk/ws/wss4j/bindings/wss11-binding/target/wss4j-bindings-wss11-2.0-SNAPSHOT-sources.jar>
to /home/jenkins/jenkins-slave/maven-repositories/0/org/apache/wss4j/wss4j-bindings-wss11/2.0-SNAPSHOT/wss4j-bindings-wss11-2.0-SNAPSHOT-sources.jar
[INFO] [deploy:deploy {execution: default-deploy}]
[INFO] Retrieving previous build number from apache.snapshots.https
[INFO] ------------------------------------------------------------------------
[ERROR] BUILD ERROR
[INFO] ------------------------------------------------------------------------
[INFO] Error retrieving previous build number for artifact 'org.apache.wss4j:wss4j-bindings-wss11:jar':
repository metadata for: 'snapshot org.apache.wss4j:wss4j-bindings-wss11:2.0-SNAPSHOT' could
not be retrieved from repository: apache.snapshots.https due to an error: Error transferring
file: Server returned HTTP response code: 503 for URL: https://repository.apache.org/content/repositories/snapshots/org/apache/wss4j/wss4j-bindings-wss11/2.0-SNAPSHOT/maven-metadata.xml

[INFO] ------------------------------------------------------------------------
[INFO] For more information, run Maven with the -e switch
[INFO] ------------------------------------------------------------------------
[INFO] Total time: 7 minutes 22 seconds
[INFO] Finished at: Mon Nov 25 19:53:21 UTC 2013
[INFO] Final Memory: 87M/298M
[INFO] ------------------------------------------------------------------------
[JENKINS] Archiving <https://builds.apache.org/job/wss4j-trunk/ws/wss4j/bindings/wsu10-binding/pom.xml>
to org.apache.wss4j/wss4j-bindings-wsu10/2.0-SNAPSHOT/wss4j-bindings-wsu10-2.0-SNAPSHOT.pom
[JENKINS] Archiving <https://builds.apache.org/job/wss4j-trunk/ws/wss4j/bindings/wsu10-binding/target/wss4j-bindings-wsu10-2.0-SNAPSHOT.jar>
to org.apache.wss4j/wss4j-bindings-wsu10/2.0-SNAPSHOT/wss4j-bindings-wsu10-2.0-SNAPSHOT.jar
[JENKINS] Archiving <https://builds.apache.org/job/wss4j-trunk/ws/wss4j/bindings/wsu10-binding/target/wss4j-bindings-wsu10-2.0-SNAPSHOT-sources.jar>
to org.apache.wss4j/wss4j-bindings-wsu10/2.0-SNAPSHOT/wss4j-bindings-wsu10-2.0-SNAPSHOT-sources.jar
[JENKINS] Archiving <https://builds.apache.org/job/wss4j-trunk/ws/wss4j/bindings/wsu10-binding/target/wss4j-bindings-wsu10-2.0-SNAPSHOT.jar>
to org.apache.wss4j/wss4j-bindings-wsu10/2.0-20131125.194857-261/wss4j-bindings-wsu10-2.0-20131125.194857-261.jar
[JENKINS] Archiving <https://builds.apache.org/job/wss4j-trunk/ws/wss4j/bindings/wsu10-binding/target/wss4j-bindings-wsu10-2.0-SNAPSHOT-sources.jar>
to org.apache.wss4j/wss4j-bindings-wsu10/2.0-20131125.194857-261/wss4j-bindings-wsu10-2.0-20131125.194857-261-sources.jar
[JENKINS] Archiving <https://builds.apache.org/job/wss4j-trunk/ws/wss4j/bindings/wss10-binding/pom.xml>
to org.apache.wss4j/wss4j-bindings-wss10/2.0-SNAPSHOT/wss4j-bindings-wss10-2.0-SNAPSHOT.pom
[JENKINS] Archiving <https://builds.apache.org/job/wss4j-trunk/ws/wss4j/bindings/wss10-binding/target/wss4j-bindings-wss10-2.0-SNAPSHOT.jar>
to org.apache.wss4j/wss4j-bindings-wss10/2.0-SNAPSHOT/wss4j-bindings-wss10-2.0-SNAPSHOT.jar
[JENKINS] Archiving <https://builds.apache.org/job/wss4j-trunk/ws/wss4j/bindings/wss10-binding/target/wss4j-bindings-wss10-2.0-SNAPSHOT-sources.jar>
to org.apache.wss4j/wss4j-bindings-wss10/2.0-SNAPSHOT/wss4j-bindings-wss10-2.0-SNAPSHOT-sources.jar
[JENKINS] Archiving <https://builds.apache.org/job/wss4j-trunk/ws/wss4j/bindings/wss10-binding/target/wss4j-bindings-wss10-2.0-SNAPSHOT.jar>
to org.apache.wss4j/wss4j-bindings-wss10/2.0-20131125.194857-261/wss4j-bindings-wss10-2.0-20131125.194857-261.jar
[JENKINS] Archiving <https://builds.apache.org/job/wss4j-trunk/ws/wss4j/bindings/wss10-binding/target/wss4j-bindings-wss10-2.0-SNAPSHOT-sources.jar>
to org.apache.wss4j/wss4j-bindings-wss10/2.0-20131125.194857-261/wss4j-bindings-wss10-2.0-20131125.194857-261-sources.jar
[JENKINS] Archiving <https://builds.apache.org/job/wss4j-trunk/ws/wss4j/bindings/wss11-binding/pom.xml>
to org.apache.wss4j/wss4j-bindings-wss11/2.0-SNAPSHOT/wss4j-bindings-wss11-2.0-SNAPSHOT.pom
[JENKINS] Archiving <https://builds.apache.org/job/wss4j-trunk/ws/wss4j/bindings/wss11-binding/target/wss4j-bindings-wss11-2.0-SNAPSHOT.jar>
to org.apache.wss4j/wss4j-bindings-wss11/2.0-SNAPSHOT/wss4j-bindings-wss11-2.0-SNAPSHOT.jar
[JENKINS] Archiving <https://builds.apache.org/job/wss4j-trunk/ws/wss4j/bindings/wss11-binding/target/wss4j-bindings-wss11-2.0-SNAPSHOT-sources.jar>
to org.apache.wss4j/wss4j-bindings-wss11/2.0-SNAPSHOT/wss4j-bindings-wss11-2.0-SNAPSHOT-sources.jar
[JENKINS] Archiving <https://builds.apache.org/job/wss4j-trunk/ws/wss4j/parent/pom.xml>
to org.apache.wss4j/wss4j-parent/2.0-SNAPSHOT/wss4j-parent-2.0-SNAPSHOT.pom
[JENKINS] Archiving /home/jenkins/jenkins-slave/maven-repositories/0/org/apache/wss4j/wss4j-parent/2.0-SNAPSHOT/wss4j-parent-2.0-SNAPSHOT.pom
to org.apache.wss4j/wss4j-parent/2.0-20131125.194857-268/wss4j-parent-2.0-20131125.194857-268.pom
/x1/jenkins/jenkins-slave/maven-repositories/0/org/apache/wss4j/wss4j-parent/2.0-SNAPSHOT/wss4j-parent-2.0-SNAPSHOT.pom
is not inside /x1/jenkins/jenkins-slave/workspace/wss4j-trunk/wss4j/parent/; will archive
in a separate pass
[JENKINS] Archiving <https://builds.apache.org/job/wss4j-trunk/ws/wss4j/pom.xml> to
org.apache.wss4j/wss4j/2.0-SNAPSHOT/wss4j-2.0-SNAPSHOT.pom
[JENKINS] Archiving /home/jenkins/jenkins-slave/maven-repositories/0/org/apache/wss4j/wss4j/2.0-SNAPSHOT/wss4j-2.0-SNAPSHOT.pom
to org.apache.wss4j/wss4j/2.0-20131125.194857-271/wss4j-2.0-20131125.194857-271.pom
/x1/jenkins/jenkins-slave/maven-repositories/0/org/apache/wss4j/wss4j/2.0-SNAPSHOT/wss4j-2.0-SNAPSHOT.pom
is not inside /x1/jenkins/jenkins-slave/workspace/wss4j-trunk/wss4j/; will archive in a separate
pass
Sending e-mails to: dev@ws.apache.org null@apache.org
channel stopped

---------------------------------------------------------------------
To unsubscribe, e-mail: dev-unsubscribe@ws.apache.org
For additional commands, e-mail: dev-help@ws.apache.org


Mime
View raw message