ws-dev mailing list archives

Site index · List index
Message view « Date » · « Thread »
Top « Date » · « Thread »
From Apache Jenkins Server <jenk...@builds.apache.org>
Subject Build failed in Jenkins: xmlschema-trunk-jdk15 #110
Date Wed, 22 Jan 2014 10:59:49 GMT
See <https://builds.apache.org/job/xmlschema-trunk-jdk15/110/changes>

Changes:

[dkulp] [maven-release-plugin] prepare for next development iteration

[dkulp] [maven-release-plugin] prepare release xmlschema-2.1.0

[dkulp] Don't deploy the test stuff, kind of pointless and not needed

[dkulp] More updates to release notes

[dkulp] Update release notes

[dkulp] [XMLSCHEMA-26] Forgot the testcase
Patch from Dmitry Repchevsky

[dkulp] Missed some snapshot versions, flip to variable

[dkulp] Change to 2.1.0 as XMLSCHEMA-26 introduces a slight behavior change which may not
be appropriate for a patch

[dkulp] [XMLSCHEMA-26] Fix return of getNamespaceURI
Patch from Dmitry Repchevsky applied

[dkulp] Fix imports

[dkulp] [XMLSCHEMA-30] This commit fixes the XMLSCHEMA-30 bug.

equals/hashCode methods pairs have been added in following classes:
     - XmlSchemaNamedImpl
     - XmlSchemaNamedWithFormImpl
     - XmlSchemaType
     - XmlSchemaElement
     - XmlSchemaGroup

 NamedItemsEqualityTest unit-test has been created.

------------------------------------------
[...truncated 1433 lines...]
Downloading: http://repo.maven.apache.org/maven2/org/codehaus/plexus/plexus-components/1.1.9/plexus-components-1.1.9.pom
Downloaded: http://repo.maven.apache.org/maven2/org/codehaus/plexus/plexus-components/1.1.9/plexus-components-1.1.9.pom
(3 KB at 87.8 KB/sec)
Downloading: http://repo.maven.apache.org/maven2/org/codehaus/plexus/plexus-container-default/1.0-alpha-15/plexus-container-default-1.0-alpha-15.pom
Downloaded: http://repo.maven.apache.org/maven2/org/codehaus/plexus/plexus-container-default/1.0-alpha-15/plexus-container-default-1.0-alpha-15.pom
(2 KB at 59.6 KB/sec)
Downloading: http://repo.maven.apache.org/maven2/org/codehaus/plexus/plexus-containers/1.0-alpha-15/plexus-containers-1.0-alpha-15.pom
Downloaded: http://repo.maven.apache.org/maven2/org/codehaus/plexus/plexus-containers/1.0-alpha-15/plexus-containers-1.0-alpha-15.pom
(2 KB at 68.4 KB/sec)
Downloading: http://repo.maven.apache.org/maven2/org/codehaus/plexus/plexus-component-api/1.0-alpha-15/plexus-component-api-1.0-alpha-15.pom
Downloaded: http://repo.maven.apache.org/maven2/org/codehaus/plexus/plexus-component-api/1.0-alpha-15/plexus-component-api-1.0-alpha-15.pom
(948 B at 34.3 KB/sec)
Downloading: http://repo.maven.apache.org/maven2/org/codehaus/plexus/plexus-classworlds/1.2-alpha-6/plexus-classworlds-1.2-alpha-6.pom
Downloaded: http://repo.maven.apache.org/maven2/org/codehaus/plexus/plexus-classworlds/1.2-alpha-6/plexus-classworlds-1.2-alpha-6.pom
(3 KB at 85.8 KB/sec)
Downloading: http://repo.maven.apache.org/maven2/org/codehaus/plexus/plexus-io/1.0-alpha-1/plexus-io-1.0-alpha-1.pom
Downloaded: http://repo.maven.apache.org/maven2/org/codehaus/plexus/plexus-io/1.0-alpha-1/plexus-io-1.0-alpha-1.pom
(2 KB at 46.5 KB/sec)
Downloading: http://repo.maven.apache.org/maven2/org/codehaus/plexus/plexus-component-api/1.0-alpha-16/plexus-component-api-1.0-alpha-16.pom
Downloaded: http://repo.maven.apache.org/maven2/org/codehaus/plexus/plexus-component-api/1.0-alpha-16/plexus-component-api-1.0-alpha-16.pom
(3 KB at 80.1 KB/sec)
Downloading: http://repo.maven.apache.org/maven2/org/codehaus/plexus/plexus-containers/1.0-alpha-16/plexus-containers-1.0-alpha-16.pom
Downloaded: http://repo.maven.apache.org/maven2/org/codehaus/plexus/plexus-containers/1.0-alpha-16/plexus-containers-1.0-alpha-16.pom
(2 KB at 65.7 KB/sec)
Downloading: http://repo.maven.apache.org/maven2/org/apache/maven/shared/maven-invoker/2.0.9/maven-invoker-2.0.9.pom
Downloaded: http://repo.maven.apache.org/maven2/org/apache/maven/shared/maven-invoker/2.0.9/maven-invoker-2.0.9.pom
(6 KB at 208.9 KB/sec)
Downloading: http://repo.maven.apache.org/maven2/org/apache/maven/shared/maven-shared-components/9/maven-shared-components-9.pom
Downloaded: http://repo.maven.apache.org/maven2/org/apache/maven/shared/maven-shared-components/9/maven-shared-components-9.pom
(4 KB at 126.6 KB/sec)
Downloading: http://repo.maven.apache.org/maven2/org/apache/maven/wagon/wagon-provider-api/1.0-beta-6/wagon-provider-api-1.0-beta-6.pom
Downloaded: http://repo.maven.apache.org/maven2/org/apache/maven/wagon/wagon-provider-api/1.0-beta-6/wagon-provider-api-1.0-beta-6.pom
(2 KB at 63.7 KB/sec)
Downloading: http://repo.maven.apache.org/maven2/org/apache/maven/wagon/wagon/1.0-beta-6/wagon-1.0-beta-6.pom
Downloaded: http://repo.maven.apache.org/maven2/org/apache/maven/wagon/wagon/1.0-beta-6/wagon-1.0-beta-6.pom
(13 KB at 432.0 KB/sec)
Downloading: http://repo.maven.apache.org/maven2/commons-logging/commons-logging/1.1.1/commons-logging-1.1.1.pom
Downloaded: http://repo.maven.apache.org/maven2/commons-logging/commons-logging/1.1.1/commons-logging-1.1.1.pom
(18 KB at 664.2 KB/sec)
Downloading: http://repo.maven.apache.org/maven2/org/apache/commons/commons-parent/5/commons-parent-5.pom
Downloaded: http://repo.maven.apache.org/maven2/org/apache/commons/commons-parent/5/commons-parent-5.pom
(16 KB at 559.5 KB/sec)
Downloading: http://repo.maven.apache.org/maven2/log4j/log4j/1.2.14/log4j-1.2.14.pom
Downloaded: http://repo.maven.apache.org/maven2/log4j/log4j/1.2.14/log4j-1.2.14.pom (3 KB
at 85.9 KB/sec)
Downloading: http://repo.maven.apache.org/maven2/com/thoughtworks/qdox/qdox/1.9.2/qdox-1.9.2.pom
Downloaded: http://repo.maven.apache.org/maven2/com/thoughtworks/qdox/qdox/1.9.2/qdox-1.9.2.pom
(17 KB at 598.1 KB/sec)
Downloading: http://repo.maven.apache.org/maven2/org/apache/maven/maven-toolchain/1.0/maven-toolchain-1.0.pom
Downloaded: http://repo.maven.apache.org/maven2/org/apache/maven/maven-toolchain/1.0/maven-toolchain-1.0.pom
(4 KB at 123.5 KB/sec)
Downloading: http://repo.maven.apache.org/maven2/org/apache/maven/shared/maven-common-artifact-filters/1.2/maven-common-artifact-filters-1.2.pom
Downloaded: http://repo.maven.apache.org/maven2/org/apache/maven/shared/maven-common-artifact-filters/1.2/maven-common-artifact-filters-1.2.pom
(5 KB at 157.7 KB/sec)
Downloading: http://repo.maven.apache.org/maven2/org/apache/maven/reporting/maven-reporting-api/2.0.9/maven-reporting-api-2.0.9.jar
Downloading: http://repo.maven.apache.org/maven2/org/apache/maven/maven-archiver/2.3/maven-archiver-2.3.jar
Downloading: http://repo.maven.apache.org/maven2/org/apache/maven/shared/maven-invoker/2.0.9/maven-invoker-2.0.9.jar
Downloading: http://repo.maven.apache.org/maven2/commons-lang/commons-lang/2.4/commons-lang-2.4.jar
Downloading: http://repo.maven.apache.org/maven2/commons-logging/commons-logging/1.1.1/commons-logging-1.1.1.jar
Downloaded: http://repo.maven.apache.org/maven2/org/apache/maven/reporting/maven-reporting-api/2.0.9/maven-reporting-api-2.0.9.jar
(10 KB at 353.6 KB/sec)
Downloading: http://repo.maven.apache.org/maven2/log4j/log4j/1.2.14/log4j-1.2.14.jar
Downloaded: http://repo.maven.apache.org/maven2/org/apache/maven/maven-archiver/2.3/maven-archiver-2.3.jar
(18 KB at 541.4 KB/sec)
Downloading: http://repo.maven.apache.org/maven2/com/thoughtworks/qdox/qdox/1.9.2/qdox-1.9.2.jar
Downloaded: http://repo.maven.apache.org/maven2/org/apache/maven/shared/maven-invoker/2.0.9/maven-invoker-2.0.9.jar
(28 KB at 863.1 KB/sec)
Downloading: http://repo.maven.apache.org/maven2/org/codehaus/plexus/plexus-archiver/1.0-alpha-9/plexus-archiver-1.0-alpha-9.jar
Downloaded: http://repo.maven.apache.org/maven2/commons-logging/commons-logging/1.1.1/commons-logging-1.1.1.jar
(60 KB at 1852.0 KB/sec)
Downloading: http://repo.maven.apache.org/maven2/org/codehaus/plexus/plexus-io/1.0-alpha-1/plexus-io-1.0-alpha-1.jar
Downloaded: http://repo.maven.apache.org/maven2/commons-lang/commons-lang/2.4/commons-lang-2.4.jar
(256 KB at 5945.9 KB/sec)
Downloading: http://repo.maven.apache.org/maven2/org/codehaus/plexus/plexus-utils/1.5.8/plexus-utils-1.5.8.jar
Downloaded: http://repo.maven.apache.org/maven2/org/codehaus/plexus/plexus-io/1.0-alpha-1/plexus-io-1.0-alpha-1.jar
(12 KB at 411.8 KB/sec)
Downloading: http://repo.maven.apache.org/maven2/org/apache/maven/shared/maven-common-artifact-filters/1.2/maven-common-artifact-filters-1.2.jar
Downloaded: http://repo.maven.apache.org/maven2/org/codehaus/plexus/plexus-archiver/1.0-alpha-9/plexus-archiver-1.0-alpha-9.jar
(154 KB at 5289.3 KB/sec)
Downloaded: http://repo.maven.apache.org/maven2/com/thoughtworks/qdox/qdox/1.9.2/qdox-1.9.2.jar
(167 KB at 5032.6 KB/sec)
Downloaded: http://repo.maven.apache.org/maven2/log4j/log4j/1.2.14/log4j-1.2.14.jar (359 KB
at 6770.4 KB/sec)
Downloaded: http://repo.maven.apache.org/maven2/org/codehaus/plexus/plexus-utils/1.5.8/plexus-utils-1.5.8.jar
(262 KB at 6539.4 KB/sec)
Downloaded: http://repo.maven.apache.org/maven2/org/apache/maven/shared/maven-common-artifact-filters/1.2/maven-common-artifact-filters-1.2.jar
(31 KB at 1102.1 KB/sec)
[INFO] Not executing Javadoc as the project is not a Java classpath-capable package
[INFO] 
[INFO] --- maven-gpg-plugin:1.1:sign (default) @ xmlschema ---
[INFO] 
[INFO] --- maven-install-plugin:2.3.1:install (default-install) @ xmlschema ---
Downloading: http://repo.maven.apache.org/maven2/org/codehaus/plexus/plexus-digest/1.0/plexus-digest-1.0.pom
Downloaded: http://repo.maven.apache.org/maven2/org/codehaus/plexus/plexus-digest/1.0/plexus-digest-1.0.pom
(2 KB at 36.9 KB/sec)
Downloading: http://repo.maven.apache.org/maven2/org/codehaus/plexus/plexus-components/1.1.7/plexus-components-1.1.7.pom
Downloaded: http://repo.maven.apache.org/maven2/org/codehaus/plexus/plexus-components/1.1.7/plexus-components-1.1.7.pom
(5 KB at 173.5 KB/sec)
Downloading: http://repo.maven.apache.org/maven2/org/codehaus/plexus/plexus-digest/1.0/plexus-digest-1.0.jar
Downloaded: http://repo.maven.apache.org/maven2/org/codehaus/plexus/plexus-digest/1.0/plexus-digest-1.0.jar
(12 KB at 413.6 KB/sec)
[INFO] Installing <https://builds.apache.org/job/xmlschema-trunk-jdk15/ws/pom.xml> to
<https://builds.apache.org/job/xmlschema-trunk-jdk15/ws/.repository/org/apache/ws/xmlschema/xmlschema/2.1.1-SNAPSHOT/xmlschema-2.1.1-SNAPSHOT.pom>
[INFO] Installing <https://builds.apache.org/job/xmlschema-trunk-jdk15/ws/target/xmlschema-2.1.1-SNAPSHOT-source-release.zip>
to <https://builds.apache.org/job/xmlschema-trunk-jdk15/ws/.repository/org/apache/ws/xmlschema/xmlschema/2.1.1-SNAPSHOT/xmlschema-2.1.1-SNAPSHOT-source-release.zip>
[INFO] 
[INFO] --- maven-deploy-plugin:2.5:deploy (default-deploy) @ xmlschema ---
Downloading: https://repository.apache.org/content/repositories/snapshots/org/apache/ws/xmlschema/xmlschema/2.1.1-SNAPSHOT/maven-metadata.xml
Uploading: https://repository.apache.org/content/repositories/snapshots/org/apache/ws/xmlschema/xmlschema/2.1.1-SNAPSHOT/xmlschema-2.1.1-20140122.105914-1.pom
Uploaded: https://repository.apache.org/content/repositories/snapshots/org/apache/ws/xmlschema/xmlschema/2.1.1-SNAPSHOT/xmlschema-2.1.1-20140122.105914-1.pom
(29 KB at 40.3 KB/sec)
Downloading: https://repository.apache.org/content/repositories/snapshots/org/apache/ws/xmlschema/xmlschema/maven-metadata.xml
Downloaded: https://repository.apache.org/content/repositories/snapshots/org/apache/ws/xmlschema/xmlschema/maven-metadata.xml
(392 B at 0.4 KB/sec)
Uploading: https://repository.apache.org/content/repositories/snapshots/org/apache/ws/xmlschema/xmlschema/2.1.1-SNAPSHOT/maven-metadata.xml
Uploaded: https://repository.apache.org/content/repositories/snapshots/org/apache/ws/xmlschema/xmlschema/2.1.1-SNAPSHOT/maven-metadata.xml
(609 B at 2.1 KB/sec)
Uploading: https://repository.apache.org/content/repositories/snapshots/org/apache/ws/xmlschema/xmlschema/maven-metadata.xml
Uploaded: https://repository.apache.org/content/repositories/snapshots/org/apache/ws/xmlschema/xmlschema/maven-metadata.xml
(432 B at 0.5 KB/sec)
Uploading: https://repository.apache.org/content/repositories/snapshots/org/apache/ws/xmlschema/xmlschema/2.1.1-SNAPSHOT/xmlschema-2.1.1-20140122.105914-1-source-release.zip
Uploaded: https://repository.apache.org/content/repositories/snapshots/org/apache/ws/xmlschema/xmlschema/2.1.1-SNAPSHOT/xmlschema-2.1.1-20140122.105914-1-source-release.zip
(33363 KB at 4891.1 KB/sec)
Uploading: https://repository.apache.org/content/repositories/snapshots/org/apache/ws/xmlschema/xmlschema/2.1.1-SNAPSHOT/maven-metadata.xml
Uploaded: https://repository.apache.org/content/repositories/snapshots/org/apache/ws/xmlschema/xmlschema/2.1.1-SNAPSHOT/maven-metadata.xml
(830 B at 2.4 KB/sec)
[JENKINS] Archiving disabled
[INFO]                                                                         
[INFO] ------------------------------------------------------------------------
[INFO] Building XmlSchema Core 2.1.1-SNAPSHOT
[INFO] ------------------------------------------------------------------------
Downloading: http://repo.maven.apache.org/maven2/org/apache/maven/plugins/maven-remote-resources-plugin/1.0/maven-remote-resources-plugin-1.0.pom
Downloaded: http://repo.maven.apache.org/maven2/org/apache/maven/plugins/maven-remote-resources-plugin/1.0/maven-remote-resources-plugin-1.0.pom
(7 KB at 137.2 KB/sec)
Downloading: http://repo.maven.apache.org/maven2/org/apache/maven/plugins/maven-plugins/10/maven-plugins-10.pom
Downloaded: http://repo.maven.apache.org/maven2/org/apache/maven/plugins/maven-plugins/10/maven-plugins-10.pom
(8 KB at 250.9 KB/sec)
Downloading: http://repo.maven.apache.org/maven2/org/apache/maven/plugins/maven-remote-resources-plugin/1.0/maven-remote-resources-plugin-1.0.jar
Downloaded: http://repo.maven.apache.org/maven2/org/apache/maven/plugins/maven-remote-resources-plugin/1.0/maven-remote-resources-plugin-1.0.jar
(49 KB at 909.6 KB/sec)
Downloading: http://repo.maven.apache.org/maven2/org/apache/maven/plugins/maven-resources-plugin/2.4.3/maven-resources-plugin-2.4.3.pom
Downloaded: http://repo.maven.apache.org/maven2/org/apache/maven/plugins/maven-resources-plugin/2.4.3/maven-resources-plugin-2.4.3.pom
(6 KB at 193.7 KB/sec)
Downloading: http://repo.maven.apache.org/maven2/org/apache/maven/plugins/maven-resources-plugin/2.4.3/maven-resources-plugin-2.4.3.jar
Downloaded: http://repo.maven.apache.org/maven2/org/apache/maven/plugins/maven-resources-plugin/2.4.3/maven-resources-plugin-2.4.3.jar
(24 KB at 596.3 KB/sec)
Downloading: http://repo.maven.apache.org/maven2/org/apache/maven/plugins/maven-compiler-plugin/2.3.2/maven-compiler-plugin-2.3.2.pom
Downloaded: http://repo.maven.apache.org/maven2/org/apache/maven/plugins/maven-compiler-plugin/2.3.2/maven-compiler-plugin-2.3.2.pom
(8 KB at 246.8 KB/sec)
Downloading: http://repo.maven.apache.org/maven2/org/apache/maven/plugins/maven-compiler-plugin/2.3.2/maven-compiler-plugin-2.3.2.jar
Downloaded: http://repo.maven.apache.org/maven2/org/apache/maven/plugins/maven-compiler-plugin/2.3.2/maven-compiler-plugin-2.3.2.jar
(29 KB at 694.9 KB/sec)
Downloading: http://repo.maven.apache.org/maven2/org/apache/maven/plugins/maven-surefire-plugin/2.7.1/maven-surefire-plugin-2.7.1.pom
Downloaded: http://repo.maven.apache.org/maven2/org/apache/maven/plugins/maven-surefire-plugin/2.7.1/maven-surefire-plugin-2.7.1.pom
(10 KB at 305.7 KB/sec)
Downloading: http://repo.maven.apache.org/maven2/org/apache/maven/surefire/surefire/2.7.1/surefire-2.7.1.pom
Downloaded: http://repo.maven.apache.org/maven2/org/apache/maven/surefire/surefire/2.7.1/surefire-2.7.1.pom
(10 KB at 311.3 KB/sec)
Downloading: http://repo.maven.apache.org/maven2/org/apache/maven/maven-parent/18/maven-parent-18.pom
Downloaded: http://repo.maven.apache.org/maven2/org/apache/maven/maven-parent/18/maven-parent-18.pom
(24 KB at 811.9 KB/sec)
Downloading: http://repo.maven.apache.org/maven2/org/apache/apache/8/apache-8.pom
Downloaded: http://repo.maven.apache.org/maven2/org/apache/apache/8/apache-8.pom (14 KB at
473.3 KB/sec)
Downloading: http://repo.maven.apache.org/maven2/org/apache/maven/plugins/maven-surefire-plugin/2.7.1/maven-surefire-plugin-2.7.1.jar
Downloaded: http://repo.maven.apache.org/maven2/org/apache/maven/plugins/maven-surefire-plugin/2.7.1/maven-surefire-plugin-2.7.1.jar
(29 KB at 941.5 KB/sec)
Downloading: http://repo.maven.apache.org/maven2/junit/junit/4.8/junit-4.8.pom
Downloaded: http://repo.maven.apache.org/maven2/junit/junit/4.8/junit-4.8.pom (2 KB at 49.8
KB/sec)
Downloading: http://repo.maven.apache.org/maven2/xmlunit/xmlunit/1.2/xmlunit-1.2.pom
Downloaded: http://repo.maven.apache.org/maven2/xmlunit/xmlunit/1.2/xmlunit-1.2.pom (3 KB
at 89.8 KB/sec)
Downloading: http://repo.maven.apache.org/maven2/com/google/guava/guava-testlib/15.0/guava-testlib-15.0.pom
Downloaded: http://repo.maven.apache.org/maven2/com/google/guava/guava-testlib/15.0/guava-testlib-15.0.pom
(3 KB at 13.3 KB/sec)
Downloading: http://repo.maven.apache.org/maven2/com/google/guava/guava-parent/15.0/guava-parent-15.0.pom
Downloaded: http://repo.maven.apache.org/maven2/com/google/guava/guava-parent/15.0/guava-parent-15.0.pom
(8 KB at 247.0 KB/sec)
Downloading: http://repo.maven.apache.org/maven2/org/sonatype/oss/oss-parent/7/oss-parent-7.pom
Downloaded: http://repo.maven.apache.org/maven2/org/sonatype/oss/oss-parent/7/oss-parent-7.pom
(5 KB at 162.4 KB/sec)
Downloading: http://repo.maven.apache.org/maven2/com/google/code/findbugs/jsr305/1.3.9/jsr305-1.3.9.pom
Downloaded: http://repo.maven.apache.org/maven2/com/google/code/findbugs/jsr305/1.3.9/jsr305-1.3.9.pom
(965 B at 32.5 KB/sec)
Downloading: http://repo.maven.apache.org/maven2/com/google/guava/guava/15.0/guava-15.0.pom
Downloaded: http://repo.maven.apache.org/maven2/com/google/guava/guava/15.0/guava-15.0.pom
(7 KB at 210.5 KB/sec)
Downloading: http://repo.maven.apache.org/maven2/org/truth0/truth/0.13/truth-0.13.pom
Downloaded: http://repo.maven.apache.org/maven2/org/truth0/truth/0.13/truth-0.13.pom (6 KB
at 198.1 KB/sec)
Downloading: http://repo.maven.apache.org/maven2/org/truth0/truth-parent/0.13/truth-parent-0.13.pom
Downloaded: http://repo.maven.apache.org/maven2/org/truth0/truth-parent/0.13/truth-parent-0.13.pom
(4 KB at 111.2 KB/sec)
Downloading: http://repo.maven.apache.org/maven2/junit/junit/4.8/junit-4.8.jar
Downloading: http://repo.maven.apache.org/maven2/xmlunit/xmlunit/1.2/xmlunit-1.2.jar
Downloading: http://repo.maven.apache.org/maven2/com/google/guava/guava-testlib/15.0/guava-testlib-15.0.jar
Downloading: http://repo.maven.apache.org/maven2/com/google/code/findbugs/jsr305/1.3.9/jsr305-1.3.9.jar
Downloading: http://repo.maven.apache.org/maven2/com/google/guava/guava/15.0/guava-15.0.jar
Downloaded: http://repo.maven.apache.org/maven2/com/google/code/findbugs/jsr305/1.3.9/jsr305-1.3.9.jar
(33 KB at 597.1 KB/sec)
Downloading: http://repo.maven.apache.org/maven2/org/truth0/truth/0.13/truth-0.13.jar
Downloaded: http://repo.maven.apache.org/maven2/xmlunit/xmlunit/1.2/xmlunit-1.2.jar (95 KB
at 1208.3 KB/sec)
Downloaded: http://repo.maven.apache.org/maven2/junit/junit/4.8/junit-4.8.jar (232 KB at 2656.6
KB/sec)
Downloaded: http://repo.maven.apache.org/maven2/org/truth0/truth/0.13/truth-0.13.jar (51 KB
at 999.2 KB/sec)
Downloaded: http://repo.maven.apache.org/maven2/com/google/guava/guava/15.0/guava-15.0.jar
(2122 KB at 10449.5 KB/sec)
Downloaded: http://repo.maven.apache.org/maven2/com/google/guava/guava-testlib/15.0/guava-testlib-15.0.jar
(726 KB at 2394.3 KB/sec)
[INFO] 
[INFO] --- maven-checkstyle-plugin:2.6:checkstyle (validate) @ xmlschema-core ---
[INFO] Starting audit...
Audit done.

[INFO] 
[INFO] --- maven-pmd-plugin:2.5:pmd (pmd) @ xmlschema-core ---
[INFO] 
[INFO] --- maven-pmd-plugin:2.5:check (validate) @ xmlschema-core ---
[INFO] 
[INFO] 
[INFO] --- maven-remote-resources-plugin:1.0:process (default) @ xmlschema-core ---
Downloading: http://repo.maven.apache.org/maven2/org/codehaus/plexus/plexus-resources/1.0-alpha-4/plexus-resources-1.0-alpha-4.pom
Downloaded: http://repo.maven.apache.org/maven2/org/codehaus/plexus/plexus-resources/1.0-alpha-4/plexus-resources-1.0-alpha-4.pom
(762 B at 26.6 KB/sec)
Downloading: http://repo.maven.apache.org/maven2/org/codehaus/plexus/plexus-utils/1.4.1/plexus-utils-1.4.1.jar
Downloading: http://repo.maven.apache.org/maven2/org/codehaus/plexus/plexus-resources/1.0-alpha-4/plexus-resources-1.0-alpha-4.jar
Downloaded: http://repo.maven.apache.org/maven2/org/codehaus/plexus/plexus-resources/1.0-alpha-4/plexus-resources-1.0-alpha-4.jar
(17 KB at 524.5 KB/sec)
Downloaded: http://repo.maven.apache.org/maven2/org/codehaus/plexus/plexus-utils/1.4.1/plexus-utils-1.4.1.jar
(185 KB at 4605.7 KB/sec)
[INFO] Setting property: classpath.resource.loader.class => 'org.codehaus.plexus.velocity.ContextClassLoaderResourceLoader'.
[INFO] Setting property: velocimacro.messages.on => 'false'.
[INFO] Setting property: resource.loader => 'classpath'.
[INFO] Setting property: resource.manager.logwhenfound => 'false'.
[INFO] 
[INFO] --- maven-resources-plugin:2.4.3:resources (default-resources) @ xmlschema-core ---
[INFO] Using 'UTF-8' encoding to copy filtered resources.
[INFO] skip non existing resourceDirectory <https://builds.apache.org/job/xmlschema-trunk-jdk15/ws/xmlschema-core/src/main/resources>
[INFO] Copying 3 resources
[INFO] 
[INFO] --- maven-compiler-plugin:2.3.2:compile (default-compile) @ xmlschema-core ---
Downloading: http://repo.maven.apache.org/maven2/org/codehaus/plexus/plexus-compiler-api/1.8.1/plexus-compiler-api-1.8.1.pom
Downloaded: http://repo.maven.apache.org/maven2/org/codehaus/plexus/plexus-compiler-api/1.8.1/plexus-compiler-api-1.8.1.pom
(805 B at 28.1 KB/sec)
Downloading: http://repo.maven.apache.org/maven2/org/codehaus/plexus/plexus-compiler/1.8.1/plexus-compiler-1.8.1.pom
Downloaded: http://repo.maven.apache.org/maven2/org/codehaus/plexus/plexus-compiler/1.8.1/plexus-compiler-1.8.1.pom
(4 KB at 121.3 KB/sec)
Downloading: http://repo.maven.apache.org/maven2/org/codehaus/plexus/plexus-compiler-manager/1.8.1/plexus-compiler-manager-1.8.1.pom
Downloaded: http://repo.maven.apache.org/maven2/org/codehaus/plexus/plexus-compiler-manager/1.8.1/plexus-compiler-manager-1.8.1.pom
(713 B at 25.8 KB/sec)
Downloading: http://repo.maven.apache.org/maven2/org/codehaus/plexus/plexus-compiler-javac/1.8.1/plexus-compiler-javac-1.8.1.pom
Downloaded: http://repo.maven.apache.org/maven2/org/codehaus/plexus/plexus-compiler-javac/1.8.1/plexus-compiler-javac-1.8.1.pom
(710 B at 25.7 KB/sec)
Downloading: http://repo.maven.apache.org/maven2/org/codehaus/plexus/plexus-compilers/1.8.1/plexus-compilers-1.8.1.pom
Downloaded: http://repo.maven.apache.org/maven2/org/codehaus/plexus/plexus-compilers/1.8.1/plexus-compilers-1.8.1.pom
(2 KB at 48.0 KB/sec)
Downloading: http://repo.maven.apache.org/maven2/org/codehaus/plexus/plexus-compiler-api/1.8.1/plexus-compiler-api-1.8.1.jar
Downloading: http://repo.maven.apache.org/maven2/org/codehaus/plexus/plexus-compiler-manager/1.8.1/plexus-compiler-manager-1.8.1.jar
Downloading: http://repo.maven.apache.org/maven2/org/codehaus/plexus/plexus-compiler-javac/1.8.1/plexus-compiler-javac-1.8.1.jar
Downloaded: http://repo.maven.apache.org/maven2/org/codehaus/plexus/plexus-compiler-api/1.8.1/plexus-compiler-api-1.8.1.jar
(20 KB at 696.2 KB/sec)
Downloaded: http://repo.maven.apache.org/maven2/org/codehaus/plexus/plexus-compiler-manager/1.8.1/plexus-compiler-manager-1.8.1.jar
(6 KB at 167.7 KB/sec)
Downloaded: http://repo.maven.apache.org/maven2/org/codehaus/plexus/plexus-compiler-javac/1.8.1/plexus-compiler-javac-1.8.1.jar
(13 KB at 382.1 KB/sec)
[INFO] Compiling 106 source files to <https://builds.apache.org/job/xmlschema-trunk-jdk15/ws/xmlschema-core/target/classes>
[INFO] 
[INFO] --- maven-assembly-plugin:2.2:single (generate-test-zip) @ xmlschema-core ---
[INFO] Reading assembly descriptor: src/test/assembly/test-zip.xml
[INFO] Building zip: <https://builds.apache.org/job/xmlschema-trunk-jdk15/ws/xmlschema-core/target/test-zip.zip>
[INFO] 
[INFO] --- maven-resources-plugin:2.4.3:testResources (default-testResources) @ xmlschema-core
---
[INFO] Using 'UTF-8' encoding to copy filtered resources.
[INFO] Copying 83 resources
[INFO] Copying 3 resources
[INFO] 
[INFO] --- maven-compiler-plugin:2.3.2:testCompile (default-testCompile) @ xmlschema-core
---
[INFO] Compiling 61 source files to <https://builds.apache.org/job/xmlschema-trunk-jdk15/ws/xmlschema-core/target/test-classes>
[INFO] -------------------------------------------------------------
[ERROR] COMPILATION ERROR : 
[INFO] -------------------------------------------------------------
[ERROR] <https://builds.apache.org/job/xmlschema-trunk-jdk15/ws/xmlschema-core/src/test/java/tests/xmlschema30/NamedItemsEqualityTest.java>:[22,-1]
cannot access com.google.common.testing.EqualsTester
bad class file: <https://builds.apache.org/job/xmlschema-trunk-jdk15/ws/.repository/com/google/guava/guava-testlib/15.0/guava-testlib-15.0.jar(com/google/common/testing/EqualsTester.class)>
class file has wrong version 50.0, should be 49.0
[INFO] 1 error
[INFO] -------------------------------------------------------------
[JENKINS] Archiving disabled
[INFO] ------------------------------------------------------------------------
[INFO] Reactor Summary:
[INFO] 
[INFO] XmlSchema ......................................... SUCCESS [50.575s]
[INFO] XmlSchema Core .................................... FAILURE [13.517s]
[INFO] XmlSchema OSGi bundle test ........................ SKIPPED
[INFO] XmlSchema W3C tests ............................... SKIPPED
[INFO] ------------------------------------------------------------------------
[INFO] BUILD FAILURE
[INFO] ------------------------------------------------------------------------
[INFO] Total time: 1:12.341s
[INFO] Finished at: Wed Jan 22 10:59:42 UTC 2014
[INFO] Final Memory: 39M/220M
[INFO] ------------------------------------------------------------------------
[JENKINS] Archiving disabled
[JENKINS] Archiving disabled
[JENKINS] Archiving disabled
[JENKINS] Archiving disabled
Waiting for Jenkins to finish collecting data[ERROR] Failed to execute goal org.apache.maven.plugins:maven-compiler-plugin:2.3.2:testCompile
(default-testCompile) on project xmlschema-core: Compilation failure
[ERROR] <https://builds.apache.org/job/xmlschema-trunk-jdk15/ws/xmlschema-core/src/test/java/tests/xmlschema30/NamedItemsEqualityTest.java>:[22,-1]
cannot access com.google.common.testing.EqualsTester
[ERROR] bad class file: <https://builds.apache.org/job/xmlschema-trunk-jdk15/ws/.repository/com/google/guava/guava-testlib/15.0/guava-testlib-15.0.jar(com/google/common/testing/EqualsTester.class)>
[ERROR] class file has wrong version 50.0, should be 49.0
[ERROR] -> [Help 1]
[ERROR] 
[ERROR] To see the full stack trace of the errors, re-run Maven with the -e switch.
[ERROR] Re-run Maven using the -X switch to enable full debug logging.
[ERROR] 
[ERROR] For more information about the errors and possible solutions, please read the following
articles:
[ERROR] [Help 1] http://cwiki.apache.org/confluence/display/MAVEN/MojoFailureException
[ERROR] 
[ERROR] After correcting the problems, you can resume the build with the command
[ERROR]   mvn <goals> -rf :xmlschema-core

Sending e-mails to: dev@ws.apache.org
channel stopped
Updating XMLSCHEMA-26
Updating XMLSCHEMA-30

---------------------------------------------------------------------
To unsubscribe, e-mail: dev-unsubscribe@ws.apache.org
For additional commands, e-mail: dev-help@ws.apache.org


Mime
View raw message