ws-dev mailing list archives

Site index · List index
Message view « Date » · « Thread »
Top « Date » · « Thread »
From Apache Jenkins Server <jenk...@builds.apache.org>
Subject Build failed in Jenkins: ws-axiom-trunk #1810
Date Wed, 04 Jun 2014 19:54:45 GMT
See <https://builds.apache.org/job/ws-axiom-trunk/1810/changes>

Changes:

[veithen] AXIOM-447 - Iteration 5 - Tests: Added test cases with JAXB2 data binding.

------------------------------------------
[...truncated 801 lines...]
Loading source files for package org.apache.axiom.testutils.activation...
Loading source files for package org.apache.axiom.testutils.conformance...
Constructing Javadoc information...
Standard Doclet version 1.6.0_45
Building tree for all the packages and classes...
Generating <https://builds.apache.org/job/ws-axiom-trunk/ws/axiom/modules/axiom-testutils/target/apidocs/org/apache/axiom/testutils/namespace//NamespaceContextTestUtils.html...>
Generating <https://builds.apache.org/job/ws-axiom-trunk/ws/axiom/modules/axiom-testutils/target/apidocs/org/apache/axiom/testutils/stax//Normalizer.html...>
Generating <https://builds.apache.org/job/ws-axiom-trunk/ws/axiom/modules/axiom-testutils/target/apidocs/org/apache/axiom/testutils/stax//XMLStreamReaderComparator.html...>
Generating <https://builds.apache.org/job/ws-axiom-trunk/ws/axiom/modules/axiom-testutils/target/apidocs/org/apache/axiom/testutils/suite//Dimension.html...>
Generating <https://builds.apache.org/job/ws-axiom-trunk/ws/axiom/modules/axiom-testutils/target/apidocs/org/apache/axiom/testutils/suite//MatrixTestCase.html...>
Generating <https://builds.apache.org/job/ws-axiom-trunk/ws/axiom/modules/axiom-testutils/target/apidocs/org/apache/axiom/testutils/suite//MatrixTestSuiteBuilder.html...>
Generating <https://builds.apache.org/job/ws-axiom-trunk/ws/axiom/modules/axiom-testutils/target/apidocs/org/apache/axiom/testutils/suite//XSLTImplementation.html...>
Generating <https://builds.apache.org/job/ws-axiom-trunk/ws/axiom/modules/axiom-testutils/target/apidocs/org/apache/axiom/testutils//DigestUtils.html...>
Generating <https://builds.apache.org/job/ws-axiom-trunk/ws/axiom/modules/axiom-testutils/target/apidocs/org/apache/axiom/testutils//InvocationCounter.html...>
Generating <https://builds.apache.org/job/ws-axiom-trunk/ws/axiom/modules/axiom-testutils/target/apidocs/org/apache/axiom/testutils//PortAllocator.html...>
Generating <https://builds.apache.org/job/ws-axiom-trunk/ws/axiom/modules/axiom-testutils/target/apidocs/org/apache/axiom/testutils//RandomUtils.html...>
Generating <https://builds.apache.org/job/ws-axiom-trunk/ws/axiom/modules/axiom-testutils/target/apidocs/org/apache/axiom/testutils//XMLAssertEx.html...>
Generating <https://builds.apache.org/job/ws-axiom-trunk/ws/axiom/modules/axiom-testutils/target/apidocs/org/apache/axiom/testutils/concurrent//Action.html...>
Generating <https://builds.apache.org/job/ws-axiom-trunk/ws/axiom/modules/axiom-testutils/target/apidocs/org/apache/axiom/testutils/concurrent//ConcurrentTestUtils.html...>
Generating <https://builds.apache.org/job/ws-axiom-trunk/ws/axiom/modules/axiom-testutils/target/apidocs/org/apache/axiom/testutils/io//ByteStreamComparator.html...>
Generating <https://builds.apache.org/job/ws-axiom-trunk/ws/axiom/modules/axiom-testutils/target/apidocs/org/apache/axiom/testutils/io//CharacterStreamComparator.html...>
Generating <https://builds.apache.org/job/ws-axiom-trunk/ws/axiom/modules/axiom-testutils/target/apidocs/org/apache/axiom/testutils/io//CloseSensorInputStream.html...>
Generating <https://builds.apache.org/job/ws-axiom-trunk/ws/axiom/modules/axiom-testutils/target/apidocs/org/apache/axiom/testutils/io//CloseSensorReader.html...>
Generating <https://builds.apache.org/job/ws-axiom-trunk/ws/axiom/modules/axiom-testutils/target/apidocs/org/apache/axiom/testutils/io//CloseSensorWriter.html...>
Generating <https://builds.apache.org/job/ws-axiom-trunk/ws/axiom/modules/axiom-testutils/target/apidocs/org/apache/axiom/testutils/io//ExceptionInputStream.html...>
Generating <https://builds.apache.org/job/ws-axiom-trunk/ws/axiom/modules/axiom-testutils/target/apidocs/org/apache/axiom/testutils/io//IOTestUtils.html...>
Generating <https://builds.apache.org/job/ws-axiom-trunk/ws/axiom/modules/axiom-testutils/target/apidocs/org/apache/axiom/testutils/activation//RandomDataSource.html...>
Generating <https://builds.apache.org/job/ws-axiom-trunk/ws/axiom/modules/axiom-testutils/target/apidocs/org/apache/axiom/testutils/activation//TestDataSource.html...>
Generating <https://builds.apache.org/job/ws-axiom-trunk/ws/axiom/modules/axiom-testutils/target/apidocs/org/apache/axiom/testutils/conformance//ConformanceTestFile.html...>
Generating <https://builds.apache.org/job/ws-axiom-trunk/ws/axiom/modules/axiom-testutils/target/apidocs/overview-frame.html...>
Generating <https://builds.apache.org/job/ws-axiom-trunk/ws/axiom/modules/axiom-testutils/target/apidocs/org/apache/axiom/testutils//package-frame.html...>
Generating <https://builds.apache.org/job/ws-axiom-trunk/ws/axiom/modules/axiom-testutils/target/apidocs/org/apache/axiom/testutils//package-summary.html...>
Generating <https://builds.apache.org/job/ws-axiom-trunk/ws/axiom/modules/axiom-testutils/target/apidocs/org/apache/axiom/testutils//package-tree.html...>
Generating <https://builds.apache.org/job/ws-axiom-trunk/ws/axiom/modules/axiom-testutils/target/apidocs/org/apache/axiom/testutils/activation//package-frame.html...>
Generating <https://builds.apache.org/job/ws-axiom-trunk/ws/axiom/modules/axiom-testutils/target/apidocs/org/apache/axiom/testutils/activation//package-summary.html...>
Generating <https://builds.apache.org/job/ws-axiom-trunk/ws/axiom/modules/axiom-testutils/target/apidocs/org/apache/axiom/testutils/activation//package-tree.html...>
Generating <https://builds.apache.org/job/ws-axiom-trunk/ws/axiom/modules/axiom-testutils/target/apidocs/org/apache/axiom/testutils/concurrent//package-frame.html...>
Generating <https://builds.apache.org/job/ws-axiom-trunk/ws/axiom/modules/axiom-testutils/target/apidocs/org/apache/axiom/testutils/concurrent//package-summary.html...>
Generating <https://builds.apache.org/job/ws-axiom-trunk/ws/axiom/modules/axiom-testutils/target/apidocs/org/apache/axiom/testutils/concurrent//package-tree.html...>
Generating <https://builds.apache.org/job/ws-axiom-trunk/ws/axiom/modules/axiom-testutils/target/apidocs/org/apache/axiom/testutils/conformance//package-frame.html...>
Generating <https://builds.apache.org/job/ws-axiom-trunk/ws/axiom/modules/axiom-testutils/target/apidocs/org/apache/axiom/testutils/conformance//package-summary.html...>
Generating <https://builds.apache.org/job/ws-axiom-trunk/ws/axiom/modules/axiom-testutils/target/apidocs/org/apache/axiom/testutils/conformance//package-tree.html...>
Generating <https://builds.apache.org/job/ws-axiom-trunk/ws/axiom/modules/axiom-testutils/target/apidocs/org/apache/axiom/testutils/io//package-frame.html...>
Generating <https://builds.apache.org/job/ws-axiom-trunk/ws/axiom/modules/axiom-testutils/target/apidocs/org/apache/axiom/testutils/io//package-summary.html...>
Generating <https://builds.apache.org/job/ws-axiom-trunk/ws/axiom/modules/axiom-testutils/target/apidocs/org/apache/axiom/testutils/io//package-tree.html...>
Generating <https://builds.apache.org/job/ws-axiom-trunk/ws/axiom/modules/axiom-testutils/target/apidocs/org/apache/axiom/testutils/namespace//package-frame.html...>
Generating <https://builds.apache.org/job/ws-axiom-trunk/ws/axiom/modules/axiom-testutils/target/apidocs/org/apache/axiom/testutils/namespace//package-summary.html...>
Generating <https://builds.apache.org/job/ws-axiom-trunk/ws/axiom/modules/axiom-testutils/target/apidocs/org/apache/axiom/testutils/namespace//package-tree.html...>
Generating <https://builds.apache.org/job/ws-axiom-trunk/ws/axiom/modules/axiom-testutils/target/apidocs/org/apache/axiom/testutils/stax//package-frame.html...>
Generating <https://builds.apache.org/job/ws-axiom-trunk/ws/axiom/modules/axiom-testutils/target/apidocs/org/apache/axiom/testutils/stax//package-summary.html...>
Generating <https://builds.apache.org/job/ws-axiom-trunk/ws/axiom/modules/axiom-testutils/target/apidocs/org/apache/axiom/testutils/stax//package-tree.html...>
Generating <https://builds.apache.org/job/ws-axiom-trunk/ws/axiom/modules/axiom-testutils/target/apidocs/org/apache/axiom/testutils/suite//package-frame.html...>
Generating <https://builds.apache.org/job/ws-axiom-trunk/ws/axiom/modules/axiom-testutils/target/apidocs/org/apache/axiom/testutils/suite//package-summary.html...>
Generating <https://builds.apache.org/job/ws-axiom-trunk/ws/axiom/modules/axiom-testutils/target/apidocs/org/apache/axiom/testutils/suite//package-tree.html...>
Generating <https://builds.apache.org/job/ws-axiom-trunk/ws/axiom/modules/axiom-testutils/target/apidocs/constant-values.html...>
Generating <https://builds.apache.org/job/ws-axiom-trunk/ws/axiom/modules/axiom-testutils/target/apidocs/org/apache/axiom/testutils/namespace//class-use/NamespaceContextTestUtils.html...>
Generating <https://builds.apache.org/job/ws-axiom-trunk/ws/axiom/modules/axiom-testutils/target/apidocs/org/apache/axiom/testutils/stax//class-use/XMLStreamReaderComparator.html...>
Generating <https://builds.apache.org/job/ws-axiom-trunk/ws/axiom/modules/axiom-testutils/target/apidocs/org/apache/axiom/testutils/stax//class-use/Normalizer.html...>
Generating <https://builds.apache.org/job/ws-axiom-trunk/ws/axiom/modules/axiom-testutils/target/apidocs/org/apache/axiom/testutils/suite//class-use/MatrixTestSuiteBuilder.html...>
Generating <https://builds.apache.org/job/ws-axiom-trunk/ws/axiom/modules/axiom-testutils/target/apidocs/org/apache/axiom/testutils/suite//class-use/Dimension.html...>
Generating <https://builds.apache.org/job/ws-axiom-trunk/ws/axiom/modules/axiom-testutils/target/apidocs/org/apache/axiom/testutils/suite//class-use/MatrixTestCase.html...>
Generating <https://builds.apache.org/job/ws-axiom-trunk/ws/axiom/modules/axiom-testutils/target/apidocs/org/apache/axiom/testutils/suite//class-use/XSLTImplementation.html...>
Generating <https://builds.apache.org/job/ws-axiom-trunk/ws/axiom/modules/axiom-testutils/target/apidocs/org/apache/axiom/testutils//class-use/XMLAssertEx.html...>
Generating <https://builds.apache.org/job/ws-axiom-trunk/ws/axiom/modules/axiom-testutils/target/apidocs/org/apache/axiom/testutils//class-use/RandomUtils.html...>
Generating <https://builds.apache.org/job/ws-axiom-trunk/ws/axiom/modules/axiom-testutils/target/apidocs/org/apache/axiom/testutils//class-use/InvocationCounter.html...>
Generating <https://builds.apache.org/job/ws-axiom-trunk/ws/axiom/modules/axiom-testutils/target/apidocs/org/apache/axiom/testutils//class-use/DigestUtils.html...>
Generating <https://builds.apache.org/job/ws-axiom-trunk/ws/axiom/modules/axiom-testutils/target/apidocs/org/apache/axiom/testutils//class-use/PortAllocator.html...>
Generating <https://builds.apache.org/job/ws-axiom-trunk/ws/axiom/modules/axiom-testutils/target/apidocs/org/apache/axiom/testutils/concurrent//class-use/ConcurrentTestUtils.html...>
Generating <https://builds.apache.org/job/ws-axiom-trunk/ws/axiom/modules/axiom-testutils/target/apidocs/org/apache/axiom/testutils/concurrent//class-use/Action.html...>
Generating <https://builds.apache.org/job/ws-axiom-trunk/ws/axiom/modules/axiom-testutils/target/apidocs/org/apache/axiom/testutils/io//class-use/CharacterStreamComparator.html...>
Generating <https://builds.apache.org/job/ws-axiom-trunk/ws/axiom/modules/axiom-testutils/target/apidocs/org/apache/axiom/testutils/io//class-use/IOTestUtils.html...>
Generating <https://builds.apache.org/job/ws-axiom-trunk/ws/axiom/modules/axiom-testutils/target/apidocs/org/apache/axiom/testutils/io//class-use/ByteStreamComparator.html...>
Generating <https://builds.apache.org/job/ws-axiom-trunk/ws/axiom/modules/axiom-testutils/target/apidocs/org/apache/axiom/testutils/io//class-use/CloseSensorWriter.html...>
Generating <https://builds.apache.org/job/ws-axiom-trunk/ws/axiom/modules/axiom-testutils/target/apidocs/org/apache/axiom/testutils/io//class-use/CloseSensorInputStream.html...>
Generating <https://builds.apache.org/job/ws-axiom-trunk/ws/axiom/modules/axiom-testutils/target/apidocs/org/apache/axiom/testutils/io//class-use/ExceptionInputStream.html...>
Generating <https://builds.apache.org/job/ws-axiom-trunk/ws/axiom/modules/axiom-testutils/target/apidocs/org/apache/axiom/testutils/io//class-use/CloseSensorReader.html...>
Generating <https://builds.apache.org/job/ws-axiom-trunk/ws/axiom/modules/axiom-testutils/target/apidocs/org/apache/axiom/testutils/activation//class-use/RandomDataSource.html...>
Generating <https://builds.apache.org/job/ws-axiom-trunk/ws/axiom/modules/axiom-testutils/target/apidocs/org/apache/axiom/testutils/activation//class-use/TestDataSource.html...>
Generating <https://builds.apache.org/job/ws-axiom-trunk/ws/axiom/modules/axiom-testutils/target/apidocs/org/apache/axiom/testutils/conformance//class-use/ConformanceTestFile.html...>
Generating <https://builds.apache.org/job/ws-axiom-trunk/ws/axiom/modules/axiom-testutils/target/apidocs/org/apache/axiom/testutils//package-use.html...>
Generating <https://builds.apache.org/job/ws-axiom-trunk/ws/axiom/modules/axiom-testutils/target/apidocs/org/apache/axiom/testutils/activation//package-use.html...>
Generating <https://builds.apache.org/job/ws-axiom-trunk/ws/axiom/modules/axiom-testutils/target/apidocs/org/apache/axiom/testutils/concurrent//package-use.html...>
Generating <https://builds.apache.org/job/ws-axiom-trunk/ws/axiom/modules/axiom-testutils/target/apidocs/org/apache/axiom/testutils/conformance//package-use.html...>
Generating <https://builds.apache.org/job/ws-axiom-trunk/ws/axiom/modules/axiom-testutils/target/apidocs/org/apache/axiom/testutils/io//package-use.html...>
Generating <https://builds.apache.org/job/ws-axiom-trunk/ws/axiom/modules/axiom-testutils/target/apidocs/org/apache/axiom/testutils/namespace//package-use.html...>
Generating <https://builds.apache.org/job/ws-axiom-trunk/ws/axiom/modules/axiom-testutils/target/apidocs/org/apache/axiom/testutils/stax//package-use.html...>
Generating <https://builds.apache.org/job/ws-axiom-trunk/ws/axiom/modules/axiom-testutils/target/apidocs/org/apache/axiom/testutils/suite//package-use.html...>
Building index for all the packages and classes...
Generating <https://builds.apache.org/job/ws-axiom-trunk/ws/axiom/modules/axiom-testutils/target/apidocs/overview-tree.html...>
Generating <https://builds.apache.org/job/ws-axiom-trunk/ws/axiom/modules/axiom-testutils/target/apidocs/index-all.html...>
Generating <https://builds.apache.org/job/ws-axiom-trunk/ws/axiom/modules/axiom-testutils/target/apidocs/deprecated-list.html...>
Building index for all classes...
Generating <https://builds.apache.org/job/ws-axiom-trunk/ws/axiom/modules/axiom-testutils/target/apidocs/allclasses-frame.html...>
Generating <https://builds.apache.org/job/ws-axiom-trunk/ws/axiom/modules/axiom-testutils/target/apidocs/allclasses-noframe.html...>
Generating <https://builds.apache.org/job/ws-axiom-trunk/ws/axiom/modules/axiom-testutils/target/apidocs/index.html...>
Generating <https://builds.apache.org/job/ws-axiom-trunk/ws/axiom/modules/axiom-testutils/target/apidocs/overview-summary.html...>
Generating <https://builds.apache.org/job/ws-axiom-trunk/ws/axiom/modules/axiom-testutils/target/apidocs/help-doc.html...>
Generating <https://builds.apache.org/job/ws-axiom-trunk/ws/axiom/modules/axiom-testutils/target/apidocs/stylesheet.css...>
9 warnings
[WARNING] Javadoc Warnings
[WARNING] <https://builds.apache.org/job/ws-axiom-trunk/ws/axiom/modules/axiom-testutils/src/main/java/org/apache/axiom/testutils/suite/MatrixTestSuiteBuilder.java>:37:
warning - Tag @link: reference not found: MatrixTextCase
[WARNING] <https://builds.apache.org/job/ws-axiom-trunk/ws/axiom/modules/axiom-testutils/src/main/java/org/apache/axiom/testutils/suite/XSLTImplementation.java>:66:
warning - Tag @link: reference not found: SAXResult
[WARNING] <https://builds.apache.org/job/ws-axiom-trunk/ws/axiom/modules/axiom-testutils/src/main/java/org/apache/axiom/testutils/suite/XSLTImplementation.java>:66:
warning - Tag @link: reference not found: LexicalHandler
[WARNING] <https://builds.apache.org/job/ws-axiom-trunk/ws/axiom/modules/axiom-testutils/src/main/java/org/apache/axiom/testutils/suite/XSLTImplementation.java>:66:
warning - Tag @link: reference not found: SAXResult
[WARNING] <https://builds.apache.org/job/ws-axiom-trunk/ws/axiom/modules/axiom-testutils/src/main/java/org/apache/axiom/testutils/suite/XSLTImplementation.java>:66:
warning - Tag @link: reference not found: LexicalHandler
[WARNING] <https://builds.apache.org/job/ws-axiom-trunk/ws/axiom/modules/axiom-testutils/src/main/java/org/apache/axiom/testutils/suite/XSLTImplementation.java>:66:
warning - Tag @link: reference not found: LexicalHandler
[WARNING] <https://builds.apache.org/job/ws-axiom-trunk/ws/axiom/modules/axiom-testutils/src/main/java/org/apache/axiom/testutils/suite/XSLTImplementation.java>:66:
warning - Tag @link: reference not found: SAXResult
[WARNING] <https://builds.apache.org/job/ws-axiom-trunk/ws/axiom/modules/axiom-testutils/src/main/java/org/apache/axiom/testutils/suite/XSLTImplementation.java>:66:
warning - Tag @link: reference not found: SAXResult
[WARNING] <https://builds.apache.org/job/ws-axiom-trunk/ws/axiom/modules/axiom-testutils/src/main/java/org/apache/axiom/testutils/suite/XSLTImplementation.java>:66:
warning - Tag @link: reference not found: LexicalHandler
[INFO] Building jar: <https://builds.apache.org/job/ws-axiom-trunk/ws/axiom/modules/axiom-testutils/target/axiom-testutils-1.2.15-SNAPSHOT-javadoc.jar>
[INFO] 
[INFO] --- maven-site-plugin:3.2:attach-descriptor (attach-descriptor) @ axiom-testutils ---
[INFO] 
[INFO] --- build-helper-maven-plugin:1.7:attach-artifact (attach-jacoco-exec) @ axiom-testutils
---
[INFO] Skip attaching artifacts
[INFO] 
[INFO] --- animal-sniffer-maven-plugin:1.8:check (check) @ axiom-testutils ---
[INFO] Checking unresolved references to org.codehaus.mojo.signature:java15:1.0
[INFO] 
[INFO] --- maven-gpg-plugin:1.4:sign (default) @ axiom-testutils ---
[INFO] 
[INFO] --- apache-rat-plugin:0.10:check (default) @ axiom-testutils ---
[INFO] 51 implicit excludes (use -debug for more details).
[INFO] Exclude: src/main/resources/**
[INFO] 26 resources included (use -debug for more details)
[INFO] Rat check: Summary of files. Unapproved: 0 unknown: 0 generated: 0 approved: 26 licence.
[INFO] 
[INFO] --- maven-install-plugin:2.3.1:install (default-install) @ axiom-testutils ---
[INFO] Installing <https://builds.apache.org/job/ws-axiom-trunk/ws/axiom/modules/axiom-testutils/target/axiom-testutils-1.2.15-SNAPSHOT.jar>
to <https://builds.apache.org/job/ws-axiom-trunk/ws/.repository/org/apache/ws/commons/axiom/axiom-testutils/1.2.15-SNAPSHOT/axiom-testutils-1.2.15-SNAPSHOT.jar>
[INFO] Installing <https://builds.apache.org/job/ws-axiom-trunk/ws/axiom/modules/axiom-testutils/pom.xml>
to <https://builds.apache.org/job/ws-axiom-trunk/ws/.repository/org/apache/ws/commons/axiom/axiom-testutils/1.2.15-SNAPSHOT/axiom-testutils-1.2.15-SNAPSHOT.pom>
[INFO] Installing <https://builds.apache.org/job/ws-axiom-trunk/ws/axiom/modules/axiom-testutils/target/axiom-testutils-1.2.15-SNAPSHOT-sources.jar>
to <https://builds.apache.org/job/ws-axiom-trunk/ws/.repository/org/apache/ws/commons/axiom/axiom-testutils/1.2.15-SNAPSHOT/axiom-testutils-1.2.15-SNAPSHOT-sources.jar>
[INFO] Installing <https://builds.apache.org/job/ws-axiom-trunk/ws/axiom/modules/axiom-testutils/target/axiom-testutils-1.2.15-SNAPSHOT-javadoc.jar>
to <https://builds.apache.org/job/ws-axiom-trunk/ws/.repository/org/apache/ws/commons/axiom/axiom-testutils/1.2.15-SNAPSHOT/axiom-testutils-1.2.15-SNAPSHOT-javadoc.jar>
[INFO] 
[INFO] --- maven-deploy-plugin:2.7:deploy (default-deploy) @ axiom-testutils ---
Downloading: https://repository.apache.org/content/repositories/snapshots/org/apache/ws/commons/axiom/axiom-testutils/1.2.15-SNAPSHOT/maven-metadata.xml
Downloaded: https://repository.apache.org/content/repositories/snapshots/org/apache/ws/commons/axiom/axiom-testutils/1.2.15-SNAPSHOT/maven-metadata.xml
(2 KB at 0.9 KB/sec)
Uploading: https://repository.apache.org/content/repositories/snapshots/org/apache/ws/commons/axiom/axiom-testutils/1.2.15-SNAPSHOT/axiom-testutils-1.2.15-20140604.195259-506.jar
Uploaded: https://repository.apache.org/content/repositories/snapshots/org/apache/ws/commons/axiom/axiom-testutils/1.2.15-SNAPSHOT/axiom-testutils-1.2.15-20140604.195259-506.jar
(51 KB at 393.9 KB/sec)
Uploading: https://repository.apache.org/content/repositories/snapshots/org/apache/ws/commons/axiom/axiom-testutils/1.2.15-SNAPSHOT/axiom-testutils-1.2.15-20140604.195259-506.pom
Uploaded: https://repository.apache.org/content/repositories/snapshots/org/apache/ws/commons/axiom/axiom-testutils/1.2.15-SNAPSHOT/axiom-testutils-1.2.15-20140604.195259-506.pom
(7 KB at 148.4 KB/sec)
Downloading: https://repository.apache.org/content/repositories/snapshots/org/apache/ws/commons/axiom/axiom-testutils/maven-metadata.xml
Downloaded: https://repository.apache.org/content/repositories/snapshots/org/apache/ws/commons/axiom/axiom-testutils/maven-metadata.xml
(364 B at 0.6 KB/sec)
Uploading: https://repository.apache.org/content/repositories/snapshots/org/apache/ws/commons/axiom/axiom-testutils/1.2.15-SNAPSHOT/maven-metadata.xml
Uploaded: https://repository.apache.org/content/repositories/snapshots/org/apache/ws/commons/axiom/axiom-testutils/1.2.15-SNAPSHOT/maven-metadata.xml
(2 KB at 2.4 KB/sec)
Uploading: https://repository.apache.org/content/repositories/snapshots/org/apache/ws/commons/axiom/axiom-testutils/maven-metadata.xml
[INFO] ------------------------------------------------------------------------
[INFO] Reactor Summary:
[INFO] 
[INFO] Axiom ............................................. SUCCESS [9:39.687s]
[INFO] Axiom Build Utilities ............................. SUCCESS [2:14.728s]
[INFO] Build utilities ................................... SUCCESS [15.556s]
[INFO] Pax Exam Maven plugin ............................. SUCCESS [2:19.703s]
[INFO] Resource Transformer for OSGi Manifests ........... SUCCESS [52.720s]
[INFO] Axiom Test Utilities .............................. FAILURE [3:02.198s]
[INFO] Axiom Jaxen Test Suite ............................ SKIPPED
[INFO] Axiom DOM Test Suite .............................. SKIPPED
[INFO] Axiom API ......................................... SKIPPED
[INFO] Axiom Implementation Test Suite ................... SKIPPED
[INFO] Axiom Common Implementation Classes ............... SKIPPED
[INFO] Axiom Impl ........................................ SKIPPED
[INFO] Axiom DOM ......................................... SKIPPED
[INFO] Axiom Compatibility Classes ....................... SKIPPED
[INFO] Axiom JAXB Integration ............................ SKIPPED
[INFO] Axiom C14N ........................................ SKIPPED
[INFO] Axiom Test Suite .................................. SKIPPED
[INFO] Axiom Integration Test Suite ...................... SKIPPED
[INFO] Axiom Uber-JAR .................................... SKIPPED
[INFO] Axiom Samples ..................................... SKIPPED
[INFO] Spring-WS Test Suite .............................. SKIPPED
[INFO] Axiom/Spring-WS Integration ....................... SKIPPED
[INFO] System Tests ...................................... SKIPPED
[INFO] Eclipse Tests ..................................... SKIPPED
[INFO] JBoss Tests ....................................... SKIPPED
[INFO] Axiom OSGi Tests .................................. SKIPPED
[INFO] Spring WS Tests ................................... SKIPPED
[INFO] Signature files for forbidden-api ................. SKIPPED
[INFO] Developer Guide ................................... SKIPPED
[INFO] User Guide ........................................ SKIPPED
[INFO] Javadoc ........................................... SKIPPED
[INFO] Distribution ...................................... SKIPPED
[INFO] Code Coverage Report .............................. SKIPPED
[INFO] ------------------------------------------------------------------------
[INFO] BUILD FAILURE
[INFO] ------------------------------------------------------------------------
[INFO] Total time: 18:35.223s
[INFO] Finished at: Wed Jun 04 19:53:56 UTC 2014
[INFO] Final Memory: 44M/141M
[INFO] ------------------------------------------------------------------------
Waiting for Jenkins to finish collecting data
[ERROR] Failed to execute goal org.apache.maven.plugins:maven-deploy-plugin:2.7:deploy (default-deploy)
on project axiom-testutils: Failed to deploy metadata: Could not transfer metadata org.apache.ws.commons.axiom:axiom-testutils/maven-metadata.xml
from/to apache.snapshots.https (https://repository.apache.org/content/repositories/snapshots):
The target server failed to respond -> [Help 1]
[ERROR] 
[ERROR] To see the full stack trace of the errors, re-run Maven with the -e switch.
[ERROR] Re-run Maven using the -X switch to enable full debug logging.
[ERROR] 
[ERROR] For more information about the errors and possible solutions, please read the following
articles:
[ERROR] [Help 1] http://cwiki.apache.org/confluence/display/MAVEN/MojoExecutionException
[ERROR] 
[ERROR] After correcting the problems, you can resume the build with the command
[ERROR]   mvn <goals> -rf :axiom-testutils
[JENKINS] Archiving <https://builds.apache.org/job/ws-axiom-trunk/ws/axiom/modules/axiom-compat/pom.xml>
to org.apache.ws.commons.axiom/axiom-compat/1.2.15-SNAPSHOT/axiom-compat-1.2.15-SNAPSHOT.pom
[JENKINS] Archiving <https://builds.apache.org/job/ws-axiom-trunk/ws/axiom/modules/axiom-impl/pom.xml>
to org.apache.ws.commons.axiom/axiom-impl/1.2.15-SNAPSHOT/axiom-impl-1.2.15-SNAPSHOT.pom
[JENKINS] Archiving <https://builds.apache.org/job/ws-axiom-trunk/ws/axiom/modules/axiom-jaxen-testsuite/pom.xml>
to org.apache.ws.commons.axiom/axiom-jaxen-testsuite/1.2.15-SNAPSHOT/axiom-jaxen-testsuite-1.2.15-SNAPSHOT.pom
[JENKINS] Archiving <https://builds.apache.org/job/ws-axiom-trunk/ws/axiom/modules/axiom-jaxb/pom.xml>
to org.apache.ws.commons.axiom/axiom-jaxb/1.2.15-SNAPSHOT/axiom-jaxb-1.2.15-SNAPSHOT.pom
[JENKINS] Archiving <https://builds.apache.org/job/ws-axiom-trunk/ws/axiom/modules/axiom-integration/pom.xml>
to org.apache.ws.commons.axiom/axiom-integration/1.2.15-SNAPSHOT/axiom-integration-1.2.15-SNAPSHOT.pom
[JENKINS] Archiving <https://builds.apache.org/job/ws-axiom-trunk/ws/axiom/buildutils/pom.xml>
to org.apache.ws.commons.axiom/buildutils/1.2.15-SNAPSHOT/buildutils-1.2.15-SNAPSHOT.pom
[JENKINS] Archiving <https://builds.apache.org/job/ws-axiom-trunk/ws/axiom/systests/spring-ws-tests/pom.xml>
to org.apache.ws.commons.axiom/spring-ws-tests/1.2.15-SNAPSHOT/spring-ws-tests-1.2.15-SNAPSHOT.pom
[JENKINS] Archiving <https://builds.apache.org/job/ws-axiom-trunk/ws/axiom/modules/axiom-all/pom.xml>
to org.apache.ws.commons.axiom/axiom-all/1.2.15-SNAPSHOT/axiom-all-1.2.15-SNAPSHOT.pom
[JENKINS] Archiving <https://builds.apache.org/job/ws-axiom-trunk/ws/axiom/devguide/pom.xml>
to org.apache.ws.commons.axiom/devguide/1.2.15-SNAPSHOT/devguide-1.2.15-SNAPSHOT.pom
[JENKINS] Archiving <https://builds.apache.org/job/ws-axiom-trunk/ws/axiom/modules/axiom-dom-testsuite/pom.xml>
to org.apache.ws.commons.axiom/axiom-dom-testsuite/1.2.15-SNAPSHOT/axiom-dom-testsuite-1.2.15-SNAPSHOT.pom
[JENKINS] Archiving <https://builds.apache.org/job/ws-axiom-trunk/ws/axiom/modules/axiom-testutils/pom.xml>
to org.apache.ws.commons.axiom/axiom-testutils/1.2.15-SNAPSHOT/axiom-testutils-1.2.15-SNAPSHOT.pom
[JENKINS] Archiving <https://builds.apache.org/job/ws-axiom-trunk/ws/axiom/modules/axiom-testutils/target/axiom-testutils-1.2.15-SNAPSHOT.jar>
to org.apache.ws.commons.axiom/axiom-testutils/1.2.15-SNAPSHOT/axiom-testutils-1.2.15-SNAPSHOT.jar
[JENKINS] Archiving <https://builds.apache.org/job/ws-axiom-trunk/ws/axiom/modules/axiom-testutils/target/axiom-testutils-1.2.15-SNAPSHOT-sources.jar>
to org.apache.ws.commons.axiom/axiom-testutils/1.2.15-SNAPSHOT/axiom-testutils-1.2.15-SNAPSHOT-sources.jar
[JENKINS] Archiving <https://builds.apache.org/job/ws-axiom-trunk/ws/axiom/modules/axiom-testutils/target/axiom-testutils-1.2.15-SNAPSHOT-javadoc.jar>
to org.apache.ws.commons.axiom/axiom-testutils/1.2.15-SNAPSHOT/axiom-testutils-1.2.15-SNAPSHOT-javadoc.jar
[JENKINS] Archiving <https://builds.apache.org/job/ws-axiom-trunk/ws/axiom/modules/axiom-dom/pom.xml>
to org.apache.ws.commons.axiom/axiom-dom/1.2.15-SNAPSHOT/axiom-dom-1.2.15-SNAPSHOT.pom
[JENKINS] Archiving <https://builds.apache.org/job/ws-axiom-trunk/ws/axiom/buildutils/shade-osgi/pom.xml>
to org.apache.ws.commons.axiom/shade-osgi/1.2.15-SNAPSHOT/shade-osgi-1.2.15-SNAPSHOT.pom
[JENKINS] Archiving <https://builds.apache.org/job/ws-axiom-trunk/ws/axiom/buildutils/shade-osgi/target/shade-osgi-1.2.15-SNAPSHOT.jar>
to org.apache.ws.commons.axiom/shade-osgi/1.2.15-20140604.195051-33/shade-osgi-1.2.15-20140604.195051-33.jar
[JENKINS] Archiving <https://builds.apache.org/job/ws-axiom-trunk/ws/axiom/buildutils/shade-osgi/target/shade-osgi-1.2.15-SNAPSHOT-sources.jar>
to org.apache.ws.commons.axiom/shade-osgi/1.2.15-20140604.195051-33/shade-osgi-1.2.15-20140604.195051-33-sources.jar
[JENKINS] Archiving <https://builds.apache.org/job/ws-axiom-trunk/ws/axiom/buildutils/shade-osgi/target/shade-osgi-1.2.15-SNAPSHOT-javadoc.jar>
to org.apache.ws.commons.axiom/shade-osgi/1.2.15-20140604.195051-33/shade-osgi-1.2.15-20140604.195051-33-javadoc.jar
[JENKINS] Archiving <https://builds.apache.org/job/ws-axiom-trunk/ws/axiom/modules/axiom-c14n/pom.xml>
to org.apache.ws.commons.axiom/axiom-c14n/1.2.15-SNAPSHOT/axiom-c14n-1.2.15-SNAPSHOT.pom
[JENKINS] Archiving <https://builds.apache.org/job/ws-axiom-trunk/ws/axiom/axiom-spring-ws/pom.xml>
to org.apache.ws.commons.axiom/axiom-spring-ws/1.2.15-SNAPSHOT/axiom-spring-ws-1.2.15-SNAPSHOT.pom
[JENKINS] Archiving <https://builds.apache.org/job/ws-axiom-trunk/ws/axiom/pom.xml>
to org.apache.ws.commons.axiom/axiom/1.2.15-SNAPSHOT/axiom-1.2.15-SNAPSHOT.pom
[JENKINS] Archiving <https://builds.apache.org/job/ws-axiom-trunk/ws/axiom/target/axiom-1.2.15-SNAPSHOT-source-release.zip>
to org.apache.ws.commons.axiom/axiom/1.2.15-20140604.194432-510/axiom-1.2.15-20140604.194432-510-source-release.zip
[JENKINS] Archiving <https://builds.apache.org/job/ws-axiom-trunk/ws/axiom/target/axiom-1.2.15-SNAPSHOT-site.xml>
to org.apache.ws.commons.axiom/axiom/1.2.15-20140604.194432-510/axiom-1.2.15-20140604.194432-510-site.xml
[JENKINS] Archiving <https://builds.apache.org/job/ws-axiom-trunk/ws/axiom/code-coverage/pom.xml>
to org.apache.ws.commons.axiom/code-coverage/1.2.15-SNAPSHOT/code-coverage-1.2.15-SNAPSHOT.pom
[JENKINS] Archiving <https://builds.apache.org/job/ws-axiom-trunk/ws/axiom/forbiddenapi-signatures/pom.xml>
to org.apache.ws.commons.axiom/forbiddenapi-signatures/1.2.15-SNAPSHOT/forbiddenapi-signatures-1.2.15-SNAPSHOT.pom
[JENKINS] Archiving <https://builds.apache.org/job/ws-axiom-trunk/ws/axiom/modules/axiom-buildutils/pom.xml>
to org.apache.ws.commons.axiom/axiom-buildutils/1.2.15-SNAPSHOT/axiom-buildutils-1.2.15-SNAPSHOT.pom
[JENKINS] Archiving <https://builds.apache.org/job/ws-axiom-trunk/ws/axiom/modules/axiom-buildutils/target/axiom-buildutils-1.2.15-SNAPSHOT.jar>
to org.apache.ws.commons.axiom/axiom-buildutils/1.2.15-20140604.194717-507/axiom-buildutils-1.2.15-20140604.194717-507.jar
[JENKINS] Archiving <https://builds.apache.org/job/ws-axiom-trunk/ws/axiom/modules/axiom-buildutils/target/axiom-buildutils-1.2.15-SNAPSHOT-sources.jar>
to org.apache.ws.commons.axiom/axiom-buildutils/1.2.15-20140604.194717-507/axiom-buildutils-1.2.15-20140604.194717-507-sources.jar
[JENKINS] Archiving <https://builds.apache.org/job/ws-axiom-trunk/ws/axiom/modules/axiom-buildutils/target/axiom-buildutils-1.2.15-SNAPSHOT-javadoc.jar>
to org.apache.ws.commons.axiom/axiom-buildutils/1.2.15-20140604.194717-507/axiom-buildutils-1.2.15-20140604.194717-507-javadoc.jar
[JENKINS] Archiving <https://builds.apache.org/job/ws-axiom-trunk/ws/axiom/systests/jboss-tests/pom.xml>
to org.apache.ws.commons.axiom/jboss-tests/1.2.15-SNAPSHOT/jboss-tests-1.2.15-SNAPSHOT.pom
[JENKINS] Archiving <https://builds.apache.org/job/ws-axiom-trunk/ws/axiom/systests/eclipse-tests/pom.xml>
to org.apache.ws.commons.axiom/eclipse-tests/1.2.15-SNAPSHOT/eclipse-tests-1.2.15-SNAPSHOT.pom
[JENKINS] Archiving <https://builds.apache.org/job/ws-axiom-trunk/ws/axiom/modules/axiom-testsuite/pom.xml>
to org.apache.ws.commons.axiom/axiom-testsuite/1.2.15-SNAPSHOT/axiom-testsuite-1.2.15-SNAPSHOT.pom
[JENKINS] Archiving <https://builds.apache.org/job/ws-axiom-trunk/ws/axiom/modules/axiom-samples/pom.xml>
to org.apache.ws.commons.axiom/axiom-samples/1.2.15-SNAPSHOT/axiom-samples-1.2.15-SNAPSHOT.pom
[JENKINS] Archiving <https://builds.apache.org/job/ws-axiom-trunk/ws/axiom/systests/pom.xml>
to org.apache.ws.commons.axiom/systests/1.2.15-SNAPSHOT/systests-1.2.15-SNAPSHOT.pom
[JENKINS] Archiving <https://builds.apache.org/job/ws-axiom-trunk/ws/axiom/distribution/pom.xml>
to org.apache.ws.commons.axiom/distribution/1.2.15-SNAPSHOT/distribution-1.2.15-SNAPSHOT.pom
[JENKINS] Archiving <https://builds.apache.org/job/ws-axiom-trunk/ws/axiom/axiom-spring-ws-testsuite/pom.xml>
to org.apache.ws.commons.axiom/axiom-spring-ws-testsuite/1.2.15-SNAPSHOT/axiom-spring-ws-testsuite-1.2.15-SNAPSHOT.pom
[JENKINS] Archiving <https://builds.apache.org/job/ws-axiom-trunk/ws/axiom/apidocs/pom.xml>
to org.apache.ws.commons.axiom/apidocs/1.2.15-SNAPSHOT/apidocs-1.2.15-SNAPSHOT.pom
[JENKINS] Archiving <https://builds.apache.org/job/ws-axiom-trunk/ws/axiom/userguide/pom.xml>
to org.apache.ws.commons.axiom/userguide/1.2.15-SNAPSHOT/userguide-1.2.15-SNAPSHOT.pom
[JENKINS] Archiving <https://builds.apache.org/job/ws-axiom-trunk/ws/axiom/modules/axiom-api/pom.xml>
to org.apache.ws.commons.axiom/axiom-api/1.2.15-SNAPSHOT/axiom-api-1.2.15-SNAPSHOT.pom
[JENKINS] Archiving <https://builds.apache.org/job/ws-axiom-trunk/ws/axiom/buildutils/paxexam-maven-plugin/pom.xml>
to org.apache.ws.commons.axiom/paxexam-maven-plugin/1.2.15-SNAPSHOT/paxexam-maven-plugin-1.2.15-SNAPSHOT.pom
[JENKINS] Archiving <https://builds.apache.org/job/ws-axiom-trunk/ws/axiom/buildutils/paxexam-maven-plugin/target/paxexam-maven-plugin-1.2.15-SNAPSHOT.jar>
to org.apache.ws.commons.axiom/paxexam-maven-plugin/1.2.15-20140604.194945-85/paxexam-maven-plugin-1.2.15-20140604.194945-85.jar
[JENKINS] Archiving <https://builds.apache.org/job/ws-axiom-trunk/ws/axiom/buildutils/paxexam-maven-plugin/target/paxexam-maven-plugin-1.2.15-SNAPSHOT-sources.jar>
to org.apache.ws.commons.axiom/paxexam-maven-plugin/1.2.15-20140604.194945-85/paxexam-maven-plugin-1.2.15-20140604.194945-85-sources.jar
[JENKINS] Archiving <https://builds.apache.org/job/ws-axiom-trunk/ws/axiom/buildutils/paxexam-maven-plugin/target/paxexam-maven-plugin-1.2.15-SNAPSHOT-javadoc.jar>
to org.apache.ws.commons.axiom/paxexam-maven-plugin/1.2.15-20140604.194945-85/paxexam-maven-plugin-1.2.15-20140604.194945-85-javadoc.jar
[JENKINS] Archiving <https://builds.apache.org/job/ws-axiom-trunk/ws/axiom/modules/axiom-common-impl/pom.xml>
to org.apache.ws.commons.axiom/axiom-common-impl/1.2.15-SNAPSHOT/axiom-common-impl-1.2.15-SNAPSHOT.pom
[JENKINS] Archiving <https://builds.apache.org/job/ws-axiom-trunk/ws/axiom/systests/osgi-tests/pom.xml>
to org.apache.ws.commons.axiom/osgi-tests/1.2.15-SNAPSHOT/osgi-tests-1.2.15-SNAPSHOT.pom
[JENKINS] Archiving <https://builds.apache.org/job/ws-axiom-trunk/ws/axiom/modules/axiom-tests/pom.xml>
to org.apache.ws.commons.axiom/axiom-tests/1.2.15-SNAPSHOT/axiom-tests-1.2.15-SNAPSHOT.pom
Sending e-mails to: dev@ws.apache.org
channel stopped
Updating AXIOM-447

---------------------------------------------------------------------
To unsubscribe, e-mail: dev-unsubscribe@ws.apache.org
For additional commands, e-mail: dev-help@ws.apache.org


Mime
View raw message