ws-dev mailing list archives

Site index · List index
Message view « Date » · « Thread »
Top « Date » · « Thread »
From Apache Jenkins Server <jenk...@builds.apache.org>
Subject Build failed in Jenkins: ws-axiom-trunk #1820
Date Mon, 23 Jun 2014 17:07:06 GMT
See <https://builds.apache.org/job/ws-axiom-trunk/1820/changes>

Changes:

[veithen] * Update ConvertedTestMessage to convert SOAP 1.2 faults to SOAP 1.1.
* Partially replace the old message.xml test message with a better defined test message.

[veithen] Added missing SOAPElementType (for s:Fault) and fixed an issue in the DOOM factories.

[veithen] Move the list of SOAPElementType instances to SOAPElementType.

[veithen] Move SOAPElementType and SOAPFaultChild to soap-testsuite.

[veithen] Factored out the Axiom specific methods in SOAPElementType and SOAPFaultChild.

[veithen] Remove some unused stuff.

[veithen] AXIOM-311: Eliminate the (partially redundant) CustomBuilderTest and replace it
by more meaningful test cases.

[veithen] Fixed charset encoding.

[veithen] Fixed (release) build failure caused by missing license headers and/or incorrect
RAT plugin configuration.

[veithen] AXIOM-311: Refactored some OMDocument tests.

[veithen] Update TODO item.

[veithen] AXIOM-311: Refactored a test case for the registerCustomBuilder method.

[veithen] AXIOM-311: Removed some redundant/irrelevant/disabled test cases.

[veithen] AXIOM-311: Replaced an old test case for the isComplete method by a more meaningful
one.

[veithen] * AXIOM-311: Eliminated the old soapmessage.xml test message and replaced it with
TestMessageSet.WSA.
* Addressed some cloning issues identified in the process.

[veithen] AXIOM-311: Eliminate unnecessary build artifacts and dependencies.

[veithen] AXIOM-447: Add SOAP version specific SoapBody and SoapFault implementations.

------------------------------------------
[...truncated 2208 lines...]
[INFO] ------------------------------------------------------------------------
[INFO] Total time: 1:31.511s
[INFO] Finished at: Mon Jun 23 17:06:15 UTC 2014
[INFO] Final Memory: 32M/175M
[INFO] ------------------------------------------------------------------------
Waiting for Jenkins to finish collecting data
[ERROR] Failed to execute goal org.apache.rat:apache-rat-plugin:0.10:check (default) on project
axiom: Too many files with unapproved license: 64 See RAT report in: <https://builds.apache.org/job/ws-axiom-trunk/ws/axiom/target/rat.txt>
-> [Help 1]
[ERROR] 
[ERROR] To see the full stack trace of the errors, re-run Maven with the -e switch.
[ERROR] Re-run Maven using the -X switch to enable full debug logging.
[ERROR] 
[ERROR] For more information about the errors and possible solutions, please read the following
articles:
[ERROR] [Help 1] http://cwiki.apache.org/confluence/display/MAVEN/MojoFailureException
[JENKINS] Archiving <https://builds.apache.org/job/ws-axiom-trunk/ws/axiom/modules/axiom-compat/pom.xml>
to org.apache.ws.commons.axiom/axiom-compat/1.2.15-SNAPSHOT/axiom-compat-1.2.15-SNAPSHOT.pom
Sending artifact delta relative to ws-axiom-trunk ? Axiom Compatibility Classes #1814
Archived 1 artifacts
Archive block size is 32768
Received 0 blocks and 4503 bytes
Compression is 0.0%
Took 0.57 sec
[JENKINS] Archiving <https://builds.apache.org/job/ws-axiom-trunk/ws/axiom/modules/axiom-impl/pom.xml>
to org.apache.ws.commons.axiom/axiom-impl/1.2.15-SNAPSHOT/axiom-impl-1.2.15-SNAPSHOT.pom
Sending artifact delta relative to ws-axiom-trunk ? Axiom Impl #1814
Archived 1 artifacts
Archive block size is 32768
Received 0 blocks and 6579 bytes
Compression is 0.0%
Took 1.6 sec
[JENKINS] Archiving <https://builds.apache.org/job/ws-axiom-trunk/ws/axiom/modules/axiom-jaxb/pom.xml>
to org.apache.ws.commons.axiom/axiom-jaxb/1.2.15-SNAPSHOT/axiom-jaxb-1.2.15-SNAPSHOT.pom
Sending artifact delta relative to ws-axiom-trunk ? Axiom JAXB Integration #1814
Archived 1 artifacts
Archive block size is 32768
Received 0 blocks and 5511 bytes
Compression is 0.0%
Took 0.15 sec
[JENKINS] Archiving <https://builds.apache.org/job/ws-axiom-trunk/ws/axiom/modules/axiom-integration/pom.xml>
to org.apache.ws.commons.axiom/axiom-integration/1.2.15-SNAPSHOT/axiom-integration-1.2.15-SNAPSHOT.pom
Sending artifact delta relative to ws-axiom-trunk ? Axiom Integration Test Suite #1814
Archived 1 artifacts
Archive block size is 32768
Received 0 blocks and 5380 bytes
Compression is 0.0%
Took 0.13 sec
[JENKINS] Archiving <https://builds.apache.org/job/ws-axiom-trunk/ws/axiom/buildutils/pom.xml>
to org.apache.ws.commons.axiom/buildutils/1.2.15-SNAPSHOT/buildutils-1.2.15-SNAPSHOT.pom
Sending artifact delta relative to ws-axiom-trunk ? Build utilities #1819
Archived 1 artifacts
Archive block size is 32768
Received 0 blocks and 3118 bytes
Compression is 0.0%
Took 0.15 sec
[JENKINS] Archiving <https://builds.apache.org/job/ws-axiom-trunk/ws/axiom/testsuites/pom.xml>
to org.apache.ws.commons.axiom/testsuites/1.2.15-SNAPSHOT/testsuites-1.2.15-SNAPSHOT.pom
Sending artifact delta relative to ws-axiom-trunk ? Test Suites #1819
Archived 1 artifacts
Archive block size is 32768
Received 0 blocks and 2456 bytes
Compression is 0.0%
Took 0.1 sec
[JENKINS] Archiving <https://builds.apache.org/job/ws-axiom-trunk/ws/axiom/modules/axiom-all/pom.xml>
to org.apache.ws.commons.axiom/axiom-all/1.2.15-SNAPSHOT/axiom-all-1.2.15-SNAPSHOT.pom
Sending artifact delta relative to ws-axiom-trunk ? Axiom Uber-JAR #1814
Archived 1 artifacts
Archive block size is 32768
Received 0 blocks and 5625 bytes
Compression is 0.0%
Took 0.24 sec
[JENKINS] Archiving <https://builds.apache.org/job/ws-axiom-trunk/ws/axiom/systests/spring-ws-tests/pom.xml>
to org.apache.ws.commons.axiom/spring-ws-tests/1.2.15-SNAPSHOT/spring-ws-tests-1.2.15-SNAPSHOT.pom
Sending artifact delta relative to ws-axiom-trunk ? Spring WS Tests #1814
Archived 1 artifacts
Archive block size is 32768
Received 0 blocks and 2253 bytes
Compression is 0.0%
Took 0.1 sec
[JENKINS] Archiving <https://builds.apache.org/job/ws-axiom-trunk/ws/axiom/devguide/pom.xml>
to org.apache.ws.commons.axiom/devguide/1.2.15-SNAPSHOT/devguide-1.2.15-SNAPSHOT.pom
Sending artifact delta relative to ws-axiom-trunk ? Developer Guide #1814
Archived 1 artifacts
Archive block size is 32768
Received 0 blocks and 5873 bytes
Compression is 0.0%
Took 66 ms
[JENKINS] Archiving <https://builds.apache.org/job/ws-axiom-trunk/ws/axiom/modules/axiom-dom/pom.xml>
to org.apache.ws.commons.axiom/axiom-dom/1.2.15-SNAPSHOT/axiom-dom-1.2.15-SNAPSHOT.pom
Sending artifact delta relative to ws-axiom-trunk ? Axiom DOM #1814
Archived 1 artifacts
Archive block size is 32768
Received 0 blocks and 6794 bytes
Compression is 0.0%
Took 1.8 sec
[JENKINS] Archiving <https://builds.apache.org/job/ws-axiom-trunk/ws/axiom/modules/axiom-testutils/pom.xml>
to org.apache.ws.commons.axiom/axiom-testutils/1.2.15-SNAPSHOT/axiom-testutils-1.2.15-SNAPSHOT.pom
Sending artifact delta relative to ws-axiom-trunk ? Axiom Test Utilities #1819
Archived 1 artifacts
Archive block size is 32768
Received 0 blocks and 7098 bytes
Compression is 0.0%
Took 0.27 sec
[JENKINS] Archiving <https://builds.apache.org/job/ws-axiom-trunk/ws/axiom/buildutils/shade-osgi/pom.xml>
to org.apache.ws.commons.axiom/shade-osgi/1.2.15-SNAPSHOT/shade-osgi-1.2.15-SNAPSHOT.pom
Sending artifact delta relative to ws-axiom-trunk ? Resource Transformer for OSGi Manifests
#1819
Archived 1 artifacts
Archive block size is 32768
Received 0 blocks and 2259 bytes
Compression is 0.0%
Took 0.15 sec
[JENKINS] Archiving <https://builds.apache.org/job/ws-axiom-trunk/ws/axiom/modules/axiom-c14n/pom.xml>
to org.apache.ws.commons.axiom/axiom-c14n/1.2.15-SNAPSHOT/axiom-c14n-1.2.15-SNAPSHOT.pom
Sending artifact delta relative to ws-axiom-trunk ? Axiom C14N #1814
Archived 1 artifacts
Archive block size is 32768
Received 0 blocks and 3683 bytes
Compression is 0.0%
Took 0.23 sec
[JENKINS] Archiving <https://builds.apache.org/job/ws-axiom-trunk/ws/axiom/axiom-spring-ws/pom.xml>
to org.apache.ws.commons.axiom/axiom-spring-ws/1.2.15-SNAPSHOT/axiom-spring-ws-1.2.15-SNAPSHOT.pom
Sending artifact delta relative to ws-axiom-trunk ? Axiom/Spring-WS Integration #1814
Archived 1 artifacts
Archive block size is 32768
Received 0 blocks and 4180 bytes
Compression is 0.0%
Took 0.11 sec
[JENKINS] Archiving <https://builds.apache.org/job/ws-axiom-trunk/ws/axiom/pom.xml>
to org.apache.ws.commons.axiom/axiom/1.2.15-SNAPSHOT/axiom-1.2.15-SNAPSHOT.pom
[JENKINS] Archiving <https://builds.apache.org/job/ws-axiom-trunk/ws/axiom/target/axiom-1.2.15-SNAPSHOT-source-release.zip>
to org.apache.ws.commons.axiom/axiom/1.2.15-SNAPSHOT/axiom-1.2.15-SNAPSHOT-source-release.zip
[JENKINS] Archiving <https://builds.apache.org/job/ws-axiom-trunk/ws/axiom/target/axiom-1.2.15-SNAPSHOT-site.xml>
to org.apache.ws.commons.axiom/axiom/1.2.15-SNAPSHOT/axiom-1.2.15-SNAPSHOT-site.xml
Sending artifact delta relative to ws-axiom-trunk ? Axiom #1819
Archived 3 artifacts
Archive block size is 32768
Received 17 blocks and 3286610 bytes
Compression is 14.5%
Took 2.7 sec
[JENKINS] Archiving <https://builds.apache.org/job/ws-axiom-trunk/ws/axiom/testsuites/dom-testsuite/pom.xml>
to org.apache.ws.commons.axiom/dom-testsuite/1.2.15-SNAPSHOT/dom-testsuite-1.2.15-SNAPSHOT.pom
No prior successful build to compare, so performing full copy of artifacts
[JENKINS] Archiving <https://builds.apache.org/job/ws-axiom-trunk/ws/axiom/code-coverage/pom.xml>
to org.apache.ws.commons.axiom/code-coverage/1.2.15-SNAPSHOT/code-coverage-1.2.15-SNAPSHOT.pom
Sending artifact delta relative to ws-axiom-trunk ? Code Coverage Report #1814
Archived 1 artifacts
Archive block size is 32768
Received 0 blocks and 12594 bytes
Compression is 0.0%
Took 0.15 sec
[JENKINS] Archiving <https://builds.apache.org/job/ws-axiom-trunk/ws/axiom/forbiddenapi-signatures/pom.xml>
to org.apache.ws.commons.axiom/forbiddenapi-signatures/1.2.15-SNAPSHOT/forbiddenapi-signatures-1.2.15-SNAPSHOT.pom
Sending artifact delta relative to ws-axiom-trunk ? Signature files for forbidden-api #1814
Archived 1 artifacts
Archive block size is 32768
Received 0 blocks and 2007 bytes
Compression is 0.0%
Took 0.21 sec
[JENKINS] Archiving <https://builds.apache.org/job/ws-axiom-trunk/ws/axiom/modules/axiom-buildutils/pom.xml>
to org.apache.ws.commons.axiom/axiom-buildutils/1.2.15-SNAPSHOT/axiom-buildutils-1.2.15-SNAPSHOT.pom
Sending artifact delta relative to ws-axiom-trunk ? Axiom Build Utilities #1819
Archived 1 artifacts
Archive block size is 32768
Received 0 blocks and 3849 bytes
Compression is 0.0%
Took 1.7 sec
[JENKINS] Archiving <https://builds.apache.org/job/ws-axiom-trunk/ws/axiom/testsuites/spring-ws-testsuite/pom.xml>
to org.apache.ws.commons.axiom/spring-ws-testsuite/1.2.15-SNAPSHOT/spring-ws-testsuite-1.2.15-SNAPSHOT.pom
No prior successful build to compare, so performing full copy of artifacts
[JENKINS] Archiving <https://builds.apache.org/job/ws-axiom-trunk/ws/axiom/systests/eclipse-tests/pom.xml>
to org.apache.ws.commons.axiom/eclipse-tests/1.2.15-SNAPSHOT/eclipse-tests-1.2.15-SNAPSHOT.pom
Sending artifact delta relative to ws-axiom-trunk ? Eclipse Tests #1814
Archived 1 artifacts
Archive block size is 32768
Received 0 blocks and 8123 bytes
Compression is 0.0%
Took 0.15 sec
[JENKINS] Archiving <https://builds.apache.org/job/ws-axiom-trunk/ws/axiom/systests/jboss-tests/pom.xml>
to org.apache.ws.commons.axiom/jboss-tests/1.2.15-SNAPSHOT/jboss-tests-1.2.15-SNAPSHOT.pom
Sending artifact delta relative to ws-axiom-trunk ? JBoss Tests #1814
Archived 1 artifacts
Archive block size is 32768
Received 0 blocks and 7706 bytes
Compression is 0.0%
Took 0.3 sec
[JENKINS] Archiving <https://builds.apache.org/job/ws-axiom-trunk/ws/axiom/modules/axiom-testsuite/pom.xml>
to org.apache.ws.commons.axiom/axiom-testsuite/1.2.15-SNAPSHOT/axiom-testsuite-1.2.15-SNAPSHOT.pom
Sending artifact delta relative to ws-axiom-trunk ? Axiom Implementation Test Suite #1814
Archived 1 artifacts
Archive block size is 32768
Received 0 blocks and 5460 bytes
Compression is 0.0%
Took 0.72 sec
[JENKINS] Archiving <https://builds.apache.org/job/ws-axiom-trunk/ws/axiom/testsuites/jaxen-testsuite/pom.xml>
to org.apache.ws.commons.axiom/jaxen-testsuite/1.2.15-SNAPSHOT/jaxen-testsuite-1.2.15-SNAPSHOT.pom
Sending artifact delta relative to ws-axiom-trunk ? Jaxen Test Suite #1819
Archived 1 artifacts
Archive block size is 32768
Received 0 blocks and 3072 bytes
Compression is 0.0%
Took 1.7 sec
[JENKINS] Archiving <https://builds.apache.org/job/ws-axiom-trunk/ws/axiom/modules/axiom-samples/pom.xml>
to org.apache.ws.commons.axiom/axiom-samples/1.2.15-SNAPSHOT/axiom-samples-1.2.15-SNAPSHOT.pom
Sending artifact delta relative to ws-axiom-trunk ? Axiom Samples #1814
Archived 1 artifacts
Archive block size is 32768
Received 0 blocks and 5014 bytes
Compression is 0.0%
Took 0.19 sec
[JENKINS] Archiving <https://builds.apache.org/job/ws-axiom-trunk/ws/axiom/systests/pom.xml>
to org.apache.ws.commons.axiom/systests/1.2.15-SNAPSHOT/systests-1.2.15-SNAPSHOT.pom
Sending artifact delta relative to ws-axiom-trunk ? System Tests #1814
Archived 1 artifacts
Archive block size is 32768
Received 0 blocks and 2224 bytes
Compression is 0.0%
Took 43 ms
[JENKINS] Archiving <https://builds.apache.org/job/ws-axiom-trunk/ws/axiom/distribution/pom.xml>
to org.apache.ws.commons.axiom/distribution/1.2.15-SNAPSHOT/distribution-1.2.15-SNAPSHOT.pom
Sending artifact delta relative to ws-axiom-trunk ? Distribution #1814
Archived 1 artifacts
Archive block size is 32768
Received 0 blocks and 5514 bytes
Compression is 0.0%
Took 0.35 sec
[JENKINS] Archiving <https://builds.apache.org/job/ws-axiom-trunk/ws/axiom/apidocs/pom.xml>
to org.apache.ws.commons.axiom/apidocs/1.2.15-SNAPSHOT/apidocs-1.2.15-SNAPSHOT.pom
Sending artifact delta relative to ws-axiom-trunk ? Javadoc #1814
Archived 1 artifacts
Archive block size is 32768
Received 0 blocks and 7891 bytes
Compression is 0.0%
Took 0.33 sec
[JENKINS] Archiving <https://builds.apache.org/job/ws-axiom-trunk/ws/axiom/userguide/pom.xml>
to org.apache.ws.commons.axiom/userguide/1.2.15-SNAPSHOT/userguide-1.2.15-SNAPSHOT.pom
Sending artifact delta relative to ws-axiom-trunk ? User Guide #1814
Archived 1 artifacts
Archive block size is 32768
Received 0 blocks and 5873 bytes
Compression is 0.0%
Took 0.1 sec
[JENKINS] Archiving <https://builds.apache.org/job/ws-axiom-trunk/ws/axiom/modules/axiom-api/pom.xml>
to org.apache.ws.commons.axiom/axiom-api/1.2.15-SNAPSHOT/axiom-api-1.2.15-SNAPSHOT.pom
Sending artifact delta relative to ws-axiom-trunk ? Axiom API #1819
Archived 1 artifacts
Archive block size is 32768
Received 0 blocks and 16320 bytes
Compression is 0.0%
Took 2.1 sec
[JENKINS] Archiving <https://builds.apache.org/job/ws-axiom-trunk/ws/axiom/buildutils/paxexam-maven-plugin/pom.xml>
to org.apache.ws.commons.axiom/paxexam-maven-plugin/1.2.15-SNAPSHOT/paxexam-maven-plugin-1.2.15-SNAPSHOT.pom
Sending artifact delta relative to ws-axiom-trunk ? Pax Exam Maven plugin #1819
Archived 1 artifacts
Archive block size is 32768
Received 0 blocks and 2399 bytes
Compression is 0.0%
Took 0.25 sec
[JENKINS] Archiving <https://builds.apache.org/job/ws-axiom-trunk/ws/axiom/modules/axiom-common-impl/pom.xml>
to org.apache.ws.commons.axiom/axiom-common-impl/1.2.15-SNAPSHOT/axiom-common-impl-1.2.15-SNAPSHOT.pom
Sending artifact delta relative to ws-axiom-trunk ? Axiom Common Implementation Classes #1814
Archived 1 artifacts
Archive block size is 32768
Received 0 blocks and 3865 bytes
Compression is 0.0%
Took 0.35 sec
[JENKINS] Archiving <https://builds.apache.org/job/ws-axiom-trunk/ws/axiom/systests/osgi-tests/pom.xml>
to org.apache.ws.commons.axiom/osgi-tests/1.2.15-SNAPSHOT/osgi-tests-1.2.15-SNAPSHOT.pom
Sending artifact delta relative to ws-axiom-trunk ? Axiom OSGi Tests #1814
Archived 1 artifacts
Archive block size is 32768
Received 0 blocks and 6764 bytes
Compression is 0.0%
Took 0.1 sec
[JENKINS] Archiving <https://builds.apache.org/job/ws-axiom-trunk/ws/axiom/testsuites/soap-testsuite/pom.xml>
to org.apache.ws.commons.axiom/soap-testsuite/1.2.15-SNAPSHOT/soap-testsuite-1.2.15-SNAPSHOT.pom
No prior successful build to compare, so performing full copy of artifacts
[JENKINS] Archiving <https://builds.apache.org/job/ws-axiom-trunk/ws/axiom/modules/axiom-tests/pom.xml>
to org.apache.ws.commons.axiom/axiom-tests/1.2.15-SNAPSHOT/axiom-tests-1.2.15-SNAPSHOT.pom
Sending artifact delta relative to ws-axiom-trunk ? Axiom Test Suite #1814
Archived 1 artifacts
Archive block size is 32768
Received 0 blocks and 5472 bytes
Compression is 0.0%
Took 0.1 sec
Sending e-mails to: dev@ws.apache.org
channel stopped
Updating AXIOM-311
Updating AXIOM-447

---------------------------------------------------------------------
To unsubscribe, e-mail: dev-unsubscribe@ws.apache.org
For additional commands, e-mail: dev-help@ws.apache.org


Mime
View raw message