ws-dev mailing list archives

Site index · List index
Message view « Date » · « Thread »
Top « Date » · « Thread »
From Apache Jenkins Server <jenk...@builds.apache.org>
Subject Build failed in Jenkins: ws-axiom-trunk #1815
Date Tue, 17 Jun 2014 09:03:49 GMT
See <https://builds.apache.org/job/ws-axiom-trunk/1815/changes>

Changes:

[veithen] Update my affiliation.

[veithen] AXIOM-447: Add another Spring-WS scenario test that covers multiple aspects of the
API.

[veithen] Move the scenario tests to a separate package.

[veithen] Remove unused imports.

[veithen] Fix broken feature support in AbstractXMLReader.

[veithen] Improve logging and reduce verbosity.

[veithen] AXIOM-447: Only create SOAP Header when necessary.

[veithen] Add a new test message and simplify some Axiom SOAP test cases.

[veithen] Add tests for the SoapMessageFactory#createWebServiceMessage methods.

[veithen] Add some infrastructure to manage SOAP test messages.

[veithen] Move the SOAPSpec code out of axiom-testsuite for reuse by other modules (that don't
necessarily depend on axiom-api).

------------------------------------------
[...truncated 323 lines...]
[INFO] ------------------------------------------------------------------------
Waiting for Jenkins to finish collecting data
[ERROR] Failed to execute goal org.apache.maven.plugins:maven-deploy-plugin:2.7:deploy (default-deploy)
on project axiom: Failed to retrieve remote metadata org.apache.ws.commons.axiom:axiom:1.2.15-SNAPSHOT/maven-metadata.xml:
Could not transfer metadata org.apache.ws.commons.axiom:axiom:1.2.15-SNAPSHOT/maven-metadata.xml
from/to apache.snapshots.https (https://repository.apache.org/content/repositories/snapshots):
Failed to transfer file: https://repository.apache.org/content/repositories/snapshots/org/apache/ws/commons/axiom/axiom/1.2.15-SNAPSHOT/maven-metadata.xml.
Return code is: 503 , ReasonPhrase:Service Temporarily Unavailable. -> [Help 1]
[ERROR] 
[ERROR] To see the full stack trace of the errors, re-run Maven with the -e switch.
[ERROR] Re-run Maven using the -X switch to enable full debug logging.
[ERROR] 
[ERROR] For more information about the errors and possible solutions, please read the following
articles:
[ERROR] [Help 1] http://cwiki.apache.org/confluence/display/MAVEN/MojoExecutionException
[JENKINS] Archiving <https://builds.apache.org/job/ws-axiom-trunk/ws/axiom/modules/axiom-compat/pom.xml>
to org.apache.ws.commons.axiom/axiom-compat/1.2.15-SNAPSHOT/axiom-compat-1.2.15-SNAPSHOT.pom
Sending artifact delta relative to ws-axiom-trunk ? Axiom Compatibility Classes #1814
Archived 1 artifacts
Archive block size is 32768
Received 0 blocks and 4503 bytes
Compression is 0.0%
Took 2.1 sec
[JENKINS] Archiving <https://builds.apache.org/job/ws-axiom-trunk/ws/axiom/modules/axiom-impl/pom.xml>
to org.apache.ws.commons.axiom/axiom-impl/1.2.15-SNAPSHOT/axiom-impl-1.2.15-SNAPSHOT.pom
Sending artifact delta relative to ws-axiom-trunk ? Axiom Impl #1814
Archived 1 artifacts
Archive block size is 32768
Received 0 blocks and 7344 bytes
Compression is 0.0%
Took 0.22 sec
[JENKINS] Archiving <https://builds.apache.org/job/ws-axiom-trunk/ws/axiom/modules/axiom-jaxen-testsuite/pom.xml>
to org.apache.ws.commons.axiom/axiom-jaxen-testsuite/1.2.15-SNAPSHOT/axiom-jaxen-testsuite-1.2.15-SNAPSHOT.pom
Sending artifact delta relative to ws-axiom-trunk ? Axiom Jaxen Test Suite #1814
Archived 1 artifacts
Archive block size is 32768
Received 0 blocks and 3863 bytes
Compression is 0.0%
Took 94 ms
[JENKINS] Archiving <https://builds.apache.org/job/ws-axiom-trunk/ws/axiom/modules/axiom-jaxb/pom.xml>
to org.apache.ws.commons.axiom/axiom-jaxb/1.2.15-SNAPSHOT/axiom-jaxb-1.2.15-SNAPSHOT.pom
Sending artifact delta relative to ws-axiom-trunk ? Axiom JAXB Integration #1814
Archived 1 artifacts
Archive block size is 32768
Received 0 blocks and 5511 bytes
Compression is 0.0%
Took 89 ms
[JENKINS] Archiving <https://builds.apache.org/job/ws-axiom-trunk/ws/axiom/modules/axiom-integration/pom.xml>
to org.apache.ws.commons.axiom/axiom-integration/1.2.15-SNAPSHOT/axiom-integration-1.2.15-SNAPSHOT.pom
Sending artifact delta relative to ws-axiom-trunk ? Axiom Integration Test Suite #1814
Archived 1 artifacts
Archive block size is 32768
Received 0 blocks and 5380 bytes
Compression is 0.0%
Took 86 ms
[JENKINS] Archiving <https://builds.apache.org/job/ws-axiom-trunk/ws/axiom/buildutils/pom.xml>
to org.apache.ws.commons.axiom/buildutils/1.2.15-SNAPSHOT/buildutils-1.2.15-SNAPSHOT.pom
Sending artifact delta relative to ws-axiom-trunk ? Build utilities #1814
Archived 1 artifacts
Archive block size is 32768
Received 0 blocks and 3118 bytes
Compression is 0.0%
Took 55 ms
[JENKINS] Archiving <https://builds.apache.org/job/ws-axiom-trunk/ws/axiom/testsuites/pom.xml>
to org.apache.ws.commons.axiom/testsuites/1.2.15-SNAPSHOT/testsuites-1.2.15-SNAPSHOT.pom
No prior successful build to compare, so performing full copy of artifacts
[JENKINS] Archiving <https://builds.apache.org/job/ws-axiom-trunk/ws/axiom/systests/spring-ws-tests/pom.xml>
to org.apache.ws.commons.axiom/spring-ws-tests/1.2.15-SNAPSHOT/spring-ws-tests-1.2.15-SNAPSHOT.pom
Sending artifact delta relative to ws-axiom-trunk ? Spring WS Tests #1814
Archived 1 artifacts
Archive block size is 32768
Received 0 blocks and 2253 bytes
Compression is 0.0%
Took 0.12 sec
[JENKINS] Archiving <https://builds.apache.org/job/ws-axiom-trunk/ws/axiom/modules/axiom-all/pom.xml>
to org.apache.ws.commons.axiom/axiom-all/1.2.15-SNAPSHOT/axiom-all-1.2.15-SNAPSHOT.pom
Sending artifact delta relative to ws-axiom-trunk ? Axiom Uber-JAR #1814
Archived 1 artifacts
Archive block size is 32768
Received 0 blocks and 5625 bytes
Compression is 0.0%
Took 0.12 sec
[JENKINS] Archiving <https://builds.apache.org/job/ws-axiom-trunk/ws/axiom/devguide/pom.xml>
to org.apache.ws.commons.axiom/devguide/1.2.15-SNAPSHOT/devguide-1.2.15-SNAPSHOT.pom
Sending artifact delta relative to ws-axiom-trunk ? Developer Guide #1814
Archived 1 artifacts
Archive block size is 32768
Received 0 blocks and 5873 bytes
Compression is 0.0%
Took 0.1 sec
[JENKINS] Archiving <https://builds.apache.org/job/ws-axiom-trunk/ws/axiom/modules/axiom-dom-testsuite/pom.xml>
to org.apache.ws.commons.axiom/axiom-dom-testsuite/1.2.15-SNAPSHOT/axiom-dom-testsuite-1.2.15-SNAPSHOT.pom
Sending artifact delta relative to ws-axiom-trunk ? Axiom DOM Test Suite #1814
Archived 1 artifacts
Archive block size is 32768
Received 0 blocks and 5852 bytes
Compression is 0.0%
Took 0.14 sec
[JENKINS] Archiving <https://builds.apache.org/job/ws-axiom-trunk/ws/axiom/modules/axiom-testutils/pom.xml>
to org.apache.ws.commons.axiom/axiom-testutils/1.2.15-SNAPSHOT/axiom-testutils-1.2.15-SNAPSHOT.pom
Sending artifact delta relative to ws-axiom-trunk ? Axiom Test Utilities #1814
Archived 1 artifacts
Archive block size is 32768
Received 0 blocks and 7098 bytes
Compression is 0.0%
Took 0.25 sec
[JENKINS] Archiving <https://builds.apache.org/job/ws-axiom-trunk/ws/axiom/modules/axiom-dom/pom.xml>
to org.apache.ws.commons.axiom/axiom-dom/1.2.15-SNAPSHOT/axiom-dom-1.2.15-SNAPSHOT.pom
Sending artifact delta relative to ws-axiom-trunk ? Axiom DOM #1814
Archived 1 artifacts
Archive block size is 32768
Received 0 blocks and 7565 bytes
Compression is 0.0%
Took 0.17 sec
[JENKINS] Archiving <https://builds.apache.org/job/ws-axiom-trunk/ws/axiom/buildutils/shade-osgi/pom.xml>
to org.apache.ws.commons.axiom/shade-osgi/1.2.15-SNAPSHOT/shade-osgi-1.2.15-SNAPSHOT.pom
Sending artifact delta relative to ws-axiom-trunk ? Resource Transformer for OSGi Manifests
#1814
Archived 1 artifacts
Archive block size is 32768
Received 0 blocks and 2259 bytes
Compression is 0.0%
Took 0.19 sec
[JENKINS] Archiving <https://builds.apache.org/job/ws-axiom-trunk/ws/axiom/modules/axiom-c14n/pom.xml>
to org.apache.ws.commons.axiom/axiom-c14n/1.2.15-SNAPSHOT/axiom-c14n-1.2.15-SNAPSHOT.pom
Sending artifact delta relative to ws-axiom-trunk ? Axiom C14N #1814
Archived 1 artifacts
Archive block size is 32768
Received 0 blocks and 3683 bytes
Compression is 0.0%
Took 0.25 sec
[JENKINS] Archiving <https://builds.apache.org/job/ws-axiom-trunk/ws/axiom/axiom-spring-ws/pom.xml>
to org.apache.ws.commons.axiom/axiom-spring-ws/1.2.15-SNAPSHOT/axiom-spring-ws-1.2.15-SNAPSHOT.pom
Sending artifact delta relative to ws-axiom-trunk ? Axiom/Spring-WS Integration #1814
Archived 1 artifacts
Archive block size is 32768
Received 0 blocks and 4186 bytes
Compression is 0.0%
Took 77 ms
[JENKINS] Archiving <https://builds.apache.org/job/ws-axiom-trunk/ws/axiom/pom.xml>
to org.apache.ws.commons.axiom/axiom/1.2.15-SNAPSHOT/axiom-1.2.15-SNAPSHOT.pom
[JENKINS] Archiving <https://builds.apache.org/job/ws-axiom-trunk/ws/axiom/target/axiom-1.2.15-SNAPSHOT-source-release.zip>
to org.apache.ws.commons.axiom/axiom/1.2.15-SNAPSHOT/axiom-1.2.15-SNAPSHOT-source-release.zip
[JENKINS] Archiving <https://builds.apache.org/job/ws-axiom-trunk/ws/axiom/target/axiom-1.2.15-SNAPSHOT-site.xml>
to org.apache.ws.commons.axiom/axiom/1.2.15-SNAPSHOT/axiom-1.2.15-SNAPSHOT-site.xml
Sending artifact delta relative to ws-axiom-trunk ? Axiom #1814
Archived 3 artifacts
Archive block size is 32768
Received 82 blocks and 1145848 bytes
Compression is 70.1%
Took 2.3 sec
[JENKINS] Archiving <https://builds.apache.org/job/ws-axiom-trunk/ws/axiom/code-coverage/pom.xml>
to org.apache.ws.commons.axiom/code-coverage/1.2.15-SNAPSHOT/code-coverage-1.2.15-SNAPSHOT.pom
Sending artifact delta relative to ws-axiom-trunk ? Code Coverage Report #1814
Archived 1 artifacts
Archive block size is 32768
Received 0 blocks and 12594 bytes
Compression is 0.0%
Took 0.11 sec
[JENKINS] Archiving <https://builds.apache.org/job/ws-axiom-trunk/ws/axiom/forbiddenapi-signatures/pom.xml>
to org.apache.ws.commons.axiom/forbiddenapi-signatures/1.2.15-SNAPSHOT/forbiddenapi-signatures-1.2.15-SNAPSHOT.pom
Sending artifact delta relative to ws-axiom-trunk ? Signature files for forbidden-api #1814
Archived 1 artifacts
Archive block size is 32768
Received 0 blocks and 2007 bytes
Compression is 0.0%
Took 2.5 sec
[JENKINS] Archiving <https://builds.apache.org/job/ws-axiom-trunk/ws/axiom/modules/axiom-buildutils/pom.xml>
to org.apache.ws.commons.axiom/axiom-buildutils/1.2.15-SNAPSHOT/axiom-buildutils-1.2.15-SNAPSHOT.pom
Sending artifact delta relative to ws-axiom-trunk ? Axiom Build Utilities #1814
Archived 1 artifacts
Archive block size is 32768
Received 0 blocks and 3849 bytes
Compression is 0.0%
Took 0.3 sec
[JENKINS] Archiving <https://builds.apache.org/job/ws-axiom-trunk/ws/axiom/systests/jboss-tests/pom.xml>
to org.apache.ws.commons.axiom/jboss-tests/1.2.15-SNAPSHOT/jboss-tests-1.2.15-SNAPSHOT.pom
Sending artifact delta relative to ws-axiom-trunk ? JBoss Tests #1814
Archived 1 artifacts
Archive block size is 32768
Received 0 blocks and 7706 bytes
Compression is 0.0%
Took 0.22 sec
[JENKINS] Archiving <https://builds.apache.org/job/ws-axiom-trunk/ws/axiom/systests/eclipse-tests/pom.xml>
to org.apache.ws.commons.axiom/eclipse-tests/1.2.15-SNAPSHOT/eclipse-tests-1.2.15-SNAPSHOT.pom
Sending artifact delta relative to ws-axiom-trunk ? Eclipse Tests #1814
Archived 1 artifacts
Archive block size is 32768
Received 0 blocks and 8123 bytes
Compression is 0.0%
Took 98 ms
[JENKINS] Archiving <https://builds.apache.org/job/ws-axiom-trunk/ws/axiom/modules/axiom-testsuite/pom.xml>
to org.apache.ws.commons.axiom/axiom-testsuite/1.2.15-SNAPSHOT/axiom-testsuite-1.2.15-SNAPSHOT.pom
Sending artifact delta relative to ws-axiom-trunk ? Axiom Implementation Test Suite #1814
Archived 1 artifacts
Archive block size is 32768
Received 0 blocks and 5466 bytes
Compression is 0.0%
Took 0.33 sec
[JENKINS] Archiving <https://builds.apache.org/job/ws-axiom-trunk/ws/axiom/modules/axiom-samples/pom.xml>
to org.apache.ws.commons.axiom/axiom-samples/1.2.15-SNAPSHOT/axiom-samples-1.2.15-SNAPSHOT.pom
Sending artifact delta relative to ws-axiom-trunk ? Axiom Samples #1814
Archived 1 artifacts
Archive block size is 32768
Received 0 blocks and 5014 bytes
Compression is 0.0%
Took 2.2 sec
[JENKINS] Archiving <https://builds.apache.org/job/ws-axiom-trunk/ws/axiom/systests/pom.xml>
to org.apache.ws.commons.axiom/systests/1.2.15-SNAPSHOT/systests-1.2.15-SNAPSHOT.pom
Sending artifact delta relative to ws-axiom-trunk ? System Tests #1814
Archived 1 artifacts
Archive block size is 32768
Received 0 blocks and 2224 bytes
Compression is 0.0%
Took 0.19 sec
[JENKINS] Archiving <https://builds.apache.org/job/ws-axiom-trunk/ws/axiom/distribution/pom.xml>
to org.apache.ws.commons.axiom/distribution/1.2.15-SNAPSHOT/distribution-1.2.15-SNAPSHOT.pom
Sending artifact delta relative to ws-axiom-trunk ? Distribution #1814
Archived 1 artifacts
Archive block size is 32768
Received 0 blocks and 5514 bytes
Compression is 0.0%
Took 0.39 sec
[JENKINS] Archiving <https://builds.apache.org/job/ws-axiom-trunk/ws/axiom/axiom-spring-ws-testsuite/pom.xml>
to org.apache.ws.commons.axiom/axiom-spring-ws-testsuite/1.2.15-SNAPSHOT/axiom-spring-ws-testsuite-1.2.15-SNAPSHOT.pom
Sending artifact delta relative to ws-axiom-trunk ? Spring-WS Test Suite #1814
Archived 1 artifacts
Archive block size is 32768
Received 0 blocks and 4498 bytes
Compression is 0.0%
Took 2.3 sec
[JENKINS] Archiving <https://builds.apache.org/job/ws-axiom-trunk/ws/axiom/apidocs/pom.xml>
to org.apache.ws.commons.axiom/apidocs/1.2.15-SNAPSHOT/apidocs-1.2.15-SNAPSHOT.pom
Sending artifact delta relative to ws-axiom-trunk ? Javadoc #1814
Archived 1 artifacts
Archive block size is 32768
Received 0 blocks and 7891 bytes
Compression is 0.0%
Took 0.32 sec
[JENKINS] Archiving <https://builds.apache.org/job/ws-axiom-trunk/ws/axiom/userguide/pom.xml>
to org.apache.ws.commons.axiom/userguide/1.2.15-SNAPSHOT/userguide-1.2.15-SNAPSHOT.pom
Sending artifact delta relative to ws-axiom-trunk ? User Guide #1814
Archived 1 artifacts
Archive block size is 32768
Received 0 blocks and 5873 bytes
Compression is 0.0%
Took 0.19 sec
[JENKINS] Archiving <https://builds.apache.org/job/ws-axiom-trunk/ws/axiom/modules/axiom-api/pom.xml>
to org.apache.ws.commons.axiom/axiom-api/1.2.15-SNAPSHOT/axiom-api-1.2.15-SNAPSHOT.pom
Sending artifact delta relative to ws-axiom-trunk ? Axiom API #1814
Archived 1 artifacts
Archive block size is 32768
Received 0 blocks and 16320 bytes
Compression is 0.0%
Took 2.3 sec
[JENKINS] Archiving <https://builds.apache.org/job/ws-axiom-trunk/ws/axiom/buildutils/paxexam-maven-plugin/pom.xml>
to org.apache.ws.commons.axiom/paxexam-maven-plugin/1.2.15-SNAPSHOT/paxexam-maven-plugin-1.2.15-SNAPSHOT.pom
Sending artifact delta relative to ws-axiom-trunk ? Pax Exam Maven plugin #1814
Archived 1 artifacts
Archive block size is 32768
Received 0 blocks and 2399 bytes
Compression is 0.0%
Took 0.1 sec
[JENKINS] Archiving <https://builds.apache.org/job/ws-axiom-trunk/ws/axiom/modules/axiom-common-impl/pom.xml>
to org.apache.ws.commons.axiom/axiom-common-impl/1.2.15-SNAPSHOT/axiom-common-impl-1.2.15-SNAPSHOT.pom
Sending artifact delta relative to ws-axiom-trunk ? Axiom Common Implementation Classes #1814
Archived 1 artifacts
Archive block size is 32768
Received 0 blocks and 3865 bytes
Compression is 0.0%
Took 0.22 sec
[JENKINS] Archiving <https://builds.apache.org/job/ws-axiom-trunk/ws/axiom/systests/osgi-tests/pom.xml>
to org.apache.ws.commons.axiom/osgi-tests/1.2.15-SNAPSHOT/osgi-tests-1.2.15-SNAPSHOT.pom
Sending artifact delta relative to ws-axiom-trunk ? Axiom OSGi Tests #1814
Archived 1 artifacts
Archive block size is 32768
Received 0 blocks and 6764 bytes
Compression is 0.0%
Took 82 ms
[JENKINS] Archiving <https://builds.apache.org/job/ws-axiom-trunk/ws/axiom/testsuites/soap-testsuite/pom.xml>
to org.apache.ws.commons.axiom/soap-testsuite/1.2.15-SNAPSHOT/soap-testsuite-1.2.15-SNAPSHOT.pom
No prior successful build to compare, so performing full copy of artifacts
[JENKINS] Archiving <https://builds.apache.org/job/ws-axiom-trunk/ws/axiom/modules/axiom-tests/pom.xml>
to org.apache.ws.commons.axiom/axiom-tests/1.2.15-SNAPSHOT/axiom-tests-1.2.15-SNAPSHOT.pom
Sending artifact delta relative to ws-axiom-trunk ? Axiom Test Suite #1814
Archived 1 artifacts
Archive block size is 32768
Received 0 blocks and 5776 bytes
Compression is 0.0%
Took 63 ms
Sending e-mails to: dev@ws.apache.org andreas.veithen@gmail.com
channel stopped
Updating AXIOM-447

---------------------------------------------------------------------
To unsubscribe, e-mail: dev-unsubscribe@ws.apache.org
For additional commands, e-mail: dev-help@ws.apache.org


Mime
View raw message