ws-dev mailing list archives

Site index · List index
Message view « Date » · « Thread »
Top « Date » · « Thread »
From Apache Jenkins Server <jenk...@builds.apache.org>
Subject Build failed in Jenkins: woden-trunk #1178
Date Thu, 21 Aug 2014 18:47:58 GMT
See <https://builds.apache.org/job/woden-trunk/1178/>

------------------------------------------
[...truncated 341 lines...]
Downloaded: http://repo1.maven.org/maven2/org/codehaus/plexus/plexus/2.0.2/plexus-2.0.2.pom
(12 KB at 218.0 KB/sec)
Downloading: http://repo1.maven.org/maven2/org/codehaus/plexus/plexus-interpolation/1.12/plexus-interpolation-1.12.pom
Downloaded: http://repo1.maven.org/maven2/org/codehaus/plexus/plexus-interpolation/1.12/plexus-interpolation-1.12.pom
(889 B at 17.0 KB/sec)
Downloading: http://repo1.maven.org/maven2/org/codehaus/plexus/plexus-components/1.1.14/plexus-components-1.1.14.pom
Downloaded: http://repo1.maven.org/maven2/org/codehaus/plexus/plexus-components/1.1.14/plexus-components-1.1.14.pom
(6 KB at 109.7 KB/sec)
Downloading: http://repo1.maven.org/maven2/org/sonatype/plexus/plexus-build-api/0.0.4/plexus-build-api-0.0.4.pom
Downloaded: http://repo1.maven.org/maven2/org/sonatype/plexus/plexus-build-api/0.0.4/plexus-build-api-0.0.4.pom
(3 KB at 54.8 KB/sec)
Downloading: http://repo1.maven.org/maven2/org/sonatype/spice/spice-parent/10/spice-parent-10.pom
Downloaded: http://repo1.maven.org/maven2/org/sonatype/spice/spice-parent/10/spice-parent-10.pom
(3 KB at 56.6 KB/sec)
Downloading: http://repo1.maven.org/maven2/org/sonatype/forge/forge-parent/3/forge-parent-3.pom
Downloaded: http://repo1.maven.org/maven2/org/sonatype/forge/forge-parent/3/forge-parent-3.pom
(5 KB at 96.4 KB/sec)
Downloading: http://repo1.maven.org/maven2/org/codehaus/plexus/plexus-utils/1.5.8/plexus-utils-1.5.8.pom
Downloaded: http://repo1.maven.org/maven2/org/codehaus/plexus/plexus-utils/1.5.8/plexus-utils-1.5.8.pom
(8 KB at 154.4 KB/sec)
Downloading: http://repo1.maven.org/maven2/org/apache/maven/maven-project/2.0.5/maven-project-2.0.5.pom
Downloaded: http://repo1.maven.org/maven2/org/apache/maven/maven-project/2.0.5/maven-project-2.0.5.pom
(2 KB at 35.3 KB/sec)
Downloading: http://repo1.maven.org/maven2/org/apache/maven/maven/2.0.5/maven-2.0.5.pom
Downloaded: http://repo1.maven.org/maven2/org/apache/maven/maven/2.0.5/maven-2.0.5.pom (6
KB at 107.1 KB/sec)
Downloading: http://repo1.maven.org/maven2/org/apache/maven/maven-settings/2.0.5/maven-settings-2.0.5.pom
Downloaded: http://repo1.maven.org/maven2/org/apache/maven/maven-settings/2.0.5/maven-settings-2.0.5.pom
(2 KB at 31.5 KB/sec)
Downloading: http://repo1.maven.org/maven2/org/apache/maven/maven-model/2.0.5/maven-model-2.0.5.pom
Downloaded: http://repo1.maven.org/maven2/org/apache/maven/maven-model/2.0.5/maven-model-2.0.5.pom
(3 KB at 49.2 KB/sec)
Downloading: http://repo1.maven.org/maven2/org/apache/maven/maven-profile/2.0.5/maven-profile-2.0.5.pom
Downloaded: http://repo1.maven.org/maven2/org/apache/maven/maven-profile/2.0.5/maven-profile-2.0.5.pom
(2 KB at 31.1 KB/sec)
Downloading: http://repo1.maven.org/maven2/org/apache/maven/maven-artifact-manager/2.0.5/maven-artifact-manager-2.0.5.pom
Downloaded: http://repo1.maven.org/maven2/org/apache/maven/maven-artifact-manager/2.0.5/maven-artifact-manager-2.0.5.pom
(2 KB at 35.1 KB/sec)
Downloading: http://repo1.maven.org/maven2/org/apache/maven/maven-repository-metadata/2.0.5/maven-repository-metadata-2.0.5.pom
Downloaded: http://repo1.maven.org/maven2/org/apache/maven/maven-repository-metadata/2.0.5/maven-repository-metadata-2.0.5.pom
(2 KB at 27.9 KB/sec)
Downloading: http://repo1.maven.org/maven2/org/apache/maven/maven-artifact/2.0.5/maven-artifact-2.0.5.pom
Downloaded: http://repo1.maven.org/maven2/org/apache/maven/maven-artifact/2.0.5/maven-artifact-2.0.5.pom
(727 B at 13.7 KB/sec)
Downloading: http://repo1.maven.org/maven2/org/apache/maven/maven-core/2.0.5/maven-core-2.0.5.pom
Downloaded: http://repo1.maven.org/maven2/org/apache/maven/maven-core/2.0.5/maven-core-2.0.5.pom
(6 KB at 91.2 KB/sec)
Downloading: http://repo1.maven.org/maven2/org/apache/maven/maven-plugin-parameter-documenter/2.0.5/maven-plugin-parameter-documenter-2.0.5.pom
Downloaded: http://repo1.maven.org/maven2/org/apache/maven/maven-plugin-parameter-documenter/2.0.5/maven-plugin-parameter-documenter-2.0.5.pom
(2 KB at 23.1 KB/sec)
Downloading: http://repo1.maven.org/maven2/org/apache/maven/reporting/maven-reporting-api/2.0.5/maven-reporting-api-2.0.5.pom
Downloaded: http://repo1.maven.org/maven2/org/apache/maven/reporting/maven-reporting-api/2.0.5/maven-reporting-api-2.0.5.pom
(902 B at 17.3 KB/sec)
Downloading: http://repo1.maven.org/maven2/org/apache/maven/reporting/maven-reporting/2.0.5/maven-reporting-2.0.5.pom
Downloaded: http://repo1.maven.org/maven2/org/apache/maven/reporting/maven-reporting/2.0.5/maven-reporting-2.0.5.pom
(589 B at 11.1 KB/sec)
Downloading: http://repo1.maven.org/maven2/org/apache/maven/maven-error-diagnostics/2.0.5/maven-error-diagnostics-2.0.5.pom
Downloaded: http://repo1.maven.org/maven2/org/apache/maven/maven-error-diagnostics/2.0.5/maven-error-diagnostics-2.0.5.pom
(854 B at 17.0 KB/sec)
Downloading: http://repo1.maven.org/maven2/org/apache/maven/maven-plugin-registry/2.0.5/maven-plugin-registry-2.0.5.pom
Downloaded: http://repo1.maven.org/maven2/org/apache/maven/maven-plugin-registry/2.0.5/maven-plugin-registry-2.0.5.pom
(2 KB at 31.2 KB/sec)
Downloading: http://repo1.maven.org/maven2/org/apache/maven/maven-plugin-api/2.0.5/maven-plugin-api-2.0.5.pom
Downloaded: http://repo1.maven.org/maven2/org/apache/maven/maven-plugin-api/2.0.5/maven-plugin-api-2.0.5.pom
(605 B at 12.1 KB/sec)
Downloading: http://repo1.maven.org/maven2/org/apache/maven/maven-plugin-descriptor/2.0.5/maven-plugin-descriptor-2.0.5.pom
Downloaded: http://repo1.maven.org/maven2/org/apache/maven/maven-plugin-descriptor/2.0.5/maven-plugin-descriptor-2.0.5.pom
(2 KB at 33.7 KB/sec)
Downloading: http://repo1.maven.org/maven2/org/apache/maven/maven-monitor/2.0.5/maven-monitor-2.0.5.pom
Downloaded: http://repo1.maven.org/maven2/org/apache/maven/maven-monitor/2.0.5/maven-monitor-2.0.5.pom
(404 B at 6.7 KB/sec)
Downloading: http://repo1.maven.org/maven2/velocity/velocity-dep/1.4/velocity-dep-1.4.pom
Downloaded: http://repo1.maven.org/maven2/velocity/velocity-dep/1.4/velocity-dep-1.4.pom (2
KB at 24.7 KB/sec)
Downloading: http://repo1.maven.org/maven2/org/apache/maven/shared/maven-common-artifact-filters/1.0/maven-common-artifact-filters-1.0.pom
Downloaded: http://repo1.maven.org/maven2/org/apache/maven/shared/maven-common-artifact-filters/1.0/maven-common-artifact-filters-1.0.pom
(2 KB at 40.2 KB/sec)
Downloading: http://repo1.maven.org/maven2/org/apache/maven/shared/maven-plugin-testing-harness/1.1/maven-plugin-testing-harness-1.1.pom
Downloaded: http://repo1.maven.org/maven2/org/apache/maven/shared/maven-plugin-testing-harness/1.1/maven-plugin-testing-harness-1.1.pom
(7 KB at 126.3 KB/sec)
Downloading: http://repo1.maven.org/maven2/org/apache/maven/shared/maven-shared-components/7/maven-shared-components-7.pom
Downloaded: http://repo1.maven.org/maven2/org/apache/maven/shared/maven-shared-components/7/maven-shared-components-7.pom
(3 KB at 52.9 KB/sec)
Downloading: http://repo1.maven.org/maven2/org/apache/maven/maven-project/2.0/maven-project-2.0.pom
Downloaded: http://repo1.maven.org/maven2/org/apache/maven/maven-project/2.0/maven-project-2.0.pom
(2 KB at 32.6 KB/sec)
Downloading: http://repo1.maven.org/maven2/org/apache/maven/maven/2.0/maven-2.0.pom
Downloaded: http://repo1.maven.org/maven2/org/apache/maven/maven/2.0/maven-2.0.pom (9 KB at
174.7 KB/sec)
Downloading: http://repo1.maven.org/maven2/org/apache/maven/maven-profile/2.0/maven-profile-2.0.pom
Downloaded: http://repo1.maven.org/maven2/org/apache/maven/maven-profile/2.0/maven-profile-2.0.pom
(2 KB at 27.9 KB/sec)
Downloading: http://repo1.maven.org/maven2/org/apache/maven/maven-model/2.0/maven-model-2.0.pom
Downloaded: http://repo1.maven.org/maven2/org/apache/maven/maven-model/2.0/maven-model-2.0.pom
(3 KB at 12.0 KB/sec)
Downloading: http://repo1.maven.org/maven2/org/codehaus/plexus/plexus-container-default/1.0-alpha-8/plexus-container-default-1.0-alpha-8.pom
Downloaded: http://repo1.maven.org/maven2/org/codehaus/plexus/plexus-container-default/1.0-alpha-8/plexus-container-default-1.0-alpha-8.pom
(8 KB at 133.8 KB/sec)
Downloading: http://repo1.maven.org/maven2/org/apache/maven/maven-artifact-manager/2.0/maven-artifact-manager-2.0.pom
Downloaded: http://repo1.maven.org/maven2/org/apache/maven/maven-artifact-manager/2.0/maven-artifact-manager-2.0.pom
(2 KB at 26.3 KB/sec)
Downloading: http://repo1.maven.org/maven2/org/apache/maven/maven-repository-metadata/2.0/maven-repository-metadata-2.0.pom
Downloaded: http://repo1.maven.org/maven2/org/apache/maven/maven-repository-metadata/2.0/maven-repository-metadata-2.0.pom
(2 KB at 24.5 KB/sec)
Downloading: http://repo1.maven.org/maven2/org/apache/maven/maven-artifact/2.0/maven-artifact-2.0.pom
Downloaded: http://repo1.maven.org/maven2/org/apache/maven/maven-artifact/2.0/maven-artifact-2.0.pom
(723 B at 14.4 KB/sec)
Downloading: http://repo1.maven.org/maven2/org/apache/maven/maven-core/2.0/maven-core-2.0.pom
Downloaded: http://repo1.maven.org/maven2/org/apache/maven/maven-core/2.0/maven-core-2.0.pom
(6 KB at 111.5 KB/sec)
Downloading: http://repo1.maven.org/maven2/org/apache/maven/maven-settings/2.0/maven-settings-2.0.pom
Downloaded: http://repo1.maven.org/maven2/org/apache/maven/maven-settings/2.0/maven-settings-2.0.pom
(2 KB at 27.5 KB/sec)
Downloading: http://repo1.maven.org/maven2/org/apache/maven/maven-plugin-parameter-documenter/2.0/maven-plugin-parameter-documenter-2.0.pom
Downloaded: http://repo1.maven.org/maven2/org/apache/maven/maven-plugin-parameter-documenter/2.0/maven-plugin-parameter-documenter-2.0.pom
(2 KB at 30.4 KB/sec)
Downloading: http://repo1.maven.org/maven2/org/apache/maven/reporting/maven-reporting-api/2.0/maven-reporting-api-2.0.pom
Downloaded: http://repo1.maven.org/maven2/org/apache/maven/reporting/maven-reporting-api/2.0/maven-reporting-api-2.0.pom
(2 KB at 22.1 KB/sec)
Downloading: http://repo1.maven.org/maven2/org/apache/maven/reporting/maven-reporting/2.0/maven-reporting-2.0.pom
Downloaded: http://repo1.maven.org/maven2/org/apache/maven/reporting/maven-reporting/2.0/maven-reporting-2.0.pom
(504 B at 9.8 KB/sec)
Downloading: http://repo1.maven.org/maven2/doxia/doxia-sink-api/1.0-alpha-4/doxia-sink-api-1.0-alpha-4.pom
Downloaded: http://repo1.maven.org/maven2/doxia/doxia-sink-api/1.0-alpha-4/doxia-sink-api-1.0-alpha-4.pom
(2 KB at 21.8 KB/sec)
Downloading: http://repo1.maven.org/maven2/org/apache/maven/maven-error-diagnostics/2.0/maven-error-diagnostics-2.0.pom
Downloaded: http://repo1.maven.org/maven2/org/apache/maven/maven-error-diagnostics/2.0/maven-error-diagnostics-2.0.pom
(812 B at 7.6 KB/sec)
Downloading: http://repo1.maven.org/maven2/org/apache/maven/maven-plugin-registry/2.0/maven-plugin-registry-2.0.pom
Downloaded: http://repo1.maven.org/maven2/org/apache/maven/maven-plugin-registry/2.0/maven-plugin-registry-2.0.pom
(2 KB at 23.2 KB/sec)
Downloading: http://repo1.maven.org/maven2/org/apache/maven/maven-plugin-api/2.0/maven-plugin-api-2.0.pom
Downloaded: http://repo1.maven.org/maven2/org/apache/maven/maven-plugin-api/2.0/maven-plugin-api-2.0.pom
(601 B at 8.8 KB/sec)
Downloading: http://repo1.maven.org/maven2/org/apache/maven/maven-plugin-descriptor/2.0/maven-plugin-descriptor-2.0.pom
Downloaded: http://repo1.maven.org/maven2/org/apache/maven/maven-plugin-descriptor/2.0/maven-plugin-descriptor-2.0.pom
(2 KB at 28.5 KB/sec)
Downloading: http://repo1.maven.org/maven2/org/apache/maven/maven-monitor/2.0/maven-monitor-2.0.pom
Downloaded: http://repo1.maven.org/maven2/org/apache/maven/maven-monitor/2.0/maven-monitor-2.0.pom
(400 B at 8.0 KB/sec)
Downloading: http://repo1.maven.org/maven2/org/codehaus/plexus/plexus-utils/1.4.2/plexus-utils-1.4.2.pom
Downloaded: http://repo1.maven.org/maven2/org/codehaus/plexus/plexus-utils/1.4.2/plexus-utils-1.4.2.pom
(2 KB at 38.3 KB/sec)
Downloading: http://repo1.maven.org/maven2/org/codehaus/plexus/plexus-archiver/1.0-alpha-7/plexus-archiver-1.0-alpha-7.pom
Downloaded: http://repo1.maven.org/maven2/org/codehaus/plexus/plexus-archiver/1.0-alpha-7/plexus-archiver-1.0-alpha-7.pom
(2 KB at 20.8 KB/sec)
Downloading: http://repo1.maven.org/maven2/org/codehaus/plexus/plexus-components/1.1.6/plexus-components-1.1.6.pom
Downloaded: http://repo1.maven.org/maven2/org/codehaus/plexus/plexus-components/1.1.6/plexus-components-1.1.6.pom
(2 KB at 37.6 KB/sec)
Downloading: http://repo1.maven.org/maven2/org/codehaus/plexus/plexus/1.0.8/plexus-1.0.8.pom
Downloaded: http://repo1.maven.org/maven2/org/codehaus/plexus/plexus/1.0.8/plexus-1.0.8.pom
(8 KB at 144.1 KB/sec)
Downloading: http://repo1.maven.org/maven2/org/codehaus/plexus/plexus-utils/1.2/plexus-utils-1.2.pom
Downloaded: http://repo1.maven.org/maven2/org/codehaus/plexus/plexus-utils/1.2/plexus-utils-1.2.pom
(767 B at 15.6 KB/sec)
Downloading: http://repo1.maven.org/maven2/org/codehaus/plexus/plexus/1.0.5/plexus-1.0.5.pom
Downloaded: http://repo1.maven.org/maven2/org/codehaus/plexus/plexus/1.0.5/plexus-1.0.5.pom
(6 KB at 118.4 KB/sec)
Downloading: http://repo1.maven.org/maven2/org/apache/maven/shared/maven-downloader/1.1/maven-downloader-1.1.pom
Downloaded: http://repo1.maven.org/maven2/org/apache/maven/shared/maven-downloader/1.1/maven-downloader-1.1.pom
(2 KB at 36.2 KB/sec)
Downloading: http://repo1.maven.org/maven2/org/apache/maven/shared/maven-shared-components/4/maven-shared-components-4.pom
Downloaded: http://repo1.maven.org/maven2/org/apache/maven/shared/maven-shared-components/4/maven-shared-components-4.pom
(3 KB at 32.2 KB/sec)
Downloading: http://repo1.maven.org/maven2/org/apache/maven/maven-parent/4/maven-parent-4.pom
Downloaded: http://repo1.maven.org/maven2/org/apache/maven/maven-parent/4/maven-parent-4.pom
(10 KB at 199.2 KB/sec)
Downloading: http://repo1.maven.org/maven2/org/codehaus/plexus/plexus-utils/1.5.12/plexus-utils-1.5.12.pom
Downloaded: http://repo1.maven.org/maven2/org/codehaus/plexus/plexus-utils/1.5.12/plexus-utils-1.5.12.pom
(6 KB at 112.3 KB/sec)
Downloading: http://repo1.maven.org/maven2/org/codehaus/plexus/plexus-velocity/1.1.3/plexus-velocity-1.1.3.pom
Downloaded: http://repo1.maven.org/maven2/org/codehaus/plexus/plexus-velocity/1.1.3/plexus-velocity-1.1.3.pom
(976 B at 19.1 KB/sec)
Downloading: http://repo1.maven.org/maven2/org/codehaus/plexus/plexus-components/1.1.5/plexus-components-1.1.5.pom
Downloaded: http://repo1.maven.org/maven2/org/codehaus/plexus/plexus-components/1.1.5/plexus-components-1.1.5.pom
(3 KB at 30.8 KB/sec)
Downloading: http://repo1.maven.org/maven2/commons-collections/commons-collections/2.0/commons-collections-2.0.pom
Downloaded: http://repo1.maven.org/maven2/commons-collections/commons-collections/2.0/commons-collections-2.0.pom
(171 B at 3.2 KB/sec)
Downloading: http://repo1.maven.org/maven2/velocity/velocity/1.4/velocity-1.4.pom
Downloaded: http://repo1.maven.org/maven2/velocity/velocity/1.4/velocity-1.4.pom (3 KB at
45.3 KB/sec)
Downloading: http://repo1.maven.org/maven2/org/codehaus/plexus/plexus-resources/1.0-alpha-5/plexus-resources-1.0-alpha-5.pom
Downloaded: http://repo1.maven.org/maven2/org/codehaus/plexus/plexus-resources/1.0-alpha-5/plexus-resources-1.0-alpha-5.pom
(2 KB at 11.2 KB/sec)
Downloading: http://repo1.maven.org/maven2/org/codehaus/plexus/plexus-utils/1.5.5/plexus-utils-1.5.5.pom
Downloaded: http://repo1.maven.org/maven2/org/codehaus/plexus/plexus-utils/1.5.5/plexus-utils-1.5.5.pom
(6 KB at 100.5 KB/sec)
Downloading: http://repo1.maven.org/maven2/org/apache/maven/shared/maven-artifact-resolver/1.0/maven-artifact-resolver-1.0.jar
Downloading: http://repo1.maven.org/maven2/org/sonatype/plexus/plexus-build-api/0.0.4/plexus-build-api-0.0.4.jar
Downloading: http://repo1.maven.org/maven2/org/apache/maven/shared/maven-filtering/1.0-beta-3/maven-filtering-1.0-beta-3.jar
Downloading: http://repo1.maven.org/maven2/org/apache/maven/reporting/maven-reporting-api/2.0.5/maven-reporting-api-2.0.5.jar
Downloading: http://repo1.maven.org/maven2/velocity/velocity-dep/1.4/velocity-dep-1.4.jar
Downloaded: http://repo1.maven.org/maven2/org/apache/maven/shared/maven-artifact-resolver/1.0/maven-artifact-resolver-1.0.jar
(14 KB at 270.5 KB/sec)
Downloading: http://repo1.maven.org/maven2/org/apache/maven/shared/maven-common-artifact-filters/1.0/maven-common-artifact-filters-1.0.jar
Downloaded: http://repo1.maven.org/maven2/org/sonatype/plexus/plexus-build-api/0.0.4/plexus-build-api-0.0.4.jar
(7 KB at 91.1 KB/sec)
Downloading: http://repo1.maven.org/maven2/org/apache/maven/shared/maven-plugin-testing-harness/1.1/maven-plugin-testing-harness-1.1.jar
Downloaded: http://repo1.maven.org/maven2/org/apache/maven/reporting/maven-reporting-api/2.0.5/maven-reporting-api-2.0.5.jar
(10 KB at 127.7 KB/sec)
Downloading: http://repo1.maven.org/maven2/org/codehaus/plexus/plexus-archiver/1.0-alpha-7/plexus-archiver-1.0-alpha-7.jar
Downloaded: http://repo1.maven.org/maven2/org/apache/maven/shared/maven-plugin-testing-harness/1.1/maven-plugin-testing-harness-1.1.jar
(32 KB at 647.6 KB/sec)
Downloaded: http://repo1.maven.org/maven2/org/apache/maven/shared/maven-filtering/1.0-beta-3/maven-filtering-1.0-beta-3.jar
(34 KB at 273.1 KB/sec)
Downloading: http://repo1.maven.org/maven2/org/apache/maven/shared/maven-downloader/1.1/maven-downloader-1.1.jar
Downloading: http://repo1.maven.org/maven2/org/codehaus/plexus/plexus-interpolation/1.12/plexus-interpolation-1.12.jar
Downloaded: http://repo1.maven.org/maven2/org/apache/maven/shared/maven-common-artifact-filters/1.0/maven-common-artifact-filters-1.0.jar
(27 KB at 354.9 KB/sec)
Downloading: http://repo1.maven.org/maven2/org/codehaus/plexus/plexus-utils/1.5.12/plexus-utils-1.5.12.jar
Downloaded: http://repo1.maven.org/maven2/org/apache/maven/shared/maven-downloader/1.1/maven-downloader-1.1.jar
(7 KB at 129.1 KB/sec)
Downloading: http://repo1.maven.org/maven2/org/codehaus/plexus/plexus-velocity/1.1.3/plexus-velocity-1.1.3.jar
Downloaded: http://repo1.maven.org/maven2/org/codehaus/plexus/plexus-interpolation/1.12/plexus-interpolation-1.12.jar
(60 KB at 826.8 KB/sec)
Downloading: http://repo1.maven.org/maven2/commons-collections/commons-collections/2.0/commons-collections-2.0.jar
Downloaded: http://repo1.maven.org/maven2/org/codehaus/plexus/plexus-velocity/1.1.3/plexus-velocity-1.1.3.jar
(8 KB at 157.7 KB/sec)
Downloading: http://repo1.maven.org/maven2/velocity/velocity/1.4/velocity-1.4.jar
Downloaded: http://repo1.maven.org/maven2/commons-collections/commons-collections/2.0/commons-collections-2.0.jar
(89 KB at 1210.7 KB/sec)
Downloading: http://repo1.maven.org/maven2/org/codehaus/plexus/plexus-resources/1.0-alpha-5/plexus-resources-1.0-alpha-5.jar
Downloaded: http://repo1.maven.org/maven2/org/codehaus/plexus/plexus-archiver/1.0-alpha-7/plexus-archiver-1.0-alpha-7.jar
(139 KB at 673.3 KB/sec)
Downloaded: http://repo1.maven.org/maven2/org/codehaus/plexus/plexus-resources/1.0-alpha-5/plexus-resources-1.0-alpha-5.jar
(22 KB at 388.3 KB/sec)
Downloaded: http://repo1.maven.org/maven2/velocity/velocity-dep/1.4/velocity-dep-1.4.jar (506
KB at 1420.3 KB/sec)
Downloaded: http://repo1.maven.org/maven2/org/codehaus/plexus/plexus-utils/1.5.12/plexus-utils-1.5.12.jar
(276 KB at 1100.0 KB/sec)
Downloaded: http://repo1.maven.org/maven2/velocity/velocity/1.4/velocity-1.4.jar (353 KB at
1216.2 KB/sec)
[INFO] Setting property: classpath.resource.loader.class => 'org.codehaus.plexus.velocity.ContextClassLoaderResourceLoader'.
[INFO] Setting property: velocimacro.messages.on => 'false'.
[INFO] Setting property: resource.loader => 'classpath'.
[INFO] Setting property: resource.manager.logwhenfound => 'false'.
Downloading: http://repo1.maven.org/maven2/org/apache/apache-jar-resource-bundle/1.4/apache-jar-resource-bundle-1.4.jar
Downloaded: http://repo1.maven.org/maven2/org/apache/apache-jar-resource-bundle/1.4/apache-jar-resource-bundle-1.4.jar
(13 KB at 158.3 KB/sec)
Downloading: http://repo1.maven.org/maven2/junit/junit/3.8.2/junit-3.8.2.jar
Downloaded: http://repo1.maven.org/maven2/junit/junit/3.8.2/junit-3.8.2.jar (118 KB at 1592.1
KB/sec)
[WARNING] Failed to getClass for org.apache.maven.plugin.javadoc.AggregatorJavadocReport
Downloading: http://repository.apache.org/snapshots/org/apache/ws/xmlschema/xmlschema-core/2.1.1-SNAPSHOT/maven-metadata.xml
[WARNING] Could not transfer metadata org.apache.ws.xmlschema:xmlschema-core:2.1.1-SNAPSHOT/maven-metadata.xml
from/to Nexus (http://repository.apache.org/snapshots): Error transferring file: Server returned
HTTP response code: 502 for URL: http://repository.apache.org/snapshots/org/apache/ws/xmlschema/xmlschema-core/2.1.1-SNAPSHOT/maven-metadata.xml
Downloading: http://repository.apache.org/snapshots/org/apache/ws/xmlschema/xmlschema-core/2.1.1-SNAPSHOT/maven-metadata.xml
[WARNING] Could not transfer metadata org.apache.ws.xmlschema:xmlschema-core:2.1.1-SNAPSHOT/maven-metadata.xml
from/to Nexus (http://repository.apache.org/snapshots): Error transferring file: Server returned
HTTP response code: 502 for URL: http://repository.apache.org/snapshots/org/apache/ws/xmlschema/xmlschema-core/2.1.1-SNAPSHOT/maven-metadata.xml
Downloading: http://repository.apache.org/snapshots/org/apache/ws/xmlschema/xmlschema-core/2.1.1-SNAPSHOT/xmlschema-core-2.1.1-SNAPSHOT.pom
[WARNING] The POM for org.apache.ws.xmlschema:xmlschema-core:jar:2.1.1-SNAPSHOT is missing,
no dependency information available
Downloading: http://repo1.maven.org/maven2/commons-logging/commons-logging/1.1.1/commons-logging-1.1.1.pom
Downloaded: http://repo1.maven.org/maven2/commons-logging/commons-logging/1.1.1/commons-logging-1.1.1.pom
(18 KB at 69.5 KB/sec)
Downloading: http://repo1.maven.org/maven2/org/apache/commons/commons-parent/5/commons-parent-5.pom
Downloaded: http://repo1.maven.org/maven2/org/apache/commons/commons-parent/5/commons-parent-5.pom
(16 KB at 168.4 KB/sec)
Downloading: http://repo1.maven.org/maven2/log4j/log4j/1.2.15/log4j-1.2.15.pom
Downloaded: http://repo1.maven.org/maven2/log4j/log4j/1.2.15/log4j-1.2.15.pom (18 KB at 231.5
KB/sec)
Downloading: http://repository.apache.org/snapshots/org/apache/ws/xmlschema/xmlschema-core/2.1.1-SNAPSHOT/xmlschema-core-2.1.1-SNAPSHOT.jar
Downloading: http://repo1.maven.org/maven2/commons-logging/commons-logging/1.1.1/commons-logging-1.1.1.jar
Downloaded: http://repo1.maven.org/maven2/commons-logging/commons-logging/1.1.1/commons-logging-1.1.1.jar
(60 KB at 604.7 KB/sec)
[INFO] ------------------------------------------------------------------------
[INFO] Reactor Summary:
[INFO] 
[INFO] Woden ............................................. FAILURE [2:16.560s]
[INFO] Woden - Core ...................................... SKIPPED
[INFO] Woden - Tool ...................................... SKIPPED
[INFO] Woden - converter Maven plugin .................... SKIPPED
[INFO] Woden - Ant ....................................... SKIPPED
[INFO] Woden - dist ...................................... SKIPPED
[INFO] ------------------------------------------------------------------------
[INFO] BUILD FAILURE
[INFO] ------------------------------------------------------------------------
[INFO] Total time: 2:25.572s
[INFO] Finished at: Thu Aug 21 18:47:51 UTC 2014
[INFO] Final Memory: 13M/361M
[INFO] ------------------------------------------------------------------------
Waiting for Jenkins to finish collecting data
[ERROR] Failed to execute goal on project woden-core: Could not resolve dependencies for project
org.apache.woden:woden-core:bundle:1.0-SNAPSHOT: Could not find artifact org.apache.ws.xmlschema:xmlschema-core:jar:2.1.1-SNAPSHOT
in Nexus (http://repository.apache.org/snapshots) -> [Help 1]
[ERROR] 
[ERROR] To see the full stack trace of the errors, re-run Maven with the -e switch.
[ERROR] Re-run Maven using the -X switch to enable full debug logging.
[ERROR] 
[ERROR] For more information about the errors and possible solutions, please read the following
articles:
[ERROR] [Help 1] http://cwiki.apache.org/confluence/display/MAVEN/DependencyResolutionException
[ERROR] 
[ERROR] After correcting the problems, you can resume the build with the command
[ERROR]   mvn <goals> -rf :woden-core
[JENKINS] Archiving <https://builds.apache.org/job/woden-trunk/ws/woden/woden-dist/pom.xml>
to org.apache.woden/woden-dist/1.0-SNAPSHOT/woden-dist-1.0-SNAPSHOT.pom
Sending artifact delta relative to woden-trunk ? Woden - dist #1177
Archived 1 artifacts
Archive block size is 32768
Received 0 blocks and 4009 bytes
Compression is 0.0%
Took 2.4 sec
[JENKINS] Archiving <https://builds.apache.org/job/woden-trunk/ws/woden/woden-converter-maven-plugin/pom.xml>
to org.apache.woden/woden-converter-maven-plugin/1.0-SNAPSHOT/woden-converter-maven-plugin-1.0-SNAPSHOT.pom
Sending artifact delta relative to woden-trunk ? Woden - converter Maven plugin #1177
Archived 1 artifacts
Archive block size is 32768
Received 0 blocks and 2619 bytes
Compression is 0.0%
Took 88 ms
[JENKINS] Archiving <https://builds.apache.org/job/woden-trunk/ws/woden/woden-ant/pom.xml>
to org.apache.woden/woden-ant/1.0-SNAPSHOT/woden-ant-1.0-SNAPSHOT.pom
Sending artifact delta relative to woden-trunk ? Woden - Ant #1177
Archived 1 artifacts
Archive block size is 32768
Received 0 blocks and 4598 bytes
Compression is 0.0%
Took 50 ms
[JENKINS] Archiving <https://builds.apache.org/job/woden-trunk/ws/woden/woden-tool/pom.xml>
to org.apache.woden/woden-tool/1.0-SNAPSHOT/woden-tool-1.0-SNAPSHOT.pom
Sending artifact delta relative to woden-trunk ? Woden - Tool #1177
Archived 1 artifacts
Archive block size is 32768
Received 0 blocks and 4867 bytes
Compression is 0.0%
Took 0.11 sec
[JENKINS] Archiving <https://builds.apache.org/job/woden-trunk/ws/woden/woden-core/pom.xml>
to org.apache.woden/woden-core/1.0-SNAPSHOT/woden-core-1.0-SNAPSHOT.pom
Sending artifact delta relative to woden-trunk ? Woden - Core #1177
Archived 1 artifacts
Archive block size is 32768
Received 0 blocks and 4626 bytes
Compression is 0.0%
Took 22 ms
[JENKINS] Archiving <https://builds.apache.org/job/woden-trunk/ws/woden/pom.xml> to
org.apache.woden/woden/1.0-SNAPSHOT/woden-1.0-SNAPSHOT.pom
Sending artifact delta relative to woden-trunk ? Woden #1177
Archived 1 artifacts
Archive block size is 32768
Received 0 blocks and 13390 bytes
Compression is 0.0%
Took 10 ms
channel stopped

---------------------------------------------------------------------
To unsubscribe, e-mail: dev-unsubscribe@ws.apache.org
For additional commands, e-mail: dev-help@ws.apache.org


Mime
View raw message