ws-dev mailing list archives

Site index · List index
Message view « Date » · « Thread »
Top « Date » · « Thread »
From Apache Jenkins Server <jenk...@builds.apache.org>
Subject Build failed in Jenkins: wss4j-1.6 #124
Date Mon, 25 Aug 2014 09:40:26 GMT
See <https://builds.apache.org/job/wss4j-1.6/124/changes>

Changes:

[coheigea] Improving required signed elements detection


Conflicts:
	src/main/java/org/apache/ws/security/util/WSSecurityUtil.java

[coheigea] Upgrading to Xalan 2.7.2

------------------------------------------
[...truncated 1782 lines...]
Downloading: http://repo.maven.apache.org/maven2/org/apache/maven/reporting/maven-reporting-exec/1.1/maven-reporting-exec-1.1.jar
Downloading: http://repo.maven.apache.org/maven2/org/apache/maven/reporting/maven-reporting-api/3.0/maven-reporting-api-3.0.jar
Downloading: http://repo.maven.apache.org/maven2/org/apache/maven/shared/maven-shared-utils/0.3/maven-shared-utils-0.3.jar
Downloading: http://repo.maven.apache.org/maven2/org/sonatype/aether/aether-util/1.7/aether-util-1.7.jar
Downloading: http://repo.maven.apache.org/maven2/org/sonatype/sisu/sisu-inject-bean/1.4.2/sisu-inject-bean-1.4.2.jar
Downloaded: http://repo.maven.apache.org/maven2/org/apache/maven/reporting/maven-reporting-exec/1.1/maven-reporting-exec-1.1.jar
(26 KB at 486.7 KB/sec)
Downloading: http://repo.maven.apache.org/maven2/org/sonatype/sisu/sisu-guice/2.1.7/sisu-guice-2.1.7-noaop.jar
Downloaded: http://repo.maven.apache.org/maven2/org/apache/maven/reporting/maven-reporting-api/3.0/maven-reporting-api-3.0.jar
(11 KB at 133.5 KB/sec)
Downloading: http://repo.maven.apache.org/maven2/org/codehaus/plexus/plexus-interpolation/1.14/plexus-interpolation-1.14.jar
Downloaded: http://repo.maven.apache.org/maven2/org/sonatype/aether/aether-util/1.7/aether-util-1.7.jar
(106 KB at 605.9 KB/sec)
Downloading: http://repo.maven.apache.org/maven2/org/apache/maven/maven-archiver/2.4.2/maven-archiver-2.4.2.jar
Downloaded: http://repo.maven.apache.org/maven2/org/apache/maven/shared/maven-shared-utils/0.3/maven-shared-utils-0.3.jar
(152 KB at 794.1 KB/sec)
Downloading: http://repo.maven.apache.org/maven2/org/apache/maven/doxia/doxia-sink-api/1.4/doxia-sink-api-1.4.jar
Downloaded: http://repo.maven.apache.org/maven2/org/sonatype/sisu/sisu-inject-bean/1.4.2/sisu-inject-bean-1.4.2.jar
(150 KB at 743.3 KB/sec)
Downloading: http://repo.maven.apache.org/maven2/org/apache/maven/doxia/doxia-logging-api/1.4/doxia-logging-api-1.4.jar
Downloaded: http://repo.maven.apache.org/maven2/org/codehaus/plexus/plexus-interpolation/1.14/plexus-interpolation-1.14.jar
(60 KB at 458.8 KB/sec)
Downloading: http://repo.maven.apache.org/maven2/org/apache/maven/doxia/doxia-core/1.4/doxia-core-1.4.jar
Downloaded: http://repo.maven.apache.org/maven2/org/apache/maven/maven-archiver/2.4.2/maven-archiver-2.4.2.jar
(20 KB at 365.7 KB/sec)
Downloading: http://repo.maven.apache.org/maven2/org/apache/httpcomponents/httpclient/4.0.2/httpclient-4.0.2.jar
Downloaded: http://repo.maven.apache.org/maven2/org/apache/maven/doxia/doxia-sink-api/1.4/doxia-sink-api-1.4.jar
(11 KB at 214.5 KB/sec)
Downloading: http://repo.maven.apache.org/maven2/commons-codec/commons-codec/1.3/commons-codec-1.3.jar
Downloaded: http://repo.maven.apache.org/maven2/org/apache/maven/doxia/doxia-logging-api/1.4/doxia-logging-api-1.4.jar
(12 KB at 200.8 KB/sec)
Downloading: http://repo.maven.apache.org/maven2/org/apache/httpcomponents/httpcore/4.0.1/httpcore-4.0.1.jar
Downloaded: http://repo.maven.apache.org/maven2/org/sonatype/sisu/sisu-guice/2.1.7/sisu-guice-2.1.7-noaop.jar
(461 KB at 1960.3 KB/sec)
Downloading: http://repo.maven.apache.org/maven2/org/apache/maven/doxia/doxia-module-xhtml/1.4/doxia-module-xhtml-1.4.jar
Downloaded: http://repo.maven.apache.org/maven2/commons-codec/commons-codec/1.3/commons-codec-1.3.jar
(46 KB at 877.5 KB/sec)
Downloading: http://repo.maven.apache.org/maven2/org/apache/maven/doxia/doxia-module-apt/1.4/doxia-module-apt-1.4.jar
Downloaded: http://repo.maven.apache.org/maven2/org/apache/maven/doxia/doxia-module-xhtml/1.4/doxia-module-xhtml-1.4.jar
(16 KB at 294.6 KB/sec)
Downloading: http://repo.maven.apache.org/maven2/org/apache/maven/doxia/doxia-module-xdoc/1.4/doxia-module-xdoc-1.4.jar
Downloaded: http://repo.maven.apache.org/maven2/org/apache/maven/doxia/doxia-core/1.4/doxia-core-1.4.jar
(162 KB at 1032.2 KB/sec)
Downloading: http://repo.maven.apache.org/maven2/org/apache/maven/doxia/doxia-module-fml/1.4/doxia-module-fml-1.4.jar
Downloaded: http://repo.maven.apache.org/maven2/org/apache/maven/doxia/doxia-module-apt/1.4/doxia-module-apt-1.4.jar
(51 KB at 687.7 KB/sec)
Downloading: http://repo.maven.apache.org/maven2/org/apache/maven/doxia/doxia-module-markdown/1.4/doxia-module-markdown-1.4.jar
Downloaded: http://repo.maven.apache.org/maven2/org/apache/httpcomponents/httpcore/4.0.1/httpcore-4.0.1.jar
(169 KB at 1319.0 KB/sec)
Downloading: http://repo.maven.apache.org/maven2/org/pegdown/pegdown/1.2.1/pegdown-1.2.1.jar
Downloaded: http://repo.maven.apache.org/maven2/org/apache/maven/doxia/doxia-module-xdoc/1.4/doxia-module-xdoc-1.4.jar
(36 KB at 688.5 KB/sec)
Downloading: http://repo.maven.apache.org/maven2/org/parboiled/parboiled-java/1.1.4/parboiled-java-1.1.4.jar
Downloaded: http://repo.maven.apache.org/maven2/org/apache/httpcomponents/httpclient/4.0.2/httpclient-4.0.2.jar
(287 KB at 1643.8 KB/sec)
Downloading: http://repo.maven.apache.org/maven2/org/parboiled/parboiled-core/1.1.4/parboiled-core-1.1.4.jar
Downloaded: http://repo.maven.apache.org/maven2/org/apache/maven/doxia/doxia-module-markdown/1.4/doxia-module-markdown-1.4.jar
(12 KB at 218.9 KB/sec)
Downloading: http://repo.maven.apache.org/maven2/org/ow2/asm/asm/4.1/asm-4.1.jar
Downloaded: http://repo.maven.apache.org/maven2/org/apache/maven/doxia/doxia-module-fml/1.4/doxia-module-fml-1.4.jar
(37 KB at 659.6 KB/sec)
Downloading: http://repo.maven.apache.org/maven2/org/ow2/asm/asm-tree/4.1/asm-tree-4.1.jar
Downloaded: http://repo.maven.apache.org/maven2/org/pegdown/pegdown/1.2.1/pegdown-1.2.1.jar
(58 KB at 1004.1 KB/sec)
Downloading: http://repo.maven.apache.org/maven2/org/ow2/asm/asm-analysis/4.1/asm-analysis-4.1.jar
Downloaded: http://repo.maven.apache.org/maven2/org/parboiled/parboiled-java/1.1.4/parboiled-java-1.1.4.jar
(72 KB at 1348.4 KB/sec)
Downloading: http://repo.maven.apache.org/maven2/org/ow2/asm/asm-util/4.1/asm-util-4.1.jar
Downloaded: http://repo.maven.apache.org/maven2/org/ow2/asm/asm/4.1/asm-4.1.jar (47 KB at
872.6 KB/sec)
Downloading: http://repo.maven.apache.org/maven2/javax/servlet/servlet-api/2.5/servlet-api-2.5.jar
Downloaded: http://repo.maven.apache.org/maven2/org/ow2/asm/asm-tree/4.1/asm-tree-4.1.jar
(22 KB at 393.5 KB/sec)
Downloading: http://repo.maven.apache.org/maven2/org/apache/maven/doxia/doxia-decoration-model/1.4/doxia-decoration-model-1.4.jar
Downloaded: http://repo.maven.apache.org/maven2/org/ow2/asm/asm-analysis/4.1/asm-analysis-4.1.jar
(20 KB at 379.4 KB/sec)
Downloading: http://repo.maven.apache.org/maven2/org/apache/maven/doxia/doxia-site-renderer/1.4/doxia-site-renderer-1.4.jar
Downloaded: http://repo.maven.apache.org/maven2/org/ow2/asm/asm-util/4.1/asm-util-4.1.jar
(37 KB at 655.7 KB/sec)
Downloading: http://repo.maven.apache.org/maven2/org/apache/velocity/velocity-tools/2.0/velocity-tools-2.0.jar
Downloaded: http://repo.maven.apache.org/maven2/org/parboiled/parboiled-core/1.1.4/parboiled-core-1.1.4.jar
(181 KB at 1736.6 KB/sec)
Downloading: http://repo.maven.apache.org/maven2/commons-digester/commons-digester/1.8/commons-digester-1.8.jar
Downloaded: http://repo.maven.apache.org/maven2/org/apache/maven/doxia/doxia-decoration-model/1.4/doxia-decoration-model-1.4.jar
(60 KB at 1068.3 KB/sec)
Downloading: http://repo.maven.apache.org/maven2/commons-chain/commons-chain/1.1/commons-chain-1.1.jar
Downloaded: http://repo.maven.apache.org/maven2/org/apache/maven/doxia/doxia-site-renderer/1.4/doxia-site-renderer-1.4.jar
(52 KB at 996.9 KB/sec)
Downloading: http://repo.maven.apache.org/maven2/commons-validator/commons-validator/1.3.1/commons-validator-1.3.1.jar
Downloaded: http://repo.maven.apache.org/maven2/javax/servlet/servlet-api/2.5/servlet-api-2.5.jar
(103 KB at 1368.6 KB/sec)
Downloading: http://repo.maven.apache.org/maven2/dom4j/dom4j/1.1/dom4j-1.1.jar
Downloaded: http://repo.maven.apache.org/maven2/commons-chain/commons-chain/1.1/commons-chain-1.1.jar
(88 KB at 1156.5 KB/sec)
Downloading: http://repo.maven.apache.org/maven2/sslext/sslext/1.2-0/sslext-1.2-0.jar
Downloaded: http://repo.maven.apache.org/maven2/commons-digester/commons-digester/1.8/commons-digester-1.8.jar
(141 KB at 1310.6 KB/sec)
Downloading: http://repo.maven.apache.org/maven2/org/apache/struts/struts-core/1.3.8/struts-core-1.3.8.jar
Downloaded: http://repo.maven.apache.org/maven2/commons-validator/commons-validator/1.3.1/commons-validator-1.3.1.jar
(136 KB at 1785.5 KB/sec)
Downloading: http://repo.maven.apache.org/maven2/antlr/antlr/2.7.2/antlr-2.7.2.jar
Downloaded: http://repo.maven.apache.org/maven2/org/apache/velocity/velocity-tools/2.0/velocity-tools-2.0.jar
(339 KB at 2197.8 KB/sec)
Downloading: http://repo.maven.apache.org/maven2/org/apache/struts/struts-taglib/1.3.8/struts-taglib-1.3.8.jar
Downloaded: http://repo.maven.apache.org/maven2/sslext/sslext/1.2-0/sslext-1.2-0.jar (26 KB
at 483.0 KB/sec)
Downloading: http://repo.maven.apache.org/maven2/org/apache/struts/struts-tiles/1.3.8/struts-tiles-1.3.8.jar
Downloaded: http://repo.maven.apache.org/maven2/dom4j/dom4j/1.1/dom4j-1.1.jar (447 KB at 2324.0
KB/sec)
Downloading: http://repo.maven.apache.org/maven2/org/apache/maven/doxia/doxia-integration-tools/1.5/doxia-integration-tools-1.5.jar
Downloaded: http://repo.maven.apache.org/maven2/antlr/antlr/2.7.2/antlr-2.7.2.jar (350 KB
at 2867.8 KB/sec)
Downloading: http://repo.maven.apache.org/maven2/org/codehaus/plexus/plexus-archiver/1.0/plexus-archiver-1.0.jar
Downloaded: http://repo.maven.apache.org/maven2/org/apache/struts/struts-tiles/1.3.8/struts-tiles-1.3.8.jar
(117 KB at 1479.1 KB/sec)
Downloading: http://repo.maven.apache.org/maven2/org/codehaus/plexus/plexus-io/1.0/plexus-io-1.0.jar
Downloaded: http://repo.maven.apache.org/maven2/org/apache/struts/struts-taglib/1.3.8/struts-taglib-1.3.8.jar
(246 KB at 2317.2 KB/sec)
Downloading: http://repo.maven.apache.org/maven2/org/codehaus/plexus/plexus-velocity/1.1.8/plexus-velocity-1.1.8.jar
Downloaded: http://repo.maven.apache.org/maven2/org/apache/struts/struts-core/1.3.8/struts-core-1.3.8.jar
(322 KB at 2072.2 KB/sec)
Downloading: http://repo.maven.apache.org/maven2/org/codehaus/plexus/plexus-utils/1.5.10/plexus-utils-1.5.10.jar
Downloaded: http://repo.maven.apache.org/maven2/org/apache/maven/doxia/doxia-integration-tools/1.5/doxia-integration-tools-1.5.jar
(45 KB at 847.1 KB/sec)
Downloading: http://repo.maven.apache.org/maven2/org/mortbay/jetty/jetty/6.1.25/jetty-6.1.25.jar
Downloaded: http://repo.maven.apache.org/maven2/org/codehaus/plexus/plexus-io/1.0/plexus-io-1.0.jar
(50 KB at 886.0 KB/sec)
Downloading: http://repo.maven.apache.org/maven2/org/mortbay/jetty/servlet-api/2.5-20081211/servlet-api-2.5-20081211.jar
Downloaded: http://repo.maven.apache.org/maven2/org/codehaus/plexus/plexus-velocity/1.1.8/plexus-velocity-1.1.8.jar
(8 KB at 142.6 KB/sec)
Downloading: http://repo.maven.apache.org/maven2/org/mortbay/jetty/jetty-util/6.1.25/jetty-util-6.1.25.jar
Downloaded: http://repo.maven.apache.org/maven2/org/codehaus/plexus/plexus-archiver/1.0/plexus-archiver-1.0.jar
(174 KB at 2162.6 KB/sec)
Downloading: http://repo.maven.apache.org/maven2/commons-lang/commons-lang/2.5/commons-lang-2.5.jar
Downloaded: http://repo.maven.apache.org/maven2/org/codehaus/plexus/plexus-utils/1.5.10/plexus-utils-1.5.10.jar
(274 KB at 2767.1 KB/sec)
Downloaded: http://repo.maven.apache.org/maven2/org/mortbay/jetty/servlet-api/2.5-20081211/servlet-api-2.5-20081211.jar
(131 KB at 1617.2 KB/sec)
Downloaded: http://repo.maven.apache.org/maven2/org/mortbay/jetty/jetty-util/6.1.25/jetty-util-6.1.25.jar
(174 KB at 2136.1 KB/sec)
Downloaded: http://repo.maven.apache.org/maven2/commons-lang/commons-lang/2.5/commons-lang-2.5.jar
(273 KB at 2647.1 KB/sec)
Downloaded: http://repo.maven.apache.org/maven2/org/mortbay/jetty/jetty/6.1.25/jetty-6.1.25.jar
(526 KB at 3652.5 KB/sec)
[INFO] 
[INFO] --- maven-install-plugin:2.5.1:install (default-install) @ wss4j ---
Downloading: http://repo.maven.apache.org/maven2/commons-codec/commons-codec/1.6/commons-codec-1.6.pom
Downloaded: http://repo.maven.apache.org/maven2/commons-codec/commons-codec/1.6/commons-codec-1.6.pom
(11 KB at 209.5 KB/sec)
Downloading: http://repo.maven.apache.org/maven2/org/apache/maven/shared/maven-shared-utils/0.4/maven-shared-utils-0.4.pom
Downloaded: http://repo.maven.apache.org/maven2/org/apache/maven/shared/maven-shared-utils/0.4/maven-shared-utils-0.4.pom
(4 KB at 74.6 KB/sec)
Downloading: http://repo.maven.apache.org/maven2/org/codehaus/plexus/plexus-utils/3.0.15/plexus-utils-3.0.15.pom
Downloaded: http://repo.maven.apache.org/maven2/org/codehaus/plexus/plexus-utils/3.0.15/plexus-utils-3.0.15.pom
(4 KB at 58.0 KB/sec)
Downloading: http://repo.maven.apache.org/maven2/commons-codec/commons-codec/1.6/commons-codec-1.6.jar
Downloading: http://repo.maven.apache.org/maven2/org/apache/maven/shared/maven-shared-utils/0.4/maven-shared-utils-0.4.jar
Downloading: http://repo.maven.apache.org/maven2/org/codehaus/plexus/plexus-utils/3.0.15/plexus-utils-3.0.15.jar
Downloaded: http://repo.maven.apache.org/maven2/commons-codec/commons-codec/1.6/commons-codec-1.6.jar
(228 KB at 2952.1 KB/sec)
Downloaded: http://repo.maven.apache.org/maven2/org/apache/maven/shared/maven-shared-utils/0.4/maven-shared-utils-0.4.jar
(152 KB at 1921.6 KB/sec)
Downloaded: http://repo.maven.apache.org/maven2/org/codehaus/plexus/plexus-utils/3.0.15/plexus-utils-3.0.15.jar
(234 KB at 2243.8 KB/sec)
[INFO] Installing <https://builds.apache.org/job/wss4j-1.6/ws/wss4j/target/wss4j-1.6.17-SNAPSHOT.jar>
to <https://builds.apache.org/job/wss4j-1.6/ws/.repository/org/apache/ws/security/wss4j/1.6.17-SNAPSHOT/wss4j-1.6.17-SNAPSHOT.jar>
[INFO] Installing <https://builds.apache.org/job/wss4j-1.6/ws/wss4j/pom.xml> to <https://builds.apache.org/job/wss4j-1.6/ws/.repository/org/apache/ws/security/wss4j/1.6.17-SNAPSHOT/wss4j-1.6.17-SNAPSHOT.pom>
[INFO] 
[INFO] --- maven-bundle-plugin:2.4.0:install (default-install) @ wss4j ---
[INFO] Writing OBR metadata
[INFO] Installing org/apache/ws/security/wss4j/1.6.17-SNAPSHOT/wss4j-1.6.17-SNAPSHOT.jar
[INFO] Writing OBR metadata
[INFO] 
[INFO] --- maven-deploy-plugin:2.8.1:deploy (default-deploy) @ wss4j ---
Downloading: https://repository.apache.org/content/repositories/snapshots/org/apache/ws/security/wss4j/1.6.17-SNAPSHOT/maven-metadata.xml
Downloaded: https://repository.apache.org/content/repositories/snapshots/org/apache/ws/security/wss4j/1.6.17-SNAPSHOT/maven-metadata.xml
(780 B at 0.0 KB/sec)
Uploading: https://repository.apache.org/content/repositories/snapshots/org/apache/ws/security/wss4j/1.6.17-SNAPSHOT/wss4j-1.6.17-20140825.093654-7.jar
[WARNING] Failed to upload SHA-1 checksum for <https://builds.apache.org/job/wss4j-1.6/ws/wss4j/target/wss4j-1.6.17-SNAPSHOT.jar>:
Failed to transfer file: https://repository.apache.org/content/repositories/snapshots/org/apache/ws/security/wss4j/1.6.17-SNAPSHOT/wss4j-1.6.17-20140825.093654-7.jar.sha1.
Return code is: 502, ReasonPhrase: Proxy Error.
org.apache.maven.wagon.TransferFailedException: Failed to transfer file: https://repository.apache.org/content/repositories/snapshots/org/apache/ws/security/wss4j/1.6.17-SNAPSHOT/wss4j-1.6.17-20140825.093654-7.jar.sha1.
Return code is: 502, ReasonPhrase: Proxy Error.
	at org.apache.maven.wagon.shared.http4.AbstractHttpClientWagon.put(AbstractHttpClientWagon.java:626)
	at org.apache.maven.wagon.shared.http4.AbstractHttpClientWagon.put(AbstractHttpClientWagon.java:524)
	at org.apache.maven.wagon.shared.http4.AbstractHttpClientWagon.put(AbstractHttpClientWagon.java:505)
	at org.apache.maven.wagon.shared.http4.AbstractHttpClientWagon.putFromStream(AbstractHttpClientWagon.java:499)
	at org.sonatype.aether.connector.wagon.WagonRepositoryConnector$PutTask.uploadChecksum(WagonRepositoryConnector.java:886)
	at org.sonatype.aether.connector.wagon.WagonRepositoryConnector$PutTask.uploadChecksums(WagonRepositoryConnector.java:861)
	at org.sonatype.aether.connector.wagon.WagonRepositoryConnector$PutTask.run(WagonRepositoryConnector.java:818)
	at org.sonatype.aether.connector.wagon.WagonRepositoryConnector.put(WagonRepositoryConnector.java:467)
	at org.sonatype.aether.impl.internal.DefaultDeployer.deploy(DefaultDeployer.java:274)
	at org.sonatype.aether.impl.internal.DefaultDeployer.deploy(DefaultDeployer.java:211)
	at org.sonatype.aether.impl.internal.DefaultRepositorySystem.deploy(DefaultRepositorySystem.java:443)
	at org.apache.maven.artifact.deployer.DefaultArtifactDeployer.deploy(DefaultArtifactDeployer.java:137)
	at org.apache.maven.plugin.deploy.AbstractDeployMojo.deploy(AbstractDeployMojo.java:171)
	at org.apache.maven.plugin.deploy.DeployMojo.deployProject(DeployMojo.java:248)
	at org.apache.maven.plugin.deploy.DeployMojo.execute(DeployMojo.java:169)
	at org.apache.maven.plugin.DefaultBuildPluginManager.executeMojo(DefaultBuildPluginManager.java:101)
	at org.apache.maven.lifecycle.internal.MojoExecutor.execute(MojoExecutor.java:209)
	at org.apache.maven.lifecycle.internal.MojoExecutor.execute(MojoExecutor.java:153)
	at org.apache.maven.lifecycle.internal.MojoExecutor.execute(MojoExecutor.java:145)
	at org.apache.maven.lifecycle.internal.LifecycleModuleBuilder.buildProject(LifecycleModuleBuilder.java:84)
	at org.apache.maven.lifecycle.internal.LifecycleModuleBuilder.buildProject(LifecycleModuleBuilder.java:59)
	at org.apache.maven.lifecycle.internal.LifecycleStarter.singleThreadedBuild(LifecycleStarter.java:183)
	at org.apache.maven.lifecycle.internal.LifecycleStarter.execute(LifecycleStarter.java:161)
	at org.apache.maven.DefaultMaven.doExecute(DefaultMaven.java:320)
	at org.apache.maven.DefaultMaven.execute(DefaultMaven.java:156)
	at org.jvnet.hudson.maven3.launcher.Maven3Launcher.main(Maven3Launcher.java:117)
	at sun.reflect.NativeMethodAccessorImpl.invoke0(Native Method)
	at sun.reflect.NativeMethodAccessorImpl.invoke(NativeMethodAccessorImpl.java:39)
	at sun.reflect.DelegatingMethodAccessorImpl.invoke(DelegatingMethodAccessorImpl.java:25)
	at java.lang.reflect.Method.invoke(Method.java:597)
	at org.codehaus.plexus.classworlds.launcher.Launcher.launchStandard(Launcher.java:329)
	at org.codehaus.plexus.classworlds.launcher.Launcher.launch(Launcher.java:239)
	at org.jvnet.hudson.maven3.agent.Maven3Main.launch(Maven3Main.java:178)
	at sun.reflect.NativeMethodAccessorImpl.invoke0(Native Method)
	at sun.reflect.NativeMethodAccessorImpl.invoke(NativeMethodAccessorImpl.java:39)
	at sun.reflect.DelegatingMethodAccessorImpl.invoke(DelegatingMethodAccessorImpl.java:25)
	at java.lang.reflect.Method.invoke(Method.java:597)
	at hudson.maven.Maven3Builder.call(Maven3Builder.java:134)
	at hudson.maven.Maven3Builder.call(Maven3Builder.java:69)
	at hudson.remoting.UserRequest.perform(UserRequest.java:118)
	at hudson.remoting.UserRequest.perform(UserRequest.java:48)
	at hudson.remoting.Request$2.run(Request.java:328)
	at hudson.remoting.InterceptingExecutorService$1.call(InterceptingExecutorService.java:72)
	at java.util.concurrent.FutureTask$Sync.innerRun(FutureTask.java:303)
	at java.util.concurrent.FutureTask.run(FutureTask.java:138)
	at java.util.concurrent.ThreadPoolExecutor$Worker.runTask(ThreadPoolExecutor.java:886)
	at java.util.concurrent.ThreadPoolExecutor$Worker.run(ThreadPoolExecutor.java:908)
	at java.lang.Thread.run(Thread.java:619)
[WARNING] Failed to upload MD5 checksum for <https://builds.apache.org/job/wss4j-1.6/ws/wss4j/target/wss4j-1.6.17-SNAPSHOT.jar>:
Failed to transfer file: https://repository.apache.org/content/repositories/snapshots/org/apache/ws/security/wss4j/1.6.17-SNAPSHOT/wss4j-1.6.17-20140825.093654-7.jar.md5.
Return code is: 502, ReasonPhrase: Proxy Error.
org.apache.maven.wagon.TransferFailedException: Failed to transfer file: https://repository.apache.org/content/repositories/snapshots/org/apache/ws/security/wss4j/1.6.17-SNAPSHOT/wss4j-1.6.17-20140825.093654-7.jar.md5.
Return code is: 502, ReasonPhrase: Proxy Error.
	at org.apache.maven.wagon.shared.http4.AbstractHttpClientWagon.put(AbstractHttpClientWagon.java:626)
	at org.apache.maven.wagon.shared.http4.AbstractHttpClientWagon.put(AbstractHttpClientWagon.java:524)
	at org.apache.maven.wagon.shared.http4.AbstractHttpClientWagon.put(AbstractHttpClientWagon.java:505)
	at org.apache.maven.wagon.shared.http4.AbstractHttpClientWagon.putFromStream(AbstractHttpClientWagon.java:499)
	at org.sonatype.aether.connector.wagon.WagonRepositoryConnector$PutTask.uploadChecksum(WagonRepositoryConnector.java:886)
	at org.sonatype.aether.connector.wagon.WagonRepositoryConnector$PutTask.uploadChecksums(WagonRepositoryConnector.java:861)
	at org.sonatype.aether.connector.wagon.WagonRepositoryConnector$PutTask.run(WagonRepositoryConnector.java:818)
	at org.sonatype.aether.connector.wagon.WagonRepositoryConnector.put(WagonRepositoryConnector.java:467)
	at org.sonatype.aether.impl.internal.DefaultDeployer.deploy(DefaultDeployer.java:274)
	at org.sonatype.aether.impl.internal.DefaultDeployer.deploy(DefaultDeployer.java:211)
	at org.sonatype.aether.impl.internal.DefaultRepositorySystem.deploy(DefaultRepositorySystem.java:443)
	at org.apache.maven.artifact.deployer.DefaultArtifactDeployer.deploy(DefaultArtifactDeployer.java:137)
	at org.apache.maven.plugin.deploy.AbstractDeployMojo.deploy(AbstractDeployMojo.java:171)
	at org.apache.maven.plugin.deploy.DeployMojo.deployProject(DeployMojo.java:248)
	at org.apache.maven.plugin.deploy.DeployMojo.execute(DeployMojo.java:169)
	at org.apache.maven.plugin.DefaultBuildPluginManager.executeMojo(DefaultBuildPluginManager.java:101)
	at org.apache.maven.lifecycle.internal.MojoExecutor.execute(MojoExecutor.java:209)
	at org.apache.maven.lifecycle.internal.MojoExecutor.execute(MojoExecutor.java:153)
	at org.apache.maven.lifecycle.internal.MojoExecutor.execute(MojoExecutor.java:145)
	at org.apache.maven.lifecycle.internal.LifecycleModuleBuilder.buildProject(LifecycleModuleBuilder.java:84)
	at org.apache.maven.lifecycle.internal.LifecycleModuleBuilder.buildProject(LifecycleModuleBuilder.java:59)
	at org.apache.maven.lifecycle.internal.LifecycleStarter.singleThreadedBuild(LifecycleStarter.java:183)
	at org.apache.maven.lifecycle.internal.LifecycleStarter.execute(LifecycleStarter.java:161)
	at org.apache.maven.DefaultMaven.doExecute(DefaultMaven.java:320)
	at org.apache.maven.DefaultMaven.execute(DefaultMaven.java:156)
	at org.jvnet.hudson.maven3.launcher.Maven3Launcher.main(Maven3Launcher.java:117)
	at sun.reflect.NativeMethodAccessorImpl.invoke0(Native Method)
	at sun.reflect.NativeMethodAccessorImpl.invoke(NativeMethodAccessorImpl.java:39)
	at sun.reflect.DelegatingMethodAccessorImpl.invoke(DelegatingMethodAccessorImpl.java:25)
	at java.lang.reflect.Method.invoke(Method.java:597)
	at org.codehaus.plexus.classworlds.launcher.Launcher.launchStandard(Launcher.java:329)
	at org.codehaus.plexus.classworlds.launcher.Launcher.launch(Launcher.java:239)
	at org.jvnet.hudson.maven3.agent.Maven3Main.launch(Maven3Main.java:178)
	at sun.reflect.NativeMethodAccessorImpl.invoke0(Native Method)
	at sun.reflect.NativeMethodAccessorImpl.invoke(NativeMethodAccessorImpl.java:39)
	at sun.reflect.DelegatingMethodAccessorImpl.invoke(DelegatingMethodAccessorImpl.java:25)
	at java.lang.reflect.Method.invoke(Method.java:597)
	at hudson.maven.Maven3Builder.call(Maven3Builder.java:134)
	at hudson.maven.Maven3Builder.call(Maven3Builder.java:69)
	at hudson.remoting.UserRequest.perform(UserRequest.java:118)
	at hudson.remoting.UserRequest.perform(UserRequest.java:48)
	at hudson.remoting.Request$2.run(Request.java:328)
	at hudson.remoting.InterceptingExecutorService$1.call(InterceptingExecutorService.java:72)
	at java.util.concurrent.FutureTask$Sync.innerRun(FutureTask.java:303)
	at java.util.concurrent.FutureTask.run(FutureTask.java:138)
	at java.util.concurrent.ThreadPoolExecutor$Worker.runTask(ThreadPoolExecutor.java:886)
	at java.util.concurrent.ThreadPoolExecutor$Worker.run(ThreadPoolExecutor.java:908)
	at java.lang.Thread.run(Thread.java:619)
Uploaded: https://repository.apache.org/content/repositories/snapshots/org/apache/ws/security/wss4j/1.6.17-SNAPSHOT/wss4j-1.6.17-20140825.093654-7.jar
(447 KB at 3.3 KB/sec)
Uploading: https://repository.apache.org/content/repositories/snapshots/org/apache/ws/security/wss4j/1.6.17-SNAPSHOT/wss4j-1.6.17-20140825.093654-7.pom
[INFO] ------------------------------------------------------------------------
[INFO] BUILD FAILURE
[INFO] ------------------------------------------------------------------------
[INFO] Total time: 6:20.373s
[INFO] Finished at: Mon Aug 25 09:40:12 UTC 2014
[INFO] Final Memory: 23M/100M
[INFO] ------------------------------------------------------------------------
Waiting for Jenkins to finish collecting data
[ERROR] Failed to execute goal org.apache.maven.plugins:maven-deploy-plugin:2.8.1:deploy (default-deploy)
on project wss4j: Failed to deploy artifacts: Could not transfer artifact org.apache.ws.security:wss4j:pom:1.6.17-20140825.093654-7
from/to apache.snapshots.https (https://repository.apache.org/content/repositories/snapshots):
Failed to transfer file: https://repository.apache.org/content/repositories/snapshots/org/apache/ws/security/wss4j/1.6.17-SNAPSHOT/wss4j-1.6.17-20140825.093654-7.pom.
Return code is: 502, ReasonPhrase: Proxy Error. -> [Help 1]
[ERROR] 
[ERROR] To see the full stack trace of the errors, re-run Maven with the -e switch.
[ERROR] Re-run Maven using the -X switch to enable full debug logging.
[ERROR] 
[ERROR] For more information about the errors and possible solutions, please read the following
articles:
[ERROR] [Help 1] http://cwiki.apache.org/confluence/display/MAVEN/MojoExecutionException
[JENKINS] Archiving <https://builds.apache.org/job/wss4j-1.6/ws/wss4j/pom.xml> to org.apache.ws.security/wss4j/1.6.17-SNAPSHOT/wss4j-1.6.17-SNAPSHOT.pom
[JENKINS] Archiving <https://builds.apache.org/job/wss4j-1.6/ws/wss4j/target/wss4j-1.6.17-SNAPSHOT.jar>
to org.apache.ws.security/wss4j/1.6.17-SNAPSHOT/wss4j-1.6.17-SNAPSHOT.jar
Sending artifact delta relative to wss4j-1.6 ? Apache WSS4J #122
Archived 2 artifacts
Archive block size is 32768
Received 0 blocks and 480822 bytes
Compression is 0.0%
Took 0.31 sec
Sending e-mails to: wss4j-dev@ws.apache.org coheigea@apache.org
channel stopped

---------------------------------------------------------------------
To unsubscribe, e-mail: dev-unsubscribe@ws.apache.org
For additional commands, e-mail: dev-help@ws.apache.org


Mime
View raw message