ws-dev mailing list archives

Site index · List index
Message view « Date » · « Thread »
Top « Date » · « Thread »
From Apache Jenkins Server <jenk...@builds.apache.org>
Subject Build failed in Jenkins: axiom-trunk #2333
Date Sat, 03 Oct 2015 12:07:18 GMT
See <https://builds.apache.org/job/axiom-trunk/2333/changes>

Changes:

[veithen] Further decouple fom-impl from the Axiom API.

------------------------------------------
[...truncated 11154 lines...]
[INFO] Compiling 1 source file to <https://builds.apache.org/job/axiom-trunk/ws/axiom/systests/jboss-tests/target/test-classes>
[INFO] 
[INFO] --- maven-surefire-plugin:2.16:test (default-test) @ jboss-tests ---
[INFO] Surefire report directory: <https://builds.apache.org/job/axiom-trunk/ws/axiom/systests/jboss-tests/target/surefire-reports>

-------------------------------------------------------
 T E S T S
-------------------------------------------------------
Running org.apache.axiom.systest.jboss.DialectTest
log4j:WARN No appenders could be found for logger (org.jboss.logging).
log4j:WARN Please initialize the log4j system properly.
Oct 03, 2015 12:07:24 PM org.jboss.as.arquillian.container.managed.ManagedDeployableContainer
startInternal
INFO: Starting container with: [/home/jenkins/tools/java/latest1.7/bin/java, -Ddummy, -javaagent:<https://builds.apache.org/job/axiom-trunk/ws/.repository/org/jacoco/org.jacoco.agent/0.6.3.201306030806/org.jacoco.agent-0.6.3.201306030806-runtime.jar=destfile=/home/jenkins/jenkins-slave/workspace/axiom-trunk/axiom/systests/jboss-tests/target/jacoco.exec,sessionid=mvn>:org.apache.ws.commons.axiom:jboss-tests:1.2.16-SNAPSHOT:jboss,
-Djboss.management.native.port=34230, -ea, -Djboss.home.dir=<https://builds.apache.org/job/axiom-trunk/ws/axiom/systests/jboss-tests/target/jboss-as-7.1.1.Final,>
-Dorg.jboss.boot.log.file=<https://builds.apache.org/job/axiom-trunk/ws/axiom/systests/jboss-tests/target/jboss-as-7.1.1.Final/standalone/log/boot.log,>
-Dlogging.configuration=<https://builds.apache.org/job/axiom-trunk/ws/axiom/systests/jboss-tests/target/jboss-as-7.1.1.Final/standalone/configuration/logging.properties,>
-Djboss.modules.dir=<https://builds.apache.org/job/axiom-trunk/ws/axiom/systests/jboss-tests/target/jboss-as-7.1.1.Final/modules,>
-Djboss.bundles.dir=<https://builds.apache.org/job/axiom-trunk/ws/axiom/systests/jboss-tests/target/jboss-as-7.1.1.Final/bundles,>
-jar, <https://builds.apache.org/job/axiom-trunk/ws/axiom/systests/jboss-tests/target/jboss-as-7.1.1.Final/jboss-modules.jar,>
-mp, <https://builds.apache.org/job/axiom-trunk/ws/axiom/systests/jboss-tests/target/jboss-as-7.1.1.Final/modules,>
-jaxpmodule, javax.xml.jaxp-provider, org.jboss.as.standalone, -server-config, standalone.xml]
#
# A fatal error has been detected by the Java Runtime Environment:
#
#  SIGSEGV (0xb) at pc=0xeb61d52c, pid=10483, tid=4136946496
#
# JRE version: 7.0_25-b15
# Java VM: Java HotSpot(TM) Server VM (23.25-b01 mixed mode linux-x86 )
# Problematic frame:
*** Error in `/home/jenkins/tools/java/jdk1.7.0_25-32/jre/bin/java': malloc(): memory corruption:
0xe7b435b8 ***
Aborted
# C  [libnet.so+0x352c]

Results :

Tests run: 0, Failures: 0, Errors: 0, Skipped: 0

[JENKINS] Recording test results
[INFO] ------------------------------------------------------------------------
[INFO] Reactor Summary:
[INFO] 
[INFO] Axiom .............................................. SUCCESS [  9.364 s]
[INFO] Build utilities .................................... SUCCESS [  3.783 s]
[INFO] JAR Resource Bundle ................................ SUCCESS [  5.257 s]
[INFO] Resource Transformer for META-INF/axiom.xml files .. SUCCESS [  7.462 s]
[INFO] Resource Transformer for OSGi Manifests ............ SUCCESS [ 13.496 s]
[INFO] Testing ............................................ SUCCESS [  4.106 s]
[INFO] Multiton pattern implementation .................... SUCCESS [  5.990 s]
[INFO] Axiom Test Utilities ............................... SUCCESS [ 16.421 s]
[INFO] XML Test Suite ..................................... SUCCESS [ 10.871 s]
[INFO] Google Truth extension for XML ..................... SUCCESS [ 13.976 s]
[INFO] SOAP Test Suite .................................... SUCCESS [ 17.837 s]
[INFO] Axiom API .......................................... SUCCESS [01:32 min]
[INFO] Aspects ............................................ SUCCESS [  6.036 s]
[INFO] Core Aspects ....................................... SUCCESS [ 12.870 s]
[INFO] Shared Aspects ..................................... SUCCESS [  6.072 s]
[INFO] OM Aspects ......................................... SUCCESS [ 30.643 s]
[INFO] Google Truth extension for Axiom ................... SUCCESS [  7.187 s]
[INFO] Jaxen Test Suite ................................... SUCCESS [  9.340 s]
[INFO] Axiom Implementation Test Suite .................... SUCCESS [ 32.085 s]
[INFO] Implementations .................................... SUCCESS [  3.640 s]
[INFO] LLOM ............................................... SUCCESS [02:28 min]
[INFO] DOM Aspects ........................................ SUCCESS [  9.276 s]
[INFO] DOM Test Suite ..................................... SUCCESS [01:04 min]
[INFO] DOOM ............................................... SUCCESS [03:36 min]
[INFO] Axiom Compatibility Classes ........................ SUCCESS [ 13.391 s]
[INFO] Axiom JAXB Integration ............................. SUCCESS [ 12.375 s]
[INFO] Axiom C14N ......................................... SUCCESS [01:33 min]
[INFO] Axiom Uber-JAR ..................................... SUCCESS [  2.612 s]
[INFO] Samples ............................................ SUCCESS [  7.773 s]
[INFO] System Tests ....................................... SUCCESS [  1.417 s]
[INFO] Cross OM Tests ..................................... SUCCESS [  4.042 s]
[INFO] Eclipse Tests ...................................... SUCCESS [ 21.766 s]
[INFO] Axiom Integration Test Suite ....................... SUCCESS [  9.027 s]
[INFO] JBoss Tests ........................................ FAILURE [  9.390 s]
[INFO] Axiom Test Suite (old) ............................. SKIPPED
[INFO] Axiom OSGi Tests ................................... SKIPPED
[INFO] Spring-WS Test Suite ............................... SKIPPED
[INFO] Spring WS Tests .................................... SKIPPED
[INFO] WSS4J Tests ........................................ SKIPPED
[INFO] Developer Guide .................................... SKIPPED
[INFO] User Guide ......................................... SKIPPED
[INFO] Javadoc ............................................ SKIPPED
[INFO] Distribution ....................................... SKIPPED
[INFO] FOM Aspects ........................................ SKIPPED
[INFO] fom-testsuite ...................................... SKIPPED
[INFO] Abdera Model (FOM) Implementation .................. SKIPPED
[INFO] Code Coverage Report ............................... SKIPPED
[INFO] SAAJ Test Suite .................................... SKIPPED
[INFO] ------------------------------------------------------------------------
[INFO] BUILD FAILURE
[INFO] ------------------------------------------------------------------------
[INFO] Total time: 15:59 min
[INFO] Finished at: 2015-10-03T12:07:35+00:00
[INFO] Final Memory: 123M/241M
[INFO] ------------------------------------------------------------------------
[ERROR] Failed to execute goal org.apache.maven.plugins:maven-surefire-plugin:2.16:test (default-test)
on project jboss-tests: Execution default-test of goal org.apache.maven.plugins:maven-surefire-plugin:2.16:test
failed: The forked VM terminated without saying properly goodbye. VM crash or System.exit
called ?
[ERROR] Command was/bin/sh -c cd <https://builds.apache.org/job/axiom-trunk/ws/axiom/systests/jboss-tests>
&& /home/jenkins/tools/java/jdk1.7.0_25-32/jre/bin/java -Xms16m -Xmx48m -javaagent:<https://builds.apache.org/job/axiom-trunk/ws/.repository/org/jacoco/org.jacoco.agent/0.6.3.201306030806/org.jacoco.agent-0.6.3.201306030806-runtime.jar=destfile=/home/jenkins/jenkins-slave/workspace/axiom-trunk/axiom/systests/jboss-tests/target/jacoco.exec,sessionid=mvn>:org.apache.ws.commons.axiom:jboss-tests:1.2.16-SNAPSHOT:surefire
-jar <https://builds.apache.org/job/axiom-trunk/ws/axiom/systests/jboss-tests/target/surefire/surefirebooter8000004132657194225.jar>
<https://builds.apache.org/job/axiom-trunk/ws/axiom/systests/jboss-tests/target/surefire/surefire1845201728507567853tmp>
<https://builds.apache.org/job/axiom-trunk/ws/axiom/systests/jboss-tests/target/surefire/surefire_87029033640047703266tmp>
[ERROR] -> [Help 1]
[ERROR] 
[ERROR] To see the full stack trace of the errors, re-run Maven with the -e switch.
[ERROR] Re-run Maven using the -X switch to enable full debug logging.
[ERROR] 
[ERROR] For more information about the errors and possible solutions, please read the following
articles:
[ERROR] [Help 1] http://cwiki.apache.org/confluence/display/MAVEN/PluginExecutionException
[ERROR] 
[ERROR] After correcting the problems, you can resume the build with the command
[ERROR]   mvn <goals> -rf :jboss-tests
[JENKINS] Archiving <https://builds.apache.org/job/axiom-trunk/ws/axiom/axiom-compat/pom.xml>
to org.apache.ws.commons.axiom/axiom-compat/1.2.16-SNAPSHOT/axiom-compat-1.2.16-SNAPSHOT.pom
[JENKINS] Archiving <https://builds.apache.org/job/axiom-trunk/ws/axiom/axiom-compat/target/axiom-compat-1.2.16-SNAPSHOT.jar>
to org.apache.ws.commons.axiom/axiom-compat/1.2.16-20151003.120432-212/axiom-compat-1.2.16-20151003.120432-212.jar
[JENKINS] Archiving <https://builds.apache.org/job/axiom-trunk/ws/axiom/axiom-compat/target/jacoco.exec>
to org.apache.ws.commons.axiom/axiom-compat/1.2.16-20151003.120432-212/axiom-compat-1.2.16-20151003.120432-212-jacoco.exec
[JENKINS] Archiving <https://builds.apache.org/job/axiom-trunk/ws/axiom/axiom-compat/target/axiom-compat-1.2.16-SNAPSHOT-sources.jar>
to org.apache.ws.commons.axiom/axiom-compat/1.2.16-20151003.120432-212/axiom-compat-1.2.16-20151003.120432-212-sources.jar
[JENKINS] Archiving <https://builds.apache.org/job/axiom-trunk/ws/axiom/axiom-compat/target/axiom-compat-1.2.16-SNAPSHOT-javadoc.jar>
to org.apache.ws.commons.axiom/axiom-compat/1.2.16-20151003.120432-212/axiom-compat-1.2.16-20151003.120432-212-javadoc.jar
[JENKINS] Archiving <https://builds.apache.org/job/axiom-trunk/ws/axiom/systests/wss4j-tests/pom.xml>
to org.apache.ws.commons.axiom/wss4j-tests/1.2.16-SNAPSHOT/wss4j-tests-1.2.16-SNAPSHOT.pom
[JENKINS] Archiving <https://builds.apache.org/job/axiom-trunk/ws/axiom/aspects/pom.xml>
to org.apache.ws.commons.axiom/aspects/1.2.16-SNAPSHOT/aspects-1.2.16-SNAPSHOT.pom
[JENKINS] Archiving <https://builds.apache.org/job/axiom-trunk/ws/axiom/implementations/fom-impl/pom.xml>
to org.apache.ws.commons.axiom/fom-impl/1.2.16-SNAPSHOT/fom-impl-1.2.16-SNAPSHOT.pom
[JENKINS] Archiving <https://builds.apache.org/job/axiom-trunk/ws/axiom/implementations/axiom-impl/pom.xml>
to org.apache.ws.commons.axiom/axiom-impl/1.2.16-SNAPSHOT/axiom-impl-1.2.16-SNAPSHOT.pom
[JENKINS] Archiving <https://builds.apache.org/job/axiom-trunk/ws/axiom/implementations/axiom-impl/target/axiom-impl-1.2.16-SNAPSHOT.jar>
to org.apache.ws.commons.axiom/axiom-impl/1.2.16-20151003.115926-213/axiom-impl-1.2.16-20151003.115926-213.jar
[JENKINS] Archiving <https://builds.apache.org/job/axiom-trunk/ws/axiom/implementations/axiom-impl/target/axiom-impl-1.2.16-SNAPSHOT-sources.jar>
to org.apache.ws.commons.axiom/axiom-impl/1.2.16-20151003.115926-213/axiom-impl-1.2.16-20151003.115926-213-sources.jar
[JENKINS] Archiving <https://builds.apache.org/job/axiom-trunk/ws/axiom/implementations/axiom-impl/target/jacoco.exec>
to org.apache.ws.commons.axiom/axiom-impl/1.2.16-20151003.115926-213/axiom-impl-1.2.16-20151003.115926-213-jacoco.exec
[JENKINS] Archiving <https://builds.apache.org/job/axiom-trunk/ws/axiom/implementations/axiom-impl/target/axiom-impl-1.2.16-SNAPSHOT-javadoc.jar>
to org.apache.ws.commons.axiom/axiom-impl/1.2.16-20151003.115926-213/axiom-impl-1.2.16-20151003.115926-213-javadoc.jar
[JENKINS] Archiving <https://builds.apache.org/job/axiom-trunk/ws/axiom/aspects/om-aspects/pom.xml>
to org.apache.ws.commons.axiom/om-aspects/1.2.16-SNAPSHOT/om-aspects-1.2.16-SNAPSHOT.pom
[JENKINS] Archiving <https://builds.apache.org/job/axiom-trunk/ws/axiom/aspects/om-aspects/target/om-aspects-1.2.16-SNAPSHOT.jar>
to org.apache.ws.commons.axiom/om-aspects/1.2.16-20151003.115601-213/om-aspects-1.2.16-20151003.115601-213.jar
[JENKINS] Archiving <https://builds.apache.org/job/axiom-trunk/ws/axiom/aspects/om-aspects/target/jacoco.exec>
to org.apache.ws.commons.axiom/om-aspects/1.2.16-20151003.115601-213/om-aspects-1.2.16-20151003.115601-213-jacoco.exec
[JENKINS] Archiving <https://builds.apache.org/job/axiom-trunk/ws/axiom/aspects/om-aspects/target/om-aspects-1.2.16-SNAPSHOT-sources.jar>
to org.apache.ws.commons.axiom/om-aspects/1.2.16-20151003.115601-213/om-aspects-1.2.16-20151003.115601-213-sources.jar
[JENKINS] Archiving <https://builds.apache.org/job/axiom-trunk/ws/axiom/aspects/om-aspects/target/om-aspects-1.2.16-SNAPSHOT-javadoc.jar>
to org.apache.ws.commons.axiom/om-aspects/1.2.16-20151003.115601-213/om-aspects-1.2.16-20151003.115601-213-javadoc.jar
Compressed 1.44 MB of artifacts by 36.8% relative to #2332
[JENKINS] Archiving <https://builds.apache.org/job/axiom-trunk/ws/axiom/axiom-jaxb/pom.xml>
to org.apache.ws.commons.axiom/axiom-jaxb/1.2.16-SNAPSHOT/axiom-jaxb-1.2.16-SNAPSHOT.pom
[JENKINS] Archiving <https://builds.apache.org/job/axiom-trunk/ws/axiom/axiom-jaxb/target/axiom-jaxb-1.2.16-SNAPSHOT.jar>
to org.apache.ws.commons.axiom/axiom-jaxb/1.2.16-20151003.120446-212/axiom-jaxb-1.2.16-20151003.120446-212.jar
[JENKINS] Archiving <https://builds.apache.org/job/axiom-trunk/ws/axiom/axiom-jaxb/target/jacoco.exec>
to org.apache.ws.commons.axiom/axiom-jaxb/1.2.16-20151003.120446-212/axiom-jaxb-1.2.16-20151003.120446-212-jacoco.exec
[JENKINS] Archiving <https://builds.apache.org/job/axiom-trunk/ws/axiom/axiom-jaxb/target/axiom-jaxb-1.2.16-SNAPSHOT-sources.jar>
to org.apache.ws.commons.axiom/axiom-jaxb/1.2.16-20151003.120446-212/axiom-jaxb-1.2.16-20151003.120446-212-sources.jar
[JENKINS] Archiving <https://builds.apache.org/job/axiom-trunk/ws/axiom/axiom-jaxb/target/axiom-jaxb-1.2.16-SNAPSHOT-javadoc.jar>
to org.apache.ws.commons.axiom/axiom-jaxb/1.2.16-20151003.120446-212/axiom-jaxb-1.2.16-20151003.120446-212-javadoc.jar
[JENKINS] Archiving <https://builds.apache.org/job/axiom-trunk/ws/axiom/systests/integration-tests/pom.xml>
to org.apache.ws.commons.axiom/integration-tests/1.2.16-SNAPSHOT/integration-tests-1.2.16-SNAPSHOT.pom
[JENKINS] Archiving <https://builds.apache.org/job/axiom-trunk/ws/axiom/systests/integration-tests/target/integration-tests-1.2.16-SNAPSHOT.jar>
to org.apache.ws.commons.axiom/integration-tests/1.2.16-SNAPSHOT/integration-tests-1.2.16-SNAPSHOT.jar
[JENKINS] Archiving <https://builds.apache.org/job/axiom-trunk/ws/axiom/systests/integration-tests/target/jacoco.exec>
to org.apache.ws.commons.axiom/integration-tests/1.2.16-SNAPSHOT/integration-tests-1.2.16-SNAPSHOT-jacoco.exec
[JENKINS] Archiving <https://builds.apache.org/job/axiom-trunk/ws/axiom/systests/integration-tests/target/integration-tests-1.2.16-SNAPSHOT-sources.jar>
to org.apache.ws.commons.axiom/integration-tests/1.2.16-SNAPSHOT/integration-tests-1.2.16-SNAPSHOT-sources.jar
[JENKINS] Archiving <https://builds.apache.org/job/axiom-trunk/ws/axiom/buildutils/pom.xml>
to org.apache.ws.commons.axiom/buildutils/1.2.16-SNAPSHOT/buildutils-1.2.16-SNAPSHOT.pom
[JENKINS] Archiving <https://builds.apache.org/job/axiom-trunk/ws/axiom/testing/testutils/pom.xml>
to org.apache.ws.commons.axiom/testutils/1.2.16-SNAPSHOT/testutils-1.2.16-SNAPSHOT.pom
[JENKINS] Archiving <https://builds.apache.org/job/axiom-trunk/ws/axiom/testing/testutils/target/testutils-1.2.16-SNAPSHOT.jar>
to org.apache.ws.commons.axiom/testutils/1.2.16-20151003.115244-213/testutils-1.2.16-20151003.115244-213.jar
[JENKINS] Archiving <https://builds.apache.org/job/axiom-trunk/ws/axiom/testing/testutils/target/jacoco.exec>
to org.apache.ws.commons.axiom/testutils/1.2.16-20151003.115244-213/testutils-1.2.16-20151003.115244-213-jacoco.exec
[JENKINS] Archiving <https://builds.apache.org/job/axiom-trunk/ws/axiom/testing/testutils/target/testutils-1.2.16-SNAPSHOT-sources.jar>
to org.apache.ws.commons.axiom/testutils/1.2.16-20151003.115244-213/testutils-1.2.16-20151003.115244-213-sources.jar
[JENKINS] Archiving <https://builds.apache.org/job/axiom-trunk/ws/axiom/testing/testutils/target/testutils-1.2.16-SNAPSHOT-javadoc.jar>
to org.apache.ws.commons.axiom/testutils/1.2.16-20151003.115244-213/testutils-1.2.16-20151003.115244-213-javadoc.jar
[JENKINS] Archiving <https://builds.apache.org/job/axiom-trunk/ws/axiom/buildutils/shade-axiom-xml/pom.xml>
to org.apache.ws.commons.axiom/shade-axiom-xml/1.2.16-SNAPSHOT/shade-axiom-xml-1.2.16-SNAPSHOT.pom
[JENKINS] Archiving <https://builds.apache.org/job/axiom-trunk/ws/axiom/buildutils/shade-axiom-xml/target/shade-axiom-xml-1.2.16-SNAPSHOT.jar>
to org.apache.ws.commons.axiom/shade-axiom-xml/1.2.16-20151003.115203-213/shade-axiom-xml-1.2.16-20151003.115203-213.jar
[JENKINS] Archiving <https://builds.apache.org/job/axiom-trunk/ws/axiom/buildutils/shade-axiom-xml/target/shade-axiom-xml-1.2.16-SNAPSHOT-sources.jar>
to org.apache.ws.commons.axiom/shade-axiom-xml/1.2.16-20151003.115203-213/shade-axiom-xml-1.2.16-20151003.115203-213-sources.jar
[JENKINS] Archiving <https://builds.apache.org/job/axiom-trunk/ws/axiom/buildutils/shade-axiom-xml/target/shade-axiom-xml-1.2.16-SNAPSHOT-javadoc.jar>
to org.apache.ws.commons.axiom/shade-axiom-xml/1.2.16-20151003.115203-213/shade-axiom-xml-1.2.16-20151003.115203-213-javadoc.jar
[JENKINS] Archiving <https://builds.apache.org/job/axiom-trunk/ws/axiom/axiom-all/pom.xml>
to org.apache.ws.commons.axiom/axiom-all/1.2.16-SNAPSHOT/axiom-all-1.2.16-SNAPSHOT.pom
[JENKINS] Archiving <https://builds.apache.org/job/axiom-trunk/ws/axiom/axiom-all/target/axiom-all-1.2.16-SNAPSHOT.jar>
to org.apache.ws.commons.axiom/axiom-all/1.2.16-SNAPSHOT/axiom-all-1.2.16-SNAPSHOT.jar
[JENKINS] Archiving <https://builds.apache.org/job/axiom-trunk/ws/axiom/axiom-all/target/axiom-all-1.2.16-SNAPSHOT-sources.jar>
to org.apache.ws.commons.axiom/axiom-all/1.2.16-SNAPSHOT/axiom-all-1.2.16-SNAPSHOT-sources.jar
[JENKINS] Archiving <https://builds.apache.org/job/axiom-trunk/ws/axiom/systests/spring-ws-tests/pom.xml>
to org.apache.ws.commons.axiom/spring-ws-tests/1.2.16-SNAPSHOT/spring-ws-tests-1.2.16-SNAPSHOT.pom
[JENKINS] Archiving <https://builds.apache.org/job/axiom-trunk/ws/axiom/devguide/pom.xml>
to org.apache.ws.commons.axiom/devguide/1.2.16-SNAPSHOT/devguide-1.2.16-SNAPSHOT.pom
[JENKINS] Archiving <https://builds.apache.org/job/axiom-trunk/ws/axiom/implementations/pom.xml>
to org.apache.ws.commons.axiom/implementations/1.2.16-SNAPSHOT/implementations-1.2.16-SNAPSHOT.pom
[JENKINS] Archiving <https://builds.apache.org/job/axiom-trunk/ws/axiom/implementations/target/implementations-1.2.16-SNAPSHOT-site.xml>
to org.apache.ws.commons.axiom/implementations/1.2.16-20151003.115658-213/implementations-1.2.16-20151003.115658-213-site.xml
[JENKINS] Archiving <https://builds.apache.org/job/axiom-trunk/ws/axiom/implementations/axiom-dom/pom.xml>
to org.apache.ws.commons.axiom/axiom-dom/1.2.16-SNAPSHOT/axiom-dom-1.2.16-SNAPSHOT.pom
[JENKINS] Archiving <https://builds.apache.org/job/axiom-trunk/ws/axiom/implementations/axiom-dom/target/axiom-dom-1.2.16-SNAPSHOT.jar>
to org.apache.ws.commons.axiom/axiom-dom/1.2.16-20151003.120406-212/axiom-dom-1.2.16-20151003.120406-212.jar
[JENKINS] Archiving <https://builds.apache.org/job/axiom-trunk/ws/axiom/implementations/axiom-dom/target/axiom-dom-1.2.16-SNAPSHOT-sources.jar>
to org.apache.ws.commons.axiom/axiom-dom/1.2.16-20151003.120406-212/axiom-dom-1.2.16-20151003.120406-212-sources.jar
[JENKINS] Archiving <https://builds.apache.org/job/axiom-trunk/ws/axiom/implementations/axiom-dom/target/jacoco.exec>
to org.apache.ws.commons.axiom/axiom-dom/1.2.16-20151003.120406-212/axiom-dom-1.2.16-20151003.120406-212-jacoco.exec
[JENKINS] Archiving <https://builds.apache.org/job/axiom-trunk/ws/axiom/implementations/axiom-dom/target/axiom-dom-1.2.16-SNAPSHOT-javadoc.jar>
to org.apache.ws.commons.axiom/axiom-dom/1.2.16-20151003.120406-212/axiom-dom-1.2.16-20151003.120406-212-javadoc.jar
[JENKINS] Archiving <https://builds.apache.org/job/axiom-trunk/ws/axiom/samples/pom.xml>
to org.apache.ws.commons.axiom/samples/1.2.16-SNAPSHOT/samples-1.2.16-SNAPSHOT.pom
[JENKINS] Archiving <https://builds.apache.org/job/axiom-trunk/ws/axiom/samples/target/samples-1.2.16-SNAPSHOT.jar>
to org.apache.ws.commons.axiom/samples/1.2.16-SNAPSHOT/samples-1.2.16-SNAPSHOT.jar
[JENKINS] Archiving <https://builds.apache.org/job/axiom-trunk/ws/axiom/samples/target/jacoco.exec>
to org.apache.ws.commons.axiom/samples/1.2.16-SNAPSHOT/samples-1.2.16-SNAPSHOT-jacoco.exec
[JENKINS] Archiving <https://builds.apache.org/job/axiom-trunk/ws/axiom/samples/target/samples-1.2.16-SNAPSHOT-sources.jar>
to org.apache.ws.commons.axiom/samples/1.2.16-SNAPSHOT/samples-1.2.16-SNAPSHOT-sources.jar
[JENKINS] Archiving <https://builds.apache.org/job/axiom-trunk/ws/axiom/buildutils/shade-osgi/pom.xml>
to org.apache.ws.commons.axiom/shade-osgi/1.2.16-SNAPSHOT/shade-osgi-1.2.16-SNAPSHOT.pom
[JENKINS] Archiving <https://builds.apache.org/job/axiom-trunk/ws/axiom/buildutils/shade-osgi/target/shade-osgi-1.2.16-SNAPSHOT.jar>
to org.apache.ws.commons.axiom/shade-osgi/1.2.16-20151003.115210-213/shade-osgi-1.2.16-20151003.115210-213.jar
[JENKINS] Archiving <https://builds.apache.org/job/axiom-trunk/ws/axiom/buildutils/shade-osgi/target/shade-osgi-1.2.16-SNAPSHOT-sources.jar>
to org.apache.ws.commons.axiom/shade-osgi/1.2.16-20151003.115210-213/shade-osgi-1.2.16-20151003.115210-213-sources.jar
[JENKINS] Archiving <https://builds.apache.org/job/axiom-trunk/ws/axiom/buildutils/shade-osgi/target/shade-osgi-1.2.16-SNAPSHOT-javadoc.jar>
to org.apache.ws.commons.axiom/shade-osgi/1.2.16-20151003.115210-213/shade-osgi-1.2.16-20151003.115210-213-javadoc.jar
[JENKINS] Archiving <https://builds.apache.org/job/axiom-trunk/ws/axiom/axiom-c14n/pom.xml>
to org.apache.ws.commons.axiom/axiom-c14n/1.2.16-SNAPSHOT/axiom-c14n-1.2.16-SNAPSHOT.pom
[JENKINS] Archiving <https://builds.apache.org/job/axiom-trunk/ws/axiom/axiom-c14n/target/axiom-c14n-1.2.16-SNAPSHOT.jar>
to org.apache.ws.commons.axiom/axiom-c14n/1.2.16-20151003.120458-212/axiom-c14n-1.2.16-20151003.120458-212.jar
[JENKINS] Archiving <https://builds.apache.org/job/axiom-trunk/ws/axiom/axiom-c14n/target/jacoco.exec>
to org.apache.ws.commons.axiom/axiom-c14n/1.2.16-20151003.120458-212/axiom-c14n-1.2.16-20151003.120458-212-jacoco.exec
[JENKINS] Archiving <https://builds.apache.org/job/axiom-trunk/ws/axiom/axiom-c14n/target/axiom-c14n-1.2.16-SNAPSHOT-sources.jar>
to org.apache.ws.commons.axiom/axiom-c14n/1.2.16-20151003.120458-212/axiom-c14n-1.2.16-20151003.120458-212-sources.jar
[JENKINS] Archiving <https://builds.apache.org/job/axiom-trunk/ws/axiom/axiom-c14n/target/axiom-c14n-1.2.16-SNAPSHOT-javadoc.jar>
to org.apache.ws.commons.axiom/axiom-c14n/1.2.16-20151003.120458-212/axiom-c14n-1.2.16-20151003.120458-212-javadoc.jar
[JENKINS] Archiving <https://builds.apache.org/job/axiom-trunk/ws/axiom/pom.xml> to
org.apache.ws.commons.axiom/axiom/1.2.16-SNAPSHOT/axiom-1.2.16-SNAPSHOT.pom
[JENKINS] Archiving <https://builds.apache.org/job/axiom-trunk/ws/axiom/target/axiom-1.2.16-SNAPSHOT-site.xml>
to org.apache.ws.commons.axiom/axiom/1.2.16-20151003.115145-214/axiom-1.2.16-20151003.115145-214-site.xml
[JENKINS] Archiving <https://builds.apache.org/job/axiom-trunk/ws/axiom/buildutils/jar-resource-bundle/pom.xml>
to org.apache.ws.commons.axiom/jar-resource-bundle/1.2.16-SNAPSHOT/jar-resource-bundle-1.2.16-SNAPSHOT.pom
[JENKINS] Archiving <https://builds.apache.org/job/axiom-trunk/ws/axiom/buildutils/jar-resource-bundle/target/jar-resource-bundle-1.2.16-SNAPSHOT.jar>
to org.apache.ws.commons.axiom/jar-resource-bundle/1.2.16-20151003.115155-214/jar-resource-bundle-1.2.16-20151003.115155-214.jar
[JENKINS] Archiving <https://builds.apache.org/job/axiom-trunk/ws/axiom/buildutils/jar-resource-bundle/target/jar-resource-bundle-1.2.16-SNAPSHOT-sources.jar>
to org.apache.ws.commons.axiom/jar-resource-bundle/1.2.16-20151003.115155-214/jar-resource-bundle-1.2.16-20151003.115155-214-sources.jar
[JENKINS] Archiving <https://builds.apache.org/job/axiom-trunk/ws/axiom/testing/dom-testsuite/pom.xml>
to org.apache.ws.commons.axiom/dom-testsuite/1.2.16-SNAPSHOT/dom-testsuite-1.2.16-SNAPSHOT.pom
[JENKINS] Archiving <https://builds.apache.org/job/axiom-trunk/ws/axiom/testing/dom-testsuite/target/dom-testsuite-1.2.16-SNAPSHOT.jar>
to org.apache.ws.commons.axiom/dom-testsuite/1.2.16-20151003.120037-212/dom-testsuite-1.2.16-20151003.120037-212.jar
[JENKINS] Archiving <https://builds.apache.org/job/axiom-trunk/ws/axiom/testing/dom-testsuite/target/jacoco.exec>
to org.apache.ws.commons.axiom/dom-testsuite/1.2.16-20151003.120037-212/dom-testsuite-1.2.16-20151003.120037-212-jacoco.exec
[JENKINS] Archiving <https://builds.apache.org/job/axiom-trunk/ws/axiom/testing/dom-testsuite/target/dom-testsuite-1.2.16-SNAPSHOT-sources.jar>
to org.apache.ws.commons.axiom/dom-testsuite/1.2.16-20151003.120037-212/dom-testsuite-1.2.16-20151003.120037-212-sources.jar
[JENKINS] Archiving <https://builds.apache.org/job/axiom-trunk/ws/axiom/testing/dom-testsuite/target/dom-testsuite-1.2.16-SNAPSHOT-javadoc.jar>
to org.apache.ws.commons.axiom/dom-testsuite/1.2.16-20151003.120037-212/dom-testsuite-1.2.16-20151003.120037-212-javadoc.jar
Compressed 13.76 MB of artifacts by 19.8% relative to #2332
[JENKINS] Archiving <https://builds.apache.org/job/axiom-trunk/ws/axiom/testing/axiom-truth/pom.xml>
to org.apache.ws.commons.axiom/axiom-truth/1.2.16-SNAPSHOT/axiom-truth-1.2.16-SNAPSHOT.pom
[JENKINS] Archiving <https://builds.apache.org/job/axiom-trunk/ws/axiom/testing/axiom-truth/target/axiom-truth-1.2.16-SNAPSHOT.jar>
to org.apache.ws.commons.axiom/axiom-truth/1.2.16-20151003.115610-213/axiom-truth-1.2.16-20151003.115610-213.jar
[JENKINS] Archiving <https://builds.apache.org/job/axiom-trunk/ws/axiom/testing/axiom-truth/target/axiom-truth-1.2.16-SNAPSHOT-sources.jar>
to org.apache.ws.commons.axiom/axiom-truth/1.2.16-20151003.115610-213/axiom-truth-1.2.16-20151003.115610-213-sources.jar
[JENKINS] Archiving <https://builds.apache.org/job/axiom-trunk/ws/axiom/testing/axiom-truth/target/axiom-truth-1.2.16-SNAPSHOT-javadoc.jar>
to org.apache.ws.commons.axiom/axiom-truth/1.2.16-20151003.115610-213/axiom-truth-1.2.16-20151003.115610-213-javadoc.jar
[JENKINS] Archiving <https://builds.apache.org/job/axiom-trunk/ws/axiom/aspects/dom-aspects/pom.xml>
to org.apache.ws.commons.axiom/dom-aspects/1.2.16-SNAPSHOT/dom-aspects-1.2.16-SNAPSHOT.pom
[JENKINS] Archiving <https://builds.apache.org/job/axiom-trunk/ws/axiom/aspects/dom-aspects/target/dom-aspects-1.2.16-SNAPSHOT.jar>
to org.apache.ws.commons.axiom/dom-aspects/1.2.16-20151003.115937-213/dom-aspects-1.2.16-20151003.115937-213.jar
[JENKINS] Archiving <https://builds.apache.org/job/axiom-trunk/ws/axiom/aspects/dom-aspects/target/jacoco.exec>
to org.apache.ws.commons.axiom/dom-aspects/1.2.16-20151003.115937-213/dom-aspects-1.2.16-20151003.115937-213-jacoco.exec
[JENKINS] Archiving <https://builds.apache.org/job/axiom-trunk/ws/axiom/aspects/dom-aspects/target/dom-aspects-1.2.16-SNAPSHOT-sources.jar>
to org.apache.ws.commons.axiom/dom-aspects/1.2.16-20151003.115937-213/dom-aspects-1.2.16-20151003.115937-213-sources.jar
[JENKINS] Archiving <https://builds.apache.org/job/axiom-trunk/ws/axiom/aspects/dom-aspects/target/dom-aspects-1.2.16-SNAPSHOT-javadoc.jar>
to org.apache.ws.commons.axiom/dom-aspects/1.2.16-20151003.115937-213/dom-aspects-1.2.16-20151003.115937-213-javadoc.jar
[JENKINS] Archiving <https://builds.apache.org/job/axiom-trunk/ws/axiom/code-coverage/pom.xml>
to org.apache.ws.commons.axiom/code-coverage/1.2.16-SNAPSHOT/code-coverage-1.2.16-SNAPSHOT.pom
[JENKINS] Archiving <https://builds.apache.org/job/axiom-trunk/ws/axiom/systests/cross-om-tests/pom.xml>
to org.apache.ws.commons.axiom/cross-om-tests/1.2.16-SNAPSHOT/cross-om-tests-1.2.16-SNAPSHOT.pom
[JENKINS] Archiving <https://builds.apache.org/job/axiom-trunk/ws/axiom/systests/cross-om-tests/target/cross-om-tests-1.2.16-SNAPSHOT.jar>
to org.apache.ws.commons.axiom/cross-om-tests/1.2.16-SNAPSHOT/cross-om-tests-1.2.16-SNAPSHOT.jar
[JENKINS] Archiving <https://builds.apache.org/job/axiom-trunk/ws/axiom/systests/cross-om-tests/target/jacoco.exec>
to org.apache.ws.commons.axiom/cross-om-tests/1.2.16-SNAPSHOT/cross-om-tests-1.2.16-SNAPSHOT-jacoco.exec
[JENKINS] Archiving <https://builds.apache.org/job/axiom-trunk/ws/axiom/systests/cross-om-tests/target/cross-om-tests-1.2.16-SNAPSHOT-sources.jar>
to org.apache.ws.commons.axiom/cross-om-tests/1.2.16-SNAPSHOT/cross-om-tests-1.2.16-SNAPSHOT-sources.jar
[JENKINS] Archiving <https://builds.apache.org/job/axiom-trunk/ws/axiom/testing/saaj-testsuite/pom.xml>
to org.apache.ws.commons.axiom/saaj-testsuite/1.2.16-SNAPSHOT/saaj-testsuite-1.2.16-SNAPSHOT.pom
[JENKINS] Archiving <https://builds.apache.org/job/axiom-trunk/ws/axiom/testing/spring-ws-testsuite/pom.xml>
to org.apache.ws.commons.axiom/spring-ws-testsuite/1.2.16-SNAPSHOT/spring-ws-testsuite-1.2.16-SNAPSHOT.pom
[JENKINS] Archiving <https://builds.apache.org/job/axiom-trunk/ws/axiom/systests/eclipse-tests/pom.xml>
to org.apache.ws.commons.axiom/eclipse-tests/1.2.16-SNAPSHOT/eclipse-tests-1.2.16-SNAPSHOT.pom
[JENKINS] Archiving <https://builds.apache.org/job/axiom-trunk/ws/axiom/systests/eclipse-tests/target/it/project/target/jacoco.exec>
to org.apache.ws.commons.axiom/eclipse-tests/1.2.16-SNAPSHOT/eclipse-tests-1.2.16-SNAPSHOT-jacoco.exec
[JENKINS] Archiving <https://builds.apache.org/job/axiom-trunk/ws/axiom/systests/jboss-tests/pom.xml>
to org.apache.ws.commons.axiom/jboss-tests/1.2.16-SNAPSHOT/jboss-tests-1.2.16-SNAPSHOT.pom
[JENKINS] Archiving <https://builds.apache.org/job/axiom-trunk/ws/axiom/testing/axiom-testsuite/pom.xml>
to org.apache.ws.commons.axiom/axiom-testsuite/1.2.16-SNAPSHOT/axiom-testsuite-1.2.16-SNAPSHOT.pom
[JENKINS] Archiving <https://builds.apache.org/job/axiom-trunk/ws/axiom/testing/axiom-testsuite/target/axiom-testsuite-1.2.16-SNAPSHOT.jar>
to org.apache.ws.commons.axiom/axiom-testsuite/1.2.16-20151003.115653-213/axiom-testsuite-1.2.16-20151003.115653-213.jar
[JENKINS] Archiving <https://builds.apache.org/job/axiom-trunk/ws/axiom/testing/axiom-testsuite/target/axiom-testsuite-1.2.16-SNAPSHOT-sources.jar>
to org.apache.ws.commons.axiom/axiom-testsuite/1.2.16-20151003.115653-213/axiom-testsuite-1.2.16-20151003.115653-213-sources.jar
[JENKINS] Archiving <https://builds.apache.org/job/axiom-trunk/ws/axiom/testing/axiom-testsuite/target/axiom-testsuite-1.2.16-SNAPSHOT-javadoc.jar>
to org.apache.ws.commons.axiom/axiom-testsuite/1.2.16-20151003.115653-213/axiom-testsuite-1.2.16-20151003.115653-213-javadoc.jar
Compressed 4.78 MB of artifacts by 14.4% relative to #2332
[JENKINS] Archiving <https://builds.apache.org/job/axiom-trunk/ws/axiom/testing/jaxen-testsuite/pom.xml>
to org.apache.ws.commons.axiom/jaxen-testsuite/1.2.16-SNAPSHOT/jaxen-testsuite-1.2.16-SNAPSHOT.pom
[JENKINS] Archiving <https://builds.apache.org/job/axiom-trunk/ws/axiom/testing/jaxen-testsuite/target/jaxen-testsuite-1.2.16-SNAPSHOT.jar>
to org.apache.ws.commons.axiom/jaxen-testsuite/1.2.16-20151003.115619-213/jaxen-testsuite-1.2.16-20151003.115619-213.jar
[JENKINS] Archiving <https://builds.apache.org/job/axiom-trunk/ws/axiom/testing/jaxen-testsuite/target/jaxen-testsuite-1.2.16-SNAPSHOT-sources.jar>
to org.apache.ws.commons.axiom/jaxen-testsuite/1.2.16-20151003.115619-213/jaxen-testsuite-1.2.16-20151003.115619-213-sources.jar
[JENKINS] Archiving <https://builds.apache.org/job/axiom-trunk/ws/axiom/testing/jaxen-testsuite/target/jaxen-testsuite-1.2.16-SNAPSHOT-javadoc.jar>
to org.apache.ws.commons.axiom/jaxen-testsuite/1.2.16-20151003.115619-213/jaxen-testsuite-1.2.16-20151003.115619-213-javadoc.jar
Compressed 258.97 KB of artifacts by 24.7% relative to #2332
[JENKINS] Archiving <https://builds.apache.org/job/axiom-trunk/ws/axiom/systests/pom.xml>
to org.apache.ws.commons.axiom/systests/1.2.16-SNAPSHOT/systests-1.2.16-SNAPSHOT.pom
[JENKINS] Archiving <https://builds.apache.org/job/axiom-trunk/ws/axiom/distribution/pom.xml>
to org.apache.ws.commons.axiom/distribution/1.2.16-SNAPSHOT/distribution-1.2.16-SNAPSHOT.pom
[JENKINS] Archiving <https://builds.apache.org/job/axiom-trunk/ws/axiom/aspects/shared-aspects/pom.xml>
to org.apache.ws.commons.axiom/shared-aspects/1.2.16-SNAPSHOT/shared-aspects-1.2.16-SNAPSHOT.pom
[JENKINS] Archiving <https://builds.apache.org/job/axiom-trunk/ws/axiom/aspects/shared-aspects/target/shared-aspects-1.2.16-SNAPSHOT.jar>
to org.apache.ws.commons.axiom/shared-aspects/1.2.16-20151003.115531-146/shared-aspects-1.2.16-20151003.115531-146.jar
[JENKINS] Archiving <https://builds.apache.org/job/axiom-trunk/ws/axiom/aspects/shared-aspects/target/shared-aspects-1.2.16-SNAPSHOT-sources.jar>
to org.apache.ws.commons.axiom/shared-aspects/1.2.16-20151003.115531-146/shared-aspects-1.2.16-20151003.115531-146-sources.jar
[JENKINS] Archiving <https://builds.apache.org/job/axiom-trunk/ws/axiom/aspects/shared-aspects/target/shared-aspects-1.2.16-SNAPSHOT-javadoc.jar>
to org.apache.ws.commons.axiom/shared-aspects/1.2.16-20151003.115531-146/shared-aspects-1.2.16-20151003.115531-146-javadoc.jar
[JENKINS] Archiving <https://builds.apache.org/job/axiom-trunk/ws/axiom/testing/fom-testsuite/pom.xml>
to org.apache.ws.commons.axiom/fom-testsuite/1.2.16-SNAPSHOT/fom-testsuite-1.2.16-SNAPSHOT.pom
[JENKINS] Archiving <https://builds.apache.org/job/axiom-trunk/ws/axiom/testing/xml-truth/pom.xml>
to org.apache.ws.commons.axiom/xml-truth/1.2.16-SNAPSHOT/xml-truth-1.2.16-SNAPSHOT.pom
[JENKINS] Archiving <https://builds.apache.org/job/axiom-trunk/ws/axiom/testing/xml-truth/target/xml-truth-1.2.16-SNAPSHOT.jar>
to org.apache.ws.commons.axiom/xml-truth/1.2.16-20151003.115309-213/xml-truth-1.2.16-20151003.115309-213.jar
[JENKINS] Archiving <https://builds.apache.org/job/axiom-trunk/ws/axiom/testing/xml-truth/target/jacoco.exec>
to org.apache.ws.commons.axiom/xml-truth/1.2.16-20151003.115309-213/xml-truth-1.2.16-20151003.115309-213-jacoco.exec
[JENKINS] Archiving <https://builds.apache.org/job/axiom-trunk/ws/axiom/testing/xml-truth/target/xml-truth-1.2.16-SNAPSHOT-sources.jar>
to org.apache.ws.commons.axiom/xml-truth/1.2.16-20151003.115309-213/xml-truth-1.2.16-20151003.115309-213-sources.jar
[JENKINS] Archiving <https://builds.apache.org/job/axiom-trunk/ws/axiom/testing/xml-truth/target/xml-truth-1.2.16-SNAPSHOT-javadoc.jar>
to org.apache.ws.commons.axiom/xml-truth/1.2.16-20151003.115309-213/xml-truth-1.2.16-20151003.115309-213-javadoc.jar
[JENKINS] Archiving <https://builds.apache.org/job/axiom-trunk/ws/axiom/testing/multiton/pom.xml>
to org.apache.ws.commons.axiom/multiton/1.2.16-SNAPSHOT/multiton-1.2.16-SNAPSHOT.pom
[JENKINS] Archiving <https://builds.apache.org/job/axiom-trunk/ws/axiom/testing/multiton/target/multiton-1.2.16-SNAPSHOT.jar>
to org.apache.ws.commons.axiom/multiton/1.2.16-20151003.115228-213/multiton-1.2.16-20151003.115228-213.jar
[JENKINS] Archiving <https://builds.apache.org/job/axiom-trunk/ws/axiom/testing/multiton/target/multiton-1.2.16-SNAPSHOT-sources.jar>
to org.apache.ws.commons.axiom/multiton/1.2.16-20151003.115228-213/multiton-1.2.16-20151003.115228-213-sources.jar
[JENKINS] Archiving <https://builds.apache.org/job/axiom-trunk/ws/axiom/testing/multiton/target/multiton-1.2.16-SNAPSHOT-javadoc.jar>
to org.apache.ws.commons.axiom/multiton/1.2.16-20151003.115228-213/multiton-1.2.16-20151003.115228-213-javadoc.jar
[JENKINS] Archiving <https://builds.apache.org/job/axiom-trunk/ws/axiom/apidocs/pom.xml>
to org.apache.ws.commons.axiom/apidocs/1.2.16-SNAPSHOT/apidocs-1.2.16-SNAPSHOT.pom
[JENKINS] Archiving <https://builds.apache.org/job/axiom-trunk/ws/axiom/testing/pom.xml>
to org.apache.ws.commons.axiom/testing/1.2.16-SNAPSHOT/testing-1.2.16-SNAPSHOT.pom
[JENKINS] Archiving <https://builds.apache.org/job/axiom-trunk/ws/axiom/testing/target/testing-1.2.16-SNAPSHOT-site.xml>
to org.apache.ws.commons.axiom/testing/1.2.16-20151003.115222-213/testing-1.2.16-20151003.115222-213-site.xml
[JENKINS] Archiving <https://builds.apache.org/job/axiom-trunk/ws/axiom/axiom-api/pom.xml>
to org.apache.ws.commons.axiom/axiom-api/1.2.16-SNAPSHOT/axiom-api-1.2.16-SNAPSHOT.pom
[JENKINS] Archiving <https://builds.apache.org/job/axiom-trunk/ws/axiom/axiom-api/target/axiom-api-1.2.16-SNAPSHOT.jar>
to org.apache.ws.commons.axiom/axiom-api/1.2.16-20151003.115459-213/axiom-api-1.2.16-20151003.115459-213.jar
[JENKINS] Archiving <https://builds.apache.org/job/axiom-trunk/ws/axiom/axiom-api/target/jacoco.exec>
to org.apache.ws.commons.axiom/axiom-api/1.2.16-20151003.115459-213/axiom-api-1.2.16-20151003.115459-213-jacoco.exec
[JENKINS] Archiving <https://builds.apache.org/job/axiom-trunk/ws/axiom/axiom-api/target/axiom-api-1.2.16-SNAPSHOT-sources.jar>
to org.apache.ws.commons.axiom/axiom-api/1.2.16-20151003.115459-213/axiom-api-1.2.16-20151003.115459-213-sources.jar
[JENKINS] Archiving <https://builds.apache.org/job/axiom-trunk/ws/axiom/axiom-api/target/axiom-api-1.2.16-SNAPSHOT-javadoc.jar>
to org.apache.ws.commons.axiom/axiom-api/1.2.16-20151003.115459-213/axiom-api-1.2.16-20151003.115459-213-javadoc.jar
[JENKINS] Archiving <https://builds.apache.org/job/axiom-trunk/ws/axiom/axiom-api/target/axiom-api-1.2.16-SNAPSHOT-tests.jar>
to org.apache.ws.commons.axiom/axiom-api/1.2.16-20151003.115459-213/axiom-api-1.2.16-20151003.115459-213-tests.jar
Compressed 2.77 MB of artifacts by 19.2% relative to #2332
[JENKINS] Archiving <https://builds.apache.org/job/axiom-trunk/ws/axiom/userguide/pom.xml>
to org.apache.ws.commons.axiom/userguide/1.2.16-SNAPSHOT/userguide-1.2.16-SNAPSHOT.pom
[JENKINS] Archiving <https://builds.apache.org/job/axiom-trunk/ws/axiom/aspects/core-aspects/pom.xml>
to org.apache.ws.commons.axiom/core-aspects/1.2.16-SNAPSHOT/core-aspects-1.2.16-SNAPSHOT.pom
[JENKINS] Archiving <https://builds.apache.org/job/axiom-trunk/ws/axiom/aspects/core-aspects/target/core-aspects-1.2.16-SNAPSHOT.jar>
to org.apache.ws.commons.axiom/core-aspects/1.2.16-20151003.115521-213/core-aspects-1.2.16-20151003.115521-213.jar
[JENKINS] Archiving <https://builds.apache.org/job/axiom-trunk/ws/axiom/aspects/core-aspects/target/core-aspects-1.2.16-SNAPSHOT-sources.jar>
to org.apache.ws.commons.axiom/core-aspects/1.2.16-20151003.115521-213/core-aspects-1.2.16-20151003.115521-213-sources.jar
[JENKINS] Archiving <https://builds.apache.org/job/axiom-trunk/ws/axiom/aspects/core-aspects/target/core-aspects-1.2.16-SNAPSHOT-javadoc.jar>
to org.apache.ws.commons.axiom/core-aspects/1.2.16-20151003.115521-213/core-aspects-1.2.16-20151003.115521-213-javadoc.jar
[JENKINS] Archiving <https://builds.apache.org/job/axiom-trunk/ws/axiom/systests/old-tests/pom.xml>
to org.apache.ws.commons.axiom/old-tests/1.2.16-SNAPSHOT/old-tests-1.2.16-SNAPSHOT.pom
[JENKINS] Archiving <https://builds.apache.org/job/axiom-trunk/ws/axiom/aspects/fom-aspects/pom.xml>
to org.apache.ws.commons.axiom/fom-aspects/1.2.16-SNAPSHOT/fom-aspects-1.2.16-SNAPSHOT.pom
[JENKINS] Archiving <https://builds.apache.org/job/axiom-trunk/ws/axiom/systests/osgi-tests/pom.xml>
to org.apache.ws.commons.axiom/osgi-tests/1.2.16-SNAPSHOT/osgi-tests-1.2.16-SNAPSHOT.pom
[JENKINS] Archiving <https://builds.apache.org/job/axiom-trunk/ws/axiom/testing/xml-testsuite/pom.xml>
to org.apache.ws.commons.axiom/xml-testsuite/1.2.16-SNAPSHOT/xml-testsuite-1.2.16-SNAPSHOT.pom
[JENKINS] Archiving <https://builds.apache.org/job/axiom-trunk/ws/axiom/testing/xml-testsuite/target/xml-testsuite-1.2.16-SNAPSHOT.jar>
to org.apache.ws.commons.axiom/xml-testsuite/1.2.16-20151003.115255-213/xml-testsuite-1.2.16-20151003.115255-213.jar
[JENKINS] Archiving <https://builds.apache.org/job/axiom-trunk/ws/axiom/testing/xml-testsuite/target/xml-testsuite-1.2.16-SNAPSHOT-sources.jar>
to org.apache.ws.commons.axiom/xml-testsuite/1.2.16-20151003.115255-213/xml-testsuite-1.2.16-20151003.115255-213-sources.jar
[JENKINS] Archiving <https://builds.apache.org/job/axiom-trunk/ws/axiom/testing/xml-testsuite/target/xml-testsuite-1.2.16-SNAPSHOT-javadoc.jar>
to org.apache.ws.commons.axiom/xml-testsuite/1.2.16-20151003.115255-213/xml-testsuite-1.2.16-20151003.115255-213-javadoc.jar
[JENKINS] Archiving <https://builds.apache.org/job/axiom-trunk/ws/axiom/testing/soap-testsuite/pom.xml>
to org.apache.ws.commons.axiom/soap-testsuite/1.2.16-SNAPSHOT/soap-testsuite-1.2.16-SNAPSHOT.pom
[JENKINS] Archiving <https://builds.apache.org/job/axiom-trunk/ws/axiom/testing/soap-testsuite/target/soap-testsuite-1.2.16-SNAPSHOT.jar>
to org.apache.ws.commons.axiom/soap-testsuite/1.2.16-20151003.115322-213/soap-testsuite-1.2.16-20151003.115322-213.jar
[JENKINS] Archiving <https://builds.apache.org/job/axiom-trunk/ws/axiom/testing/soap-testsuite/target/jacoco.exec>
to org.apache.ws.commons.axiom/soap-testsuite/1.2.16-20151003.115322-213/soap-testsuite-1.2.16-20151003.115322-213-jacoco.exec
[JENKINS] Archiving <https://builds.apache.org/job/axiom-trunk/ws/axiom/testing/soap-testsuite/target/soap-testsuite-1.2.16-SNAPSHOT-sources.jar>
to org.apache.ws.commons.axiom/soap-testsuite/1.2.16-20151003.115322-213/soap-testsuite-1.2.16-20151003.115322-213-sources.jar
[JENKINS] Archiving <https://builds.apache.org/job/axiom-trunk/ws/axiom/testing/soap-testsuite/target/soap-testsuite-1.2.16-SNAPSHOT-javadoc.jar>
to org.apache.ws.commons.axiom/soap-testsuite/1.2.16-20151003.115322-213/soap-testsuite-1.2.16-20151003.115322-213-javadoc.jar
Compressed 410.29 KB of artifacts by 46.8% relative to #2332
Sending e-mails to: dev@ws.apache.org
channel stopped

---------------------------------------------------------------------
To unsubscribe, e-mail: dev-unsubscribe@ws.apache.org
For additional commands, e-mail: dev-help@ws.apache.org


Mime
View raw message