ws-dev mailing list archives

Site index · List index
Message view « Date » · « Thread »
Top « Date » · « Thread »
From Apache Jenkins Server <jenk...@builds.apache.org>
Subject Build failed in Jenkins: axiom-trunk #2327
Date Thu, 01 Oct 2015 08:05:31 GMT
See <https://builds.apache.org/job/axiom-trunk/2327/changes>

Changes:

[veithen] Use DetachPolicy for coreSetAttribute.

------------------------------------------
[...truncated 11161 lines...]
log4j:WARN Please initialize the log4j system properly.
Oct 01, 2015 8:05:35 AM org.jboss.as.arquillian.container.managed.ManagedDeployableContainer
startInternal
INFO: Starting container with: [/home/jenkins/tools/java/latest1.7/bin/java, -Ddummy, -javaagent:<https://builds.apache.org/job/axiom-trunk/ws/.repository/org/jacoco/org.jacoco.agent/0.6.3.201306030806/org.jacoco.agent-0.6.3.201306030806-runtime.jar=destfile=/home/jenkins/jenkins-slave/workspace/axiom-trunk/axiom/systests/jboss-tests/target/jacoco.exec,sessionid=mvn>:org.apache.ws.commons.axiom:jboss-tests:1.2.16-SNAPSHOT:jboss,
-Djboss.management.native.port=55096, -ea, -Djboss.home.dir=<https://builds.apache.org/job/axiom-trunk/ws/axiom/systests/jboss-tests/target/jboss-as-7.1.1.Final,>
-Dorg.jboss.boot.log.file=<https://builds.apache.org/job/axiom-trunk/ws/axiom/systests/jboss-tests/target/jboss-as-7.1.1.Final/standalone/log/boot.log,>
-Dlogging.configuration=<https://builds.apache.org/job/axiom-trunk/ws/axiom/systests/jboss-tests/target/jboss-as-7.1.1.Final/standalone/configuration/logging.properties,>
-Djboss.modules.dir=<https://builds.apache.org/job/axiom-trunk/ws/axiom/systests/jboss-tests/target/jboss-as-7.1.1.Final/modules,>
-Djboss.bundles.dir=<https://builds.apache.org/job/axiom-trunk/ws/axiom/systests/jboss-tests/target/jboss-as-7.1.1.Final/bundles,>
-jar, <https://builds.apache.org/job/axiom-trunk/ws/axiom/systests/jboss-tests/target/jboss-as-7.1.1.Final/jboss-modules.jar,>
-mp, <https://builds.apache.org/job/axiom-trunk/ws/axiom/systests/jboss-tests/target/jboss-as-7.1.1.Final/modules,>
-jaxpmodule, javax.xml.jaxp-provider, org.jboss.as.standalone, -server-config, standalone.xml]
#
# A fatal error has been detected by the Java Runtime Environment:
#
#  SIGSEGV (0xb) at pc=0xeb60d52c, pid=5902, tid=4136880960
#
# JRE version: 7.0_25-b15
# Java VM: Java HotSpot(TM) Server VM (23.25-b01 mixed mode linux-x86 )
# Problematic frame:
# C  [libnet.so+0x352c]  _init+0x620
#
# Failed to write core dump. Core dumps have been disabled. To enable core dumping, try "ulimit
-c unlimited" before starting Java again
#
# An error report file with more information is saved as:
# <https://builds.apache.org/job/axiom-trunk/ws/axiom/systests/jboss-tests/hs_err_pid5902.log>
#
# If you would like to submit a bug report, please visit:
#   http://bugreport.sun.com/bugreport/crash.jsp
# The crash happened outside the Java Virtual Machine in native code.
# See problematic frame for where to report the bug.
#
Aborted

Results :

Tests run: 0, Failures: 0, Errors: 0, Skipped: 0

[JENKINS] Recording test results
[INFO] ------------------------------------------------------------------------
[INFO] Reactor Summary:
[INFO] 
[INFO] Axiom .............................................. SUCCESS [ 23.754 s]
[INFO] Build utilities .................................... SUCCESS [  5.088 s]
[INFO] JAR Resource Bundle ................................ SUCCESS [  6.017 s]
[INFO] Resource Transformer for META-INF/axiom.xml files .. SUCCESS [  8.556 s]
[INFO] Resource Transformer for OSGi Manifests ............ SUCCESS [  7.485 s]
[INFO] Testing ............................................ SUCCESS [  4.532 s]
[INFO] Multiton pattern implementation .................... SUCCESS [  5.627 s]
[INFO] Axiom Test Utilities ............................... SUCCESS [ 17.735 s]
[INFO] XML Test Suite ..................................... SUCCESS [  9.051 s]
[INFO] Google Truth extension for XML ..................... SUCCESS [ 17.624 s]
[INFO] SOAP Test Suite .................................... SUCCESS [ 11.602 s]
[INFO] Axiom API .......................................... SUCCESS [01:45 min]
[INFO] Aspects ............................................ SUCCESS [  3.514 s]
[INFO] Core Aspects ....................................... SUCCESS [ 10.936 s]
[INFO] Shared Aspects ..................................... SUCCESS [  6.574 s]
[INFO] OM Aspects ......................................... SUCCESS [ 35.861 s]
[INFO] Google Truth extension for Axiom ................... SUCCESS [  6.746 s]
[INFO] Jaxen Test Suite ................................... SUCCESS [  7.669 s]
[INFO] Axiom Implementation Test Suite .................... SUCCESS [ 33.367 s]
[INFO] Implementations .................................... SUCCESS [  2.751 s]
[INFO] LLOM ............................................... SUCCESS [02:12 min]
[INFO] DOM Aspects ........................................ SUCCESS [ 10.167 s]
[INFO] DOM Test Suite ..................................... SUCCESS [01:02 min]
[INFO] DOOM ............................................... SUCCESS [03:08 min]
[INFO] Axiom Compatibility Classes ........................ SUCCESS [ 10.865 s]
[INFO] Axiom JAXB Integration ............................. SUCCESS [ 11.320 s]
[INFO] Axiom C14N ......................................... SUCCESS [  9.115 s]
[INFO] Axiom Uber-JAR ..................................... SUCCESS [  2.825 s]
[INFO] Samples ............................................ SUCCESS [  7.824 s]
[INFO] System Tests ....................................... SUCCESS [  1.559 s]
[INFO] Cross OM Tests ..................................... SUCCESS [  4.247 s]
[INFO] Eclipse Tests ...................................... SUCCESS [ 24.533 s]
[INFO] Axiom Integration Test Suite ....................... SUCCESS [  9.236 s]
[INFO] JBoss Tests ........................................ FAILURE [ 11.840 s]
[INFO] Axiom Test Suite (old) ............................. SKIPPED
[INFO] Axiom OSGi Tests ................................... SKIPPED
[INFO] Spring-WS Test Suite ............................... SKIPPED
[INFO] Spring WS Tests .................................... SKIPPED
[INFO] WSS4J Tests ........................................ SKIPPED
[INFO] Developer Guide .................................... SKIPPED
[INFO] User Guide ......................................... SKIPPED
[INFO] Javadoc ............................................ SKIPPED
[INFO] Distribution ....................................... SKIPPED
[INFO] FOM Aspects ........................................ SKIPPED
[INFO] fom-testsuite ...................................... SKIPPED
[INFO] Abdera Model (FOM) Implementation .................. SKIPPED
[INFO] Code Coverage Report ............................... SKIPPED
[INFO] SAAJ Test Suite .................................... SKIPPED
[INFO] ------------------------------------------------------------------------
[INFO] BUILD FAILURE
[INFO] ------------------------------------------------------------------------
[INFO] Total time: 14:15 min
[INFO] Finished at: 2015-10-01T08:05:45+00:00
[INFO] Final Memory: 124M/242M
[INFO] ------------------------------------------------------------------------
[ERROR] Failed to execute goal org.apache.maven.plugins:maven-surefire-plugin:2.16:test (default-test)
on project jboss-tests: Execution default-test of goal org.apache.maven.plugins:maven-surefire-plugin:2.16:test
failed: The forked VM terminated without saying properly goodbye. VM crash or System.exit
called ?
[ERROR] Command was/bin/sh -c cd <https://builds.apache.org/job/axiom-trunk/ws/axiom/systests/jboss-tests>
&& /home/jenkins/tools/java/jdk1.7.0_25-32/jre/bin/java -Xms16m -Xmx48m -javaagent:<https://builds.apache.org/job/axiom-trunk/ws/.repository/org/jacoco/org.jacoco.agent/0.6.3.201306030806/org.jacoco.agent-0.6.3.201306030806-runtime.jar=destfile=/home/jenkins/jenkins-slave/workspace/axiom-trunk/axiom/systests/jboss-tests/target/jacoco.exec,sessionid=mvn>:org.apache.ws.commons.axiom:jboss-tests:1.2.16-SNAPSHOT:surefire
-jar <https://builds.apache.org/job/axiom-trunk/ws/axiom/systests/jboss-tests/target/surefire/surefirebooter1202708946701951655.jar>
<https://builds.apache.org/job/axiom-trunk/ws/axiom/systests/jboss-tests/target/surefire/surefire1485999296255039781tmp>
<https://builds.apache.org/job/axiom-trunk/ws/axiom/systests/jboss-tests/target/surefire/surefire_86911039152563149726tmp>
[ERROR] -> [Help 1]
[ERROR] 
[ERROR] To see the full stack trace of the errors, re-run Maven with the -e switch.
[ERROR] Re-run Maven using the -X switch to enable full debug logging.
[ERROR] 
[ERROR] For more information about the errors and possible solutions, please read the following
articles:
[ERROR] [Help 1] http://cwiki.apache.org/confluence/display/MAVEN/PluginExecutionException
[ERROR] 
[ERROR] After correcting the problems, you can resume the build with the command
[ERROR]   mvn <goals> -rf :jboss-tests
[JENKINS] Archiving <https://builds.apache.org/job/axiom-trunk/ws/axiom/axiom-compat/pom.xml>
to org.apache.ws.commons.axiom/axiom-compat/1.2.16-SNAPSHOT/axiom-compat-1.2.16-SNAPSHOT.pom
[JENKINS] Archiving <https://builds.apache.org/job/axiom-trunk/ws/axiom/axiom-compat/target/axiom-compat-1.2.16-SNAPSHOT.jar>
to org.apache.ws.commons.axiom/axiom-compat/1.2.16-20151001.080404-206/axiom-compat-1.2.16-20151001.080404-206.jar
[JENKINS] Archiving <https://builds.apache.org/job/axiom-trunk/ws/axiom/axiom-compat/target/jacoco.exec>
to org.apache.ws.commons.axiom/axiom-compat/1.2.16-20151001.080404-206/axiom-compat-1.2.16-20151001.080404-206-jacoco.exec
[JENKINS] Archiving <https://builds.apache.org/job/axiom-trunk/ws/axiom/axiom-compat/target/axiom-compat-1.2.16-SNAPSHOT-sources.jar>
to org.apache.ws.commons.axiom/axiom-compat/1.2.16-20151001.080404-206/axiom-compat-1.2.16-20151001.080404-206-sources.jar
[JENKINS] Archiving <https://builds.apache.org/job/axiom-trunk/ws/axiom/axiom-compat/target/axiom-compat-1.2.16-SNAPSHOT-javadoc.jar>
to org.apache.ws.commons.axiom/axiom-compat/1.2.16-20151001.080404-206/axiom-compat-1.2.16-20151001.080404-206-javadoc.jar
[JENKINS] Archiving <https://builds.apache.org/job/axiom-trunk/ws/axiom/systests/wss4j-tests/pom.xml>
to org.apache.ws.commons.axiom/wss4j-tests/1.2.16-SNAPSHOT/wss4j-tests-1.2.16-SNAPSHOT.pom
[JENKINS] Archiving <https://builds.apache.org/job/axiom-trunk/ws/axiom/aspects/pom.xml>
to org.apache.ws.commons.axiom/aspects/1.2.16-SNAPSHOT/aspects-1.2.16-SNAPSHOT.pom
[JENKINS] Archiving <https://builds.apache.org/job/axiom-trunk/ws/axiom/implementations/fom-impl/pom.xml>
to org.apache.ws.commons.axiom/fom-impl/1.2.16-SNAPSHOT/fom-impl-1.2.16-SNAPSHOT.pom
[JENKINS] Archiving <https://builds.apache.org/job/axiom-trunk/ws/axiom/implementations/axiom-impl/pom.xml>
to org.apache.ws.commons.axiom/axiom-impl/1.2.16-SNAPSHOT/axiom-impl-1.2.16-SNAPSHOT.pom
[JENKINS] Archiving <https://builds.apache.org/job/axiom-trunk/ws/axiom/implementations/axiom-impl/target/axiom-impl-1.2.16-SNAPSHOT.jar>
to org.apache.ws.commons.axiom/axiom-impl/1.2.16-20151001.075927-207/axiom-impl-1.2.16-20151001.075927-207.jar
[JENKINS] Archiving <https://builds.apache.org/job/axiom-trunk/ws/axiom/implementations/axiom-impl/target/axiom-impl-1.2.16-SNAPSHOT-sources.jar>
to org.apache.ws.commons.axiom/axiom-impl/1.2.16-20151001.075927-207/axiom-impl-1.2.16-20151001.075927-207-sources.jar
[JENKINS] Archiving <https://builds.apache.org/job/axiom-trunk/ws/axiom/implementations/axiom-impl/target/jacoco.exec>
to org.apache.ws.commons.axiom/axiom-impl/1.2.16-20151001.075927-207/axiom-impl-1.2.16-20151001.075927-207-jacoco.exec
[JENKINS] Archiving <https://builds.apache.org/job/axiom-trunk/ws/axiom/implementations/axiom-impl/target/axiom-impl-1.2.16-SNAPSHOT-javadoc.jar>
to org.apache.ws.commons.axiom/axiom-impl/1.2.16-20151001.075927-207/axiom-impl-1.2.16-20151001.075927-207-javadoc.jar
[JENKINS] Archiving <https://builds.apache.org/job/axiom-trunk/ws/axiom/aspects/om-aspects/pom.xml>
to org.apache.ws.commons.axiom/om-aspects/1.2.16-SNAPSHOT/om-aspects-1.2.16-SNAPSHOT.pom
[JENKINS] Archiving <https://builds.apache.org/job/axiom-trunk/ws/axiom/aspects/om-aspects/target/om-aspects-1.2.16-SNAPSHOT.jar>
to org.apache.ws.commons.axiom/om-aspects/1.2.16-20151001.075619-207/om-aspects-1.2.16-20151001.075619-207.jar
[JENKINS] Archiving <https://builds.apache.org/job/axiom-trunk/ws/axiom/aspects/om-aspects/target/jacoco.exec>
to org.apache.ws.commons.axiom/om-aspects/1.2.16-20151001.075619-207/om-aspects-1.2.16-20151001.075619-207-jacoco.exec
[JENKINS] Archiving <https://builds.apache.org/job/axiom-trunk/ws/axiom/aspects/om-aspects/target/om-aspects-1.2.16-SNAPSHOT-sources.jar>
to org.apache.ws.commons.axiom/om-aspects/1.2.16-20151001.075619-207/om-aspects-1.2.16-20151001.075619-207-sources.jar
[JENKINS] Archiving <https://builds.apache.org/job/axiom-trunk/ws/axiom/aspects/om-aspects/target/om-aspects-1.2.16-SNAPSHOT-javadoc.jar>
to org.apache.ws.commons.axiom/om-aspects/1.2.16-20151001.075619-207/om-aspects-1.2.16-20151001.075619-207-javadoc.jar
Compressed 1.44 MB of artifacts by 34.6% relative to #2326
[JENKINS] Archiving <https://builds.apache.org/job/axiom-trunk/ws/axiom/axiom-jaxb/pom.xml>
to org.apache.ws.commons.axiom/axiom-jaxb/1.2.16-SNAPSHOT/axiom-jaxb-1.2.16-SNAPSHOT.pom
[JENKINS] Archiving <https://builds.apache.org/job/axiom-trunk/ws/axiom/axiom-jaxb/target/axiom-jaxb-1.2.16-SNAPSHOT.jar>
to org.apache.ws.commons.axiom/axiom-jaxb/1.2.16-20151001.080415-206/axiom-jaxb-1.2.16-20151001.080415-206.jar
[JENKINS] Archiving <https://builds.apache.org/job/axiom-trunk/ws/axiom/axiom-jaxb/target/jacoco.exec>
to org.apache.ws.commons.axiom/axiom-jaxb/1.2.16-20151001.080415-206/axiom-jaxb-1.2.16-20151001.080415-206-jacoco.exec
[JENKINS] Archiving <https://builds.apache.org/job/axiom-trunk/ws/axiom/axiom-jaxb/target/axiom-jaxb-1.2.16-SNAPSHOT-sources.jar>
to org.apache.ws.commons.axiom/axiom-jaxb/1.2.16-20151001.080415-206/axiom-jaxb-1.2.16-20151001.080415-206-sources.jar
[JENKINS] Archiving <https://builds.apache.org/job/axiom-trunk/ws/axiom/axiom-jaxb/target/axiom-jaxb-1.2.16-SNAPSHOT-javadoc.jar>
to org.apache.ws.commons.axiom/axiom-jaxb/1.2.16-20151001.080415-206/axiom-jaxb-1.2.16-20151001.080415-206-javadoc.jar
[JENKINS] Archiving <https://builds.apache.org/job/axiom-trunk/ws/axiom/systests/integration-tests/pom.xml>
to org.apache.ws.commons.axiom/integration-tests/1.2.16-SNAPSHOT/integration-tests-1.2.16-SNAPSHOT.pom
[JENKINS] Archiving <https://builds.apache.org/job/axiom-trunk/ws/axiom/systests/integration-tests/target/integration-tests-1.2.16-SNAPSHOT.jar>
to org.apache.ws.commons.axiom/integration-tests/1.2.16-SNAPSHOT/integration-tests-1.2.16-SNAPSHOT.jar
[JENKINS] Archiving <https://builds.apache.org/job/axiom-trunk/ws/axiom/systests/integration-tests/target/jacoco.exec>
to org.apache.ws.commons.axiom/integration-tests/1.2.16-SNAPSHOT/integration-tests-1.2.16-SNAPSHOT-jacoco.exec
[JENKINS] Archiving <https://builds.apache.org/job/axiom-trunk/ws/axiom/systests/integration-tests/target/integration-tests-1.2.16-SNAPSHOT-sources.jar>
to org.apache.ws.commons.axiom/integration-tests/1.2.16-SNAPSHOT/integration-tests-1.2.16-SNAPSHOT-sources.jar
[JENKINS] Archiving <https://builds.apache.org/job/axiom-trunk/ws/axiom/buildutils/pom.xml>
to org.apache.ws.commons.axiom/buildutils/1.2.16-SNAPSHOT/buildutils-1.2.16-SNAPSHOT.pom
[JENKINS] Archiving <https://builds.apache.org/job/axiom-trunk/ws/axiom/testing/testutils/pom.xml>
to org.apache.ws.commons.axiom/testutils/1.2.16-SNAPSHOT/testutils-1.2.16-SNAPSHOT.pom
[JENKINS] Archiving <https://builds.apache.org/job/axiom-trunk/ws/axiom/testing/testutils/target/testutils-1.2.16-SNAPSHOT.jar>
to org.apache.ws.commons.axiom/testutils/1.2.16-20151001.075254-207/testutils-1.2.16-20151001.075254-207.jar
[JENKINS] Archiving <https://builds.apache.org/job/axiom-trunk/ws/axiom/testing/testutils/target/jacoco.exec>
to org.apache.ws.commons.axiom/testutils/1.2.16-20151001.075254-207/testutils-1.2.16-20151001.075254-207-jacoco.exec
[JENKINS] Archiving <https://builds.apache.org/job/axiom-trunk/ws/axiom/testing/testutils/target/testutils-1.2.16-SNAPSHOT-sources.jar>
to org.apache.ws.commons.axiom/testutils/1.2.16-20151001.075254-207/testutils-1.2.16-20151001.075254-207-sources.jar
[JENKINS] Archiving <https://builds.apache.org/job/axiom-trunk/ws/axiom/testing/testutils/target/testutils-1.2.16-SNAPSHOT-javadoc.jar>
to org.apache.ws.commons.axiom/testutils/1.2.16-20151001.075254-207/testutils-1.2.16-20151001.075254-207-javadoc.jar
[JENKINS] Archiving <https://builds.apache.org/job/axiom-trunk/ws/axiom/buildutils/shade-axiom-xml/pom.xml>
to org.apache.ws.commons.axiom/shade-axiom-xml/1.2.16-SNAPSHOT/shade-axiom-xml-1.2.16-SNAPSHOT.pom
[JENKINS] Archiving <https://builds.apache.org/job/axiom-trunk/ws/axiom/buildutils/shade-axiom-xml/target/shade-axiom-xml-1.2.16-SNAPSHOT.jar>
to org.apache.ws.commons.axiom/shade-axiom-xml/1.2.16-20151001.075217-207/shade-axiom-xml-1.2.16-20151001.075217-207.jar
[JENKINS] Archiving <https://builds.apache.org/job/axiom-trunk/ws/axiom/buildutils/shade-axiom-xml/target/shade-axiom-xml-1.2.16-SNAPSHOT-sources.jar>
to org.apache.ws.commons.axiom/shade-axiom-xml/1.2.16-20151001.075217-207/shade-axiom-xml-1.2.16-20151001.075217-207-sources.jar
[JENKINS] Archiving <https://builds.apache.org/job/axiom-trunk/ws/axiom/buildutils/shade-axiom-xml/target/shade-axiom-xml-1.2.16-SNAPSHOT-javadoc.jar>
to org.apache.ws.commons.axiom/shade-axiom-xml/1.2.16-20151001.075217-207/shade-axiom-xml-1.2.16-20151001.075217-207-javadoc.jar
[JENKINS] Archiving <https://builds.apache.org/job/axiom-trunk/ws/axiom/axiom-all/pom.xml>
to org.apache.ws.commons.axiom/axiom-all/1.2.16-SNAPSHOT/axiom-all-1.2.16-SNAPSHOT.pom
[JENKINS] Archiving <https://builds.apache.org/job/axiom-trunk/ws/axiom/axiom-all/target/axiom-all-1.2.16-SNAPSHOT.jar>
to org.apache.ws.commons.axiom/axiom-all/1.2.16-SNAPSHOT/axiom-all-1.2.16-SNAPSHOT.jar
[JENKINS] Archiving <https://builds.apache.org/job/axiom-trunk/ws/axiom/axiom-all/target/axiom-all-1.2.16-SNAPSHOT-sources.jar>
to org.apache.ws.commons.axiom/axiom-all/1.2.16-SNAPSHOT/axiom-all-1.2.16-SNAPSHOT-sources.jar
[JENKINS] Archiving <https://builds.apache.org/job/axiom-trunk/ws/axiom/systests/spring-ws-tests/pom.xml>
to org.apache.ws.commons.axiom/spring-ws-tests/1.2.16-SNAPSHOT/spring-ws-tests-1.2.16-SNAPSHOT.pom
[JENKINS] Archiving <https://builds.apache.org/job/axiom-trunk/ws/axiom/devguide/pom.xml>
to org.apache.ws.commons.axiom/devguide/1.2.16-SNAPSHOT/devguide-1.2.16-SNAPSHOT.pom
[JENKINS] Archiving <https://builds.apache.org/job/axiom-trunk/ws/axiom/implementations/pom.xml>
to org.apache.ws.commons.axiom/implementations/1.2.16-SNAPSHOT/implementations-1.2.16-SNAPSHOT.pom
[JENKINS] Archiving <https://builds.apache.org/job/axiom-trunk/ws/axiom/implementations/target/implementations-1.2.16-SNAPSHOT-site.xml>
to org.apache.ws.commons.axiom/implementations/1.2.16-20151001.075716-207/implementations-1.2.16-20151001.075716-207-site.xml
[JENKINS] Archiving <https://builds.apache.org/job/axiom-trunk/ws/axiom/implementations/axiom-dom/pom.xml>
to org.apache.ws.commons.axiom/axiom-dom/1.2.16-SNAPSHOT/axiom-dom-1.2.16-SNAPSHOT.pom
[JENKINS] Archiving <https://builds.apache.org/job/axiom-trunk/ws/axiom/implementations/axiom-dom/target/axiom-dom-1.2.16-SNAPSHOT.jar>
to org.apache.ws.commons.axiom/axiom-dom/1.2.16-20151001.080351-206/axiom-dom-1.2.16-20151001.080351-206.jar
[JENKINS] Archiving <https://builds.apache.org/job/axiom-trunk/ws/axiom/implementations/axiom-dom/target/axiom-dom-1.2.16-SNAPSHOT-sources.jar>
to org.apache.ws.commons.axiom/axiom-dom/1.2.16-20151001.080351-206/axiom-dom-1.2.16-20151001.080351-206-sources.jar
[JENKINS] Archiving <https://builds.apache.org/job/axiom-trunk/ws/axiom/implementations/axiom-dom/target/jacoco.exec>
to org.apache.ws.commons.axiom/axiom-dom/1.2.16-20151001.080351-206/axiom-dom-1.2.16-20151001.080351-206-jacoco.exec
[JENKINS] Archiving <https://builds.apache.org/job/axiom-trunk/ws/axiom/implementations/axiom-dom/target/axiom-dom-1.2.16-SNAPSHOT-javadoc.jar>
to org.apache.ws.commons.axiom/axiom-dom/1.2.16-20151001.080351-206/axiom-dom-1.2.16-20151001.080351-206-javadoc.jar
[JENKINS] Archiving <https://builds.apache.org/job/axiom-trunk/ws/axiom/samples/pom.xml>
to org.apache.ws.commons.axiom/samples/1.2.16-SNAPSHOT/samples-1.2.16-SNAPSHOT.pom
[JENKINS] Archiving <https://builds.apache.org/job/axiom-trunk/ws/axiom/samples/target/samples-1.2.16-SNAPSHOT.jar>
to org.apache.ws.commons.axiom/samples/1.2.16-SNAPSHOT/samples-1.2.16-SNAPSHOT.jar
[JENKINS] Archiving <https://builds.apache.org/job/axiom-trunk/ws/axiom/samples/target/jacoco.exec>
to org.apache.ws.commons.axiom/samples/1.2.16-SNAPSHOT/samples-1.2.16-SNAPSHOT-jacoco.exec
[JENKINS] Archiving <https://builds.apache.org/job/axiom-trunk/ws/axiom/samples/target/samples-1.2.16-SNAPSHOT-sources.jar>
to org.apache.ws.commons.axiom/samples/1.2.16-SNAPSHOT/samples-1.2.16-SNAPSHOT-sources.jar
[JENKINS] Archiving <https://builds.apache.org/job/axiom-trunk/ws/axiom/buildutils/shade-osgi/pom.xml>
to org.apache.ws.commons.axiom/shade-osgi/1.2.16-SNAPSHOT/shade-osgi-1.2.16-SNAPSHOT.pom
[JENKINS] Archiving <https://builds.apache.org/job/axiom-trunk/ws/axiom/buildutils/shade-osgi/target/shade-osgi-1.2.16-SNAPSHOT.jar>
to org.apache.ws.commons.axiom/shade-osgi/1.2.16-20151001.075225-207/shade-osgi-1.2.16-20151001.075225-207.jar
[JENKINS] Archiving <https://builds.apache.org/job/axiom-trunk/ws/axiom/buildutils/shade-osgi/target/shade-osgi-1.2.16-SNAPSHOT-sources.jar>
to org.apache.ws.commons.axiom/shade-osgi/1.2.16-20151001.075225-207/shade-osgi-1.2.16-20151001.075225-207-sources.jar
[JENKINS] Archiving <https://builds.apache.org/job/axiom-trunk/ws/axiom/buildutils/shade-osgi/target/shade-osgi-1.2.16-SNAPSHOT-javadoc.jar>
to org.apache.ws.commons.axiom/shade-osgi/1.2.16-20151001.075225-207/shade-osgi-1.2.16-20151001.075225-207-javadoc.jar
[JENKINS] Archiving <https://builds.apache.org/job/axiom-trunk/ws/axiom/axiom-c14n/pom.xml>
to org.apache.ws.commons.axiom/axiom-c14n/1.2.16-SNAPSHOT/axiom-c14n-1.2.16-SNAPSHOT.pom
[JENKINS] Archiving <https://builds.apache.org/job/axiom-trunk/ws/axiom/axiom-c14n/target/axiom-c14n-1.2.16-SNAPSHOT.jar>
to org.apache.ws.commons.axiom/axiom-c14n/1.2.16-20151001.080426-206/axiom-c14n-1.2.16-20151001.080426-206.jar
[JENKINS] Archiving <https://builds.apache.org/job/axiom-trunk/ws/axiom/axiom-c14n/target/jacoco.exec>
to org.apache.ws.commons.axiom/axiom-c14n/1.2.16-20151001.080426-206/axiom-c14n-1.2.16-20151001.080426-206-jacoco.exec
[JENKINS] Archiving <https://builds.apache.org/job/axiom-trunk/ws/axiom/axiom-c14n/target/axiom-c14n-1.2.16-SNAPSHOT-sources.jar>
to org.apache.ws.commons.axiom/axiom-c14n/1.2.16-20151001.080426-206/axiom-c14n-1.2.16-20151001.080426-206-sources.jar
[JENKINS] Archiving <https://builds.apache.org/job/axiom-trunk/ws/axiom/axiom-c14n/target/axiom-c14n-1.2.16-SNAPSHOT-javadoc.jar>
to org.apache.ws.commons.axiom/axiom-c14n/1.2.16-20151001.080426-206/axiom-c14n-1.2.16-20151001.080426-206-javadoc.jar
[JENKINS] Archiving <https://builds.apache.org/job/axiom-trunk/ws/axiom/pom.xml> to
org.apache.ws.commons.axiom/axiom/1.2.16-SNAPSHOT/axiom-1.2.16-SNAPSHOT.pom
[JENKINS] Archiving <https://builds.apache.org/job/axiom-trunk/ws/axiom/target/axiom-1.2.16-SNAPSHOT-site.xml>
to org.apache.ws.commons.axiom/axiom/1.2.16-20151001.075155-208/axiom-1.2.16-20151001.075155-208-site.xml
[JENKINS] Archiving <https://builds.apache.org/job/axiom-trunk/ws/axiom/buildutils/jar-resource-bundle/pom.xml>
to org.apache.ws.commons.axiom/jar-resource-bundle/1.2.16-SNAPSHOT/jar-resource-bundle-1.2.16-SNAPSHOT.pom
[JENKINS] Archiving <https://builds.apache.org/job/axiom-trunk/ws/axiom/buildutils/jar-resource-bundle/target/jar-resource-bundle-1.2.16-SNAPSHOT.jar>
to org.apache.ws.commons.axiom/jar-resource-bundle/1.2.16-20151001.075208-208/jar-resource-bundle-1.2.16-20151001.075208-208.jar
[JENKINS] Archiving <https://builds.apache.org/job/axiom-trunk/ws/axiom/buildutils/jar-resource-bundle/target/jar-resource-bundle-1.2.16-SNAPSHOT-sources.jar>
to org.apache.ws.commons.axiom/jar-resource-bundle/1.2.16-20151001.075208-208/jar-resource-bundle-1.2.16-20151001.075208-208-sources.jar
[JENKINS] Archiving <https://builds.apache.org/job/axiom-trunk/ws/axiom/testing/dom-testsuite/pom.xml>
to org.apache.ws.commons.axiom/dom-testsuite/1.2.16-SNAPSHOT/dom-testsuite-1.2.16-SNAPSHOT.pom
[JENKINS] Archiving <https://builds.apache.org/job/axiom-trunk/ws/axiom/testing/dom-testsuite/target/dom-testsuite-1.2.16-SNAPSHOT.jar>
to org.apache.ws.commons.axiom/dom-testsuite/1.2.16-20151001.080039-206/dom-testsuite-1.2.16-20151001.080039-206.jar
[JENKINS] Archiving <https://builds.apache.org/job/axiom-trunk/ws/axiom/testing/dom-testsuite/target/jacoco.exec>
to org.apache.ws.commons.axiom/dom-testsuite/1.2.16-20151001.080039-206/dom-testsuite-1.2.16-20151001.080039-206-jacoco.exec
[JENKINS] Archiving <https://builds.apache.org/job/axiom-trunk/ws/axiom/testing/dom-testsuite/target/dom-testsuite-1.2.16-SNAPSHOT-sources.jar>
to org.apache.ws.commons.axiom/dom-testsuite/1.2.16-20151001.080039-206/dom-testsuite-1.2.16-20151001.080039-206-sources.jar
[JENKINS] Archiving <https://builds.apache.org/job/axiom-trunk/ws/axiom/testing/dom-testsuite/target/dom-testsuite-1.2.16-SNAPSHOT-javadoc.jar>
to org.apache.ws.commons.axiom/dom-testsuite/1.2.16-20151001.080039-206/dom-testsuite-1.2.16-20151001.080039-206-javadoc.jar
Compressed 13.76 MB of artifacts by 19.8% relative to #2326
[JENKINS] Archiving <https://builds.apache.org/job/axiom-trunk/ws/axiom/testing/axiom-truth/pom.xml>
to org.apache.ws.commons.axiom/axiom-truth/1.2.16-SNAPSHOT/axiom-truth-1.2.16-SNAPSHOT.pom
[JENKINS] Archiving <https://builds.apache.org/job/axiom-trunk/ws/axiom/testing/axiom-truth/target/axiom-truth-1.2.16-SNAPSHOT.jar>
to org.apache.ws.commons.axiom/axiom-truth/1.2.16-20151001.075629-207/axiom-truth-1.2.16-20151001.075629-207.jar
[JENKINS] Archiving <https://builds.apache.org/job/axiom-trunk/ws/axiom/testing/axiom-truth/target/axiom-truth-1.2.16-SNAPSHOT-sources.jar>
to org.apache.ws.commons.axiom/axiom-truth/1.2.16-20151001.075629-207/axiom-truth-1.2.16-20151001.075629-207-sources.jar
[JENKINS] Archiving <https://builds.apache.org/job/axiom-trunk/ws/axiom/testing/axiom-truth/target/axiom-truth-1.2.16-SNAPSHOT-javadoc.jar>
to org.apache.ws.commons.axiom/axiom-truth/1.2.16-20151001.075629-207/axiom-truth-1.2.16-20151001.075629-207-javadoc.jar
[JENKINS] Archiving <https://builds.apache.org/job/axiom-trunk/ws/axiom/aspects/dom-aspects/pom.xml>
to org.apache.ws.commons.axiom/dom-aspects/1.2.16-SNAPSHOT/dom-aspects-1.2.16-SNAPSHOT.pom
[JENKINS] Archiving <https://builds.apache.org/job/axiom-trunk/ws/axiom/aspects/dom-aspects/target/dom-aspects-1.2.16-SNAPSHOT.jar>
to org.apache.ws.commons.axiom/dom-aspects/1.2.16-20151001.075939-207/dom-aspects-1.2.16-20151001.075939-207.jar
[JENKINS] Archiving <https://builds.apache.org/job/axiom-trunk/ws/axiom/aspects/dom-aspects/target/jacoco.exec>
to org.apache.ws.commons.axiom/dom-aspects/1.2.16-20151001.075939-207/dom-aspects-1.2.16-20151001.075939-207-jacoco.exec
[JENKINS] Archiving <https://builds.apache.org/job/axiom-trunk/ws/axiom/aspects/dom-aspects/target/dom-aspects-1.2.16-SNAPSHOT-sources.jar>
to org.apache.ws.commons.axiom/dom-aspects/1.2.16-20151001.075939-207/dom-aspects-1.2.16-20151001.075939-207-sources.jar
[JENKINS] Archiving <https://builds.apache.org/job/axiom-trunk/ws/axiom/aspects/dom-aspects/target/dom-aspects-1.2.16-SNAPSHOT-javadoc.jar>
to org.apache.ws.commons.axiom/dom-aspects/1.2.16-20151001.075939-207/dom-aspects-1.2.16-20151001.075939-207-javadoc.jar
[JENKINS] Archiving <https://builds.apache.org/job/axiom-trunk/ws/axiom/code-coverage/pom.xml>
to org.apache.ws.commons.axiom/code-coverage/1.2.16-SNAPSHOT/code-coverage-1.2.16-SNAPSHOT.pom
[JENKINS] Archiving <https://builds.apache.org/job/axiom-trunk/ws/axiom/systests/cross-om-tests/pom.xml>
to org.apache.ws.commons.axiom/cross-om-tests/1.2.16-SNAPSHOT/cross-om-tests-1.2.16-SNAPSHOT.pom
[JENKINS] Archiving <https://builds.apache.org/job/axiom-trunk/ws/axiom/systests/cross-om-tests/target/cross-om-tests-1.2.16-SNAPSHOT.jar>
to org.apache.ws.commons.axiom/cross-om-tests/1.2.16-SNAPSHOT/cross-om-tests-1.2.16-SNAPSHOT.jar
[JENKINS] Archiving <https://builds.apache.org/job/axiom-trunk/ws/axiom/systests/cross-om-tests/target/jacoco.exec>
to org.apache.ws.commons.axiom/cross-om-tests/1.2.16-SNAPSHOT/cross-om-tests-1.2.16-SNAPSHOT-jacoco.exec
[JENKINS] Archiving <https://builds.apache.org/job/axiom-trunk/ws/axiom/systests/cross-om-tests/target/cross-om-tests-1.2.16-SNAPSHOT-sources.jar>
to org.apache.ws.commons.axiom/cross-om-tests/1.2.16-SNAPSHOT/cross-om-tests-1.2.16-SNAPSHOT-sources.jar
[JENKINS] Archiving <https://builds.apache.org/job/axiom-trunk/ws/axiom/testing/saaj-testsuite/pom.xml>
to org.apache.ws.commons.axiom/saaj-testsuite/1.2.16-SNAPSHOT/saaj-testsuite-1.2.16-SNAPSHOT.pom
[JENKINS] Archiving <https://builds.apache.org/job/axiom-trunk/ws/axiom/testing/spring-ws-testsuite/pom.xml>
to org.apache.ws.commons.axiom/spring-ws-testsuite/1.2.16-SNAPSHOT/spring-ws-testsuite-1.2.16-SNAPSHOT.pom
[JENKINS] Archiving <https://builds.apache.org/job/axiom-trunk/ws/axiom/systests/eclipse-tests/pom.xml>
to org.apache.ws.commons.axiom/eclipse-tests/1.2.16-SNAPSHOT/eclipse-tests-1.2.16-SNAPSHOT.pom
[JENKINS] Archiving <https://builds.apache.org/job/axiom-trunk/ws/axiom/systests/eclipse-tests/target/it/project/target/jacoco.exec>
to org.apache.ws.commons.axiom/eclipse-tests/1.2.16-SNAPSHOT/eclipse-tests-1.2.16-SNAPSHOT-jacoco.exec
[JENKINS] Archiving <https://builds.apache.org/job/axiom-trunk/ws/axiom/systests/jboss-tests/pom.xml>
to org.apache.ws.commons.axiom/jboss-tests/1.2.16-SNAPSHOT/jboss-tests-1.2.16-SNAPSHOT.pom
[JENKINS] Archiving <https://builds.apache.org/job/axiom-trunk/ws/axiom/testing/axiom-testsuite/pom.xml>
to org.apache.ws.commons.axiom/axiom-testsuite/1.2.16-SNAPSHOT/axiom-testsuite-1.2.16-SNAPSHOT.pom
[JENKINS] Archiving <https://builds.apache.org/job/axiom-trunk/ws/axiom/testing/axiom-testsuite/target/axiom-testsuite-1.2.16-SNAPSHOT.jar>
to org.apache.ws.commons.axiom/axiom-testsuite/1.2.16-20151001.075711-207/axiom-testsuite-1.2.16-20151001.075711-207.jar
[JENKINS] Archiving <https://builds.apache.org/job/axiom-trunk/ws/axiom/testing/axiom-testsuite/target/axiom-testsuite-1.2.16-SNAPSHOT-sources.jar>
to org.apache.ws.commons.axiom/axiom-testsuite/1.2.16-20151001.075711-207/axiom-testsuite-1.2.16-20151001.075711-207-sources.jar
[JENKINS] Archiving <https://builds.apache.org/job/axiom-trunk/ws/axiom/testing/axiom-testsuite/target/axiom-testsuite-1.2.16-SNAPSHOT-javadoc.jar>
to org.apache.ws.commons.axiom/axiom-testsuite/1.2.16-20151001.075711-207/axiom-testsuite-1.2.16-20151001.075711-207-javadoc.jar
Compressed 4.78 MB of artifacts by 14.4% relative to #2326
[JENKINS] Archiving <https://builds.apache.org/job/axiom-trunk/ws/axiom/testing/jaxen-testsuite/pom.xml>
to org.apache.ws.commons.axiom/jaxen-testsuite/1.2.16-SNAPSHOT/jaxen-testsuite-1.2.16-SNAPSHOT.pom
[JENKINS] Archiving <https://builds.apache.org/job/axiom-trunk/ws/axiom/testing/jaxen-testsuite/target/jaxen-testsuite-1.2.16-SNAPSHOT.jar>
to org.apache.ws.commons.axiom/jaxen-testsuite/1.2.16-20151001.075636-207/jaxen-testsuite-1.2.16-20151001.075636-207.jar
[JENKINS] Archiving <https://builds.apache.org/job/axiom-trunk/ws/axiom/testing/jaxen-testsuite/target/jaxen-testsuite-1.2.16-SNAPSHOT-sources.jar>
to org.apache.ws.commons.axiom/jaxen-testsuite/1.2.16-20151001.075636-207/jaxen-testsuite-1.2.16-20151001.075636-207-sources.jar
[JENKINS] Archiving <https://builds.apache.org/job/axiom-trunk/ws/axiom/testing/jaxen-testsuite/target/jaxen-testsuite-1.2.16-SNAPSHOT-javadoc.jar>
to org.apache.ws.commons.axiom/jaxen-testsuite/1.2.16-20151001.075636-207/jaxen-testsuite-1.2.16-20151001.075636-207-javadoc.jar
Compressed 258.97 KB of artifacts by 24.7% relative to #2326
[JENKINS] Archiving <https://builds.apache.org/job/axiom-trunk/ws/axiom/systests/pom.xml>
to org.apache.ws.commons.axiom/systests/1.2.16-SNAPSHOT/systests-1.2.16-SNAPSHOT.pom
[JENKINS] Archiving <https://builds.apache.org/job/axiom-trunk/ws/axiom/distribution/pom.xml>
to org.apache.ws.commons.axiom/distribution/1.2.16-SNAPSHOT/distribution-1.2.16-SNAPSHOT.pom
[JENKINS] Archiving <https://builds.apache.org/job/axiom-trunk/ws/axiom/aspects/shared-aspects/pom.xml>
to org.apache.ws.commons.axiom/shared-aspects/1.2.16-SNAPSHOT/shared-aspects-1.2.16-SNAPSHOT.pom
[JENKINS] Archiving <https://builds.apache.org/job/axiom-trunk/ws/axiom/aspects/shared-aspects/target/shared-aspects-1.2.16-SNAPSHOT.jar>
to org.apache.ws.commons.axiom/shared-aspects/1.2.16-20151001.075544-140/shared-aspects-1.2.16-20151001.075544-140.jar
[JENKINS] Archiving <https://builds.apache.org/job/axiom-trunk/ws/axiom/aspects/shared-aspects/target/shared-aspects-1.2.16-SNAPSHOT-sources.jar>
to org.apache.ws.commons.axiom/shared-aspects/1.2.16-20151001.075544-140/shared-aspects-1.2.16-20151001.075544-140-sources.jar
[JENKINS] Archiving <https://builds.apache.org/job/axiom-trunk/ws/axiom/aspects/shared-aspects/target/shared-aspects-1.2.16-SNAPSHOT-javadoc.jar>
to org.apache.ws.commons.axiom/shared-aspects/1.2.16-20151001.075544-140/shared-aspects-1.2.16-20151001.075544-140-javadoc.jar
[JENKINS] Archiving <https://builds.apache.org/job/axiom-trunk/ws/axiom/testing/fom-testsuite/pom.xml>
to org.apache.ws.commons.axiom/fom-testsuite/1.2.16-SNAPSHOT/fom-testsuite-1.2.16-SNAPSHOT.pom
[JENKINS] Archiving <https://builds.apache.org/job/axiom-trunk/ws/axiom/testing/xml-truth/pom.xml>
to org.apache.ws.commons.axiom/xml-truth/1.2.16-SNAPSHOT/xml-truth-1.2.16-SNAPSHOT.pom
[JENKINS] Archiving <https://builds.apache.org/job/axiom-trunk/ws/axiom/testing/xml-truth/target/xml-truth-1.2.16-SNAPSHOT.jar>
to org.apache.ws.commons.axiom/xml-truth/1.2.16-20151001.075320-207/xml-truth-1.2.16-20151001.075320-207.jar
[JENKINS] Archiving <https://builds.apache.org/job/axiom-trunk/ws/axiom/testing/xml-truth/target/jacoco.exec>
to org.apache.ws.commons.axiom/xml-truth/1.2.16-20151001.075320-207/xml-truth-1.2.16-20151001.075320-207-jacoco.exec
[JENKINS] Archiving <https://builds.apache.org/job/axiom-trunk/ws/axiom/testing/xml-truth/target/xml-truth-1.2.16-SNAPSHOT-sources.jar>
to org.apache.ws.commons.axiom/xml-truth/1.2.16-20151001.075320-207/xml-truth-1.2.16-20151001.075320-207-sources.jar
[JENKINS] Archiving <https://builds.apache.org/job/axiom-trunk/ws/axiom/testing/xml-truth/target/xml-truth-1.2.16-SNAPSHOT-javadoc.jar>
to org.apache.ws.commons.axiom/xml-truth/1.2.16-20151001.075320-207/xml-truth-1.2.16-20151001.075320-207-javadoc.jar
[JENKINS] Archiving <https://builds.apache.org/job/axiom-trunk/ws/axiom/testing/multiton/pom.xml>
to org.apache.ws.commons.axiom/multiton/1.2.16-SNAPSHOT/multiton-1.2.16-SNAPSHOT.pom
[JENKINS] Archiving <https://builds.apache.org/job/axiom-trunk/ws/axiom/testing/multiton/target/multiton-1.2.16-SNAPSHOT.jar>
to org.apache.ws.commons.axiom/multiton/1.2.16-20151001.075237-207/multiton-1.2.16-20151001.075237-207.jar
[JENKINS] Archiving <https://builds.apache.org/job/axiom-trunk/ws/axiom/testing/multiton/target/multiton-1.2.16-SNAPSHOT-sources.jar>
to org.apache.ws.commons.axiom/multiton/1.2.16-20151001.075237-207/multiton-1.2.16-20151001.075237-207-sources.jar
[JENKINS] Archiving <https://builds.apache.org/job/axiom-trunk/ws/axiom/testing/multiton/target/multiton-1.2.16-SNAPSHOT-javadoc.jar>
to org.apache.ws.commons.axiom/multiton/1.2.16-20151001.075237-207/multiton-1.2.16-20151001.075237-207-javadoc.jar
[JENKINS] Archiving <https://builds.apache.org/job/axiom-trunk/ws/axiom/apidocs/pom.xml>
to org.apache.ws.commons.axiom/apidocs/1.2.16-SNAPSHOT/apidocs-1.2.16-SNAPSHOT.pom
[JENKINS] Archiving <https://builds.apache.org/job/axiom-trunk/ws/axiom/testing/pom.xml>
to org.apache.ws.commons.axiom/testing/1.2.16-SNAPSHOT/testing-1.2.16-SNAPSHOT.pom
[JENKINS] Archiving <https://builds.apache.org/job/axiom-trunk/ws/axiom/testing/target/testing-1.2.16-SNAPSHOT-site.xml>
to org.apache.ws.commons.axiom/testing/1.2.16-20151001.075231-207/testing-1.2.16-20151001.075231-207-site.xml
[JENKINS] Archiving <https://builds.apache.org/job/axiom-trunk/ws/axiom/axiom-api/pom.xml>
to org.apache.ws.commons.axiom/axiom-api/1.2.16-SNAPSHOT/axiom-api-1.2.16-SNAPSHOT.pom
[JENKINS] Archiving <https://builds.apache.org/job/axiom-trunk/ws/axiom/axiom-api/target/axiom-api-1.2.16-SNAPSHOT.jar>
to org.apache.ws.commons.axiom/axiom-api/1.2.16-20151001.075520-207/axiom-api-1.2.16-20151001.075520-207.jar
[JENKINS] Archiving <https://builds.apache.org/job/axiom-trunk/ws/axiom/axiom-api/target/jacoco.exec>
to org.apache.ws.commons.axiom/axiom-api/1.2.16-20151001.075520-207/axiom-api-1.2.16-20151001.075520-207-jacoco.exec
[JENKINS] Archiving <https://builds.apache.org/job/axiom-trunk/ws/axiom/axiom-api/target/axiom-api-1.2.16-SNAPSHOT-sources.jar>
to org.apache.ws.commons.axiom/axiom-api/1.2.16-20151001.075520-207/axiom-api-1.2.16-20151001.075520-207-sources.jar
[JENKINS] Archiving <https://builds.apache.org/job/axiom-trunk/ws/axiom/axiom-api/target/axiom-api-1.2.16-SNAPSHOT-javadoc.jar>
to org.apache.ws.commons.axiom/axiom-api/1.2.16-20151001.075520-207/axiom-api-1.2.16-20151001.075520-207-javadoc.jar
[JENKINS] Archiving <https://builds.apache.org/job/axiom-trunk/ws/axiom/axiom-api/target/axiom-api-1.2.16-SNAPSHOT-tests.jar>
to org.apache.ws.commons.axiom/axiom-api/1.2.16-20151001.075520-207/axiom-api-1.2.16-20151001.075520-207-tests.jar
Compressed 2.77 MB of artifacts by 19.2% relative to #2326
[JENKINS] Archiving <https://builds.apache.org/job/axiom-trunk/ws/axiom/userguide/pom.xml>
to org.apache.ws.commons.axiom/userguide/1.2.16-SNAPSHOT/userguide-1.2.16-SNAPSHOT.pom
[JENKINS] Archiving <https://builds.apache.org/job/axiom-trunk/ws/axiom/aspects/core-aspects/pom.xml>
to org.apache.ws.commons.axiom/core-aspects/1.2.16-SNAPSHOT/core-aspects-1.2.16-SNAPSHOT.pom
[JENKINS] Archiving <https://builds.apache.org/job/axiom-trunk/ws/axiom/aspects/core-aspects/target/core-aspects-1.2.16-SNAPSHOT.jar>
to org.apache.ws.commons.axiom/core-aspects/1.2.16-20151001.075538-207/core-aspects-1.2.16-20151001.075538-207.jar
[JENKINS] Archiving <https://builds.apache.org/job/axiom-trunk/ws/axiom/aspects/core-aspects/target/core-aspects-1.2.16-SNAPSHOT-sources.jar>
to org.apache.ws.commons.axiom/core-aspects/1.2.16-20151001.075538-207/core-aspects-1.2.16-20151001.075538-207-sources.jar
[JENKINS] Archiving <https://builds.apache.org/job/axiom-trunk/ws/axiom/aspects/core-aspects/target/core-aspects-1.2.16-SNAPSHOT-javadoc.jar>
to org.apache.ws.commons.axiom/core-aspects/1.2.16-20151001.075538-207/core-aspects-1.2.16-20151001.075538-207-javadoc.jar
[JENKINS] Archiving <https://builds.apache.org/job/axiom-trunk/ws/axiom/systests/old-tests/pom.xml>
to org.apache.ws.commons.axiom/old-tests/1.2.16-SNAPSHOT/old-tests-1.2.16-SNAPSHOT.pom
[JENKINS] Archiving <https://builds.apache.org/job/axiom-trunk/ws/axiom/aspects/fom-aspects/pom.xml>
to org.apache.ws.commons.axiom/fom-aspects/1.2.16-SNAPSHOT/fom-aspects-1.2.16-SNAPSHOT.pom
[JENKINS] Archiving <https://builds.apache.org/job/axiom-trunk/ws/axiom/systests/osgi-tests/pom.xml>
to org.apache.ws.commons.axiom/osgi-tests/1.2.16-SNAPSHOT/osgi-tests-1.2.16-SNAPSHOT.pom
[JENKINS] Archiving <https://builds.apache.org/job/axiom-trunk/ws/axiom/testing/xml-testsuite/pom.xml>
to org.apache.ws.commons.axiom/xml-testsuite/1.2.16-SNAPSHOT/xml-testsuite-1.2.16-SNAPSHOT.pom
[JENKINS] Archiving <https://builds.apache.org/job/axiom-trunk/ws/axiom/testing/xml-testsuite/target/xml-testsuite-1.2.16-SNAPSHOT.jar>
to org.apache.ws.commons.axiom/xml-testsuite/1.2.16-20151001.075304-207/xml-testsuite-1.2.16-20151001.075304-207.jar
[JENKINS] Archiving <https://builds.apache.org/job/axiom-trunk/ws/axiom/testing/xml-testsuite/target/xml-testsuite-1.2.16-SNAPSHOT-sources.jar>
to org.apache.ws.commons.axiom/xml-testsuite/1.2.16-20151001.075304-207/xml-testsuite-1.2.16-20151001.075304-207-sources.jar
[JENKINS] Archiving <https://builds.apache.org/job/axiom-trunk/ws/axiom/testing/xml-testsuite/target/xml-testsuite-1.2.16-SNAPSHOT-javadoc.jar>
to org.apache.ws.commons.axiom/xml-testsuite/1.2.16-20151001.075304-207/xml-testsuite-1.2.16-20151001.075304-207-javadoc.jar
[JENKINS] Archiving <https://builds.apache.org/job/axiom-trunk/ws/axiom/testing/soap-testsuite/pom.xml>
to org.apache.ws.commons.axiom/soap-testsuite/1.2.16-SNAPSHOT/soap-testsuite-1.2.16-SNAPSHOT.pom
[JENKINS] Archiving <https://builds.apache.org/job/axiom-trunk/ws/axiom/testing/soap-testsuite/target/soap-testsuite-1.2.16-SNAPSHOT.jar>
to org.apache.ws.commons.axiom/soap-testsuite/1.2.16-20151001.075334-207/soap-testsuite-1.2.16-20151001.075334-207.jar
[JENKINS] Archiving <https://builds.apache.org/job/axiom-trunk/ws/axiom/testing/soap-testsuite/target/jacoco.exec>
to org.apache.ws.commons.axiom/soap-testsuite/1.2.16-20151001.075334-207/soap-testsuite-1.2.16-20151001.075334-207-jacoco.exec
[JENKINS] Archiving <https://builds.apache.org/job/axiom-trunk/ws/axiom/testing/soap-testsuite/target/soap-testsuite-1.2.16-SNAPSHOT-sources.jar>
to org.apache.ws.commons.axiom/soap-testsuite/1.2.16-20151001.075334-207/soap-testsuite-1.2.16-20151001.075334-207-sources.jar
[JENKINS] Archiving <https://builds.apache.org/job/axiom-trunk/ws/axiom/testing/soap-testsuite/target/soap-testsuite-1.2.16-SNAPSHOT-javadoc.jar>
to org.apache.ws.commons.axiom/soap-testsuite/1.2.16-20151001.075334-207/soap-testsuite-1.2.16-20151001.075334-207-javadoc.jar
Compressed 410.29 KB of artifacts by 46.8% relative to #2326
Sending e-mails to: dev@ws.apache.org
channel stopped

---------------------------------------------------------------------
To unsubscribe, e-mail: dev-unsubscribe@ws.apache.org
For additional commands, e-mail: dev-help@ws.apache.org


Mime
View raw message