ws-dev mailing list archives

Site index · List index
Message view « Date » · « Thread »
Top « Date » · « Thread »
From Apache Jenkins Server <jenk...@builds.apache.org>
Subject Build failed in Jenkins: axiom-1.2.x #39
Date Mon, 26 Sep 2016 07:56:00 GMT
See <https://builds.apache.org/job/axiom-1.2.x/39/changes>

Changes:

[veithen] Merge r1762241 to the 1.2 branch.

[veithen] Merge r1762239 to the 1.2 branch.

------------------------------------------
[...truncated 19727 lines...]

-------------------------------------------------------
 T E S T S
-------------------------------------------------------
Running org.apache.axiom.systest.jboss.DialectTest

Results :

Tests run: 0, Failures: 0, Errors: 0, Skipped: 0

[JENKINS] Recording test results
[INFO] ------------------------------------------------------------------------
[INFO] Reactor Summary:
[INFO] 
[INFO] Axiom .............................................. SUCCESS [ 35.661 s]
[INFO] Build utilities .................................... SUCCESS [  6.594 s]
[INFO] JAR Resource Bundle ................................ SUCCESS [ 12.705 s]
[INFO] Resource Transformer for META-INF/axiom.xml files .. SUCCESS [ 25.072 s]
[INFO] Resource Transformer for OSGi Manifests ............ SUCCESS [ 15.874 s]
[INFO] javadoc-postprocessor-plugin ....................... SUCCESS [ 20.876 s]
[INFO] no-package-cycles-enforcer-rule .................... SUCCESS [ 15.623 s]
[INFO] Testing ............................................ SUCCESS [  7.395 s]
[INFO] Multiton pattern implementation .................... SUCCESS [ 15.015 s]
[INFO] Axiom Test Utilities ............................... SUCCESS [ 37.838 s]
[INFO] XML Test Suite ..................................... SUCCESS [ 19.067 s]
[INFO] jaxp-testsuite ..................................... SUCCESS [ 15.820 s]
[INFO] Google Truth extension for XML ..................... SUCCESS [ 28.783 s]
[INFO] components ......................................... SUCCESS [ 20.667 s]
[INFO] xml-utils .......................................... SUCCESS [ 25.994 s]
[INFO] SOAP Test Suite .................................... SUCCESS [ 25.109 s]
[INFO] Axiom API .......................................... SUCCESS [02:24 min]
[INFO] Aspects ............................................ SUCCESS [  8.987 s]
[INFO] Core Aspects ....................................... SUCCESS [ 24.218 s]
[INFO] Shared Aspects ..................................... SUCCESS [ 20.948 s]
[INFO] OM Aspects ......................................... SUCCESS [ 51.093 s]
[INFO] Google Truth extension for Axiom ................... SUCCESS [ 18.070 s]
[INFO] Jaxen Test Suite ................................... SUCCESS [ 19.686 s]
[INFO] Axiom Implementation Test Suite .................... SUCCESS [01:03 min]
[INFO] Implementations .................................... SUCCESS [  8.276 s]
[INFO] LLOM ............................................... SUCCESS [05:03 min]
[INFO] DOM Aspects ........................................ SUCCESS [ 24.923 s]
[INFO] DOM Test Suite ..................................... SUCCESS [02:05 min]
[INFO] DOOM ............................................... SUCCESS [05:59 min]
[INFO] Axiom Compatibility Classes ........................ SUCCESS [ 35.668 s]
[INFO] Axiom JAXB Integration ............................. SUCCESS [ 57.005 s]
[INFO] Axiom C14N ......................................... SUCCESS [ 31.408 s]
[INFO] Axiom Uber-JAR ..................................... SUCCESS [  3.878 s]
[INFO] Samples ............................................ SUCCESS [ 22.221 s]
[INFO] System Tests ....................................... SUCCESS [  2.590 s]
[INFO] Cross OM Tests ..................................... SUCCESS [  9.816 s]
[INFO] Eclipse Tests ...................................... SUCCESS [04:31 min]
[INFO] JBoss Tests ........................................ FAILURE [01:34 min]
[INFO] Axiom Test Suite (old) ............................. SKIPPED
[INFO] Axiom OSGi Tests ................................... SKIPPED
[INFO] Spring-WS Test Suite ............................... SKIPPED
[INFO] Spring WS Tests .................................... SKIPPED
[INFO] WSS4J Tests ........................................ SKIPPED
[INFO] Developer Guide .................................... SKIPPED
[INFO] User Guide ......................................... SKIPPED
[INFO] Javadoc ............................................ SKIPPED
[INFO] FOM Aspects ........................................ SKIPPED
[INFO] FOM Test Suite ..................................... SKIPPED
[INFO] Abdera Model (FOM) Implementation .................. SKIPPED
[INFO] Distribution ....................................... SKIPPED
[INFO] Code Coverage Report ............................... SKIPPED
[INFO] SAAJ Test Suite .................................... SKIPPED
[INFO] ------------------------------------------------------------------------
[INFO] BUILD FAILURE
[INFO] ------------------------------------------------------------------------
[INFO] Total time: 35:24 min
[INFO] Finished at: 2016-09-26T07:53:21+00:00
[INFO] Final Memory: 106M/241M
[INFO] ------------------------------------------------------------------------
Waiting for Jenkins to finish collecting data
[ERROR] Failed to execute goal org.apache.maven.plugins:maven-failsafe-plugin:2.19:integration-test
(default) on project jboss-tests: Execution default of goal org.apache.maven.plugins:maven-failsafe-plugin:2.19:integration-test
failed: The forked VM terminated without properly saying goodbye. VM crash or System.exit
called?
[ERROR] Command was /bin/sh -c cd <https://builds.apache.org/job/axiom-1.2.x/ws/axiom/systests/jboss-tests>
&& /usr/local/asfpackages/java/jdk1.8.0_102/jre/bin/java -javaagent:<https://builds.apache.org/job/axiom-1.2.x/ws/.repository/org/jacoco/org.jacoco.agent/0.7.5.201505241946/org.jacoco.agent-0.7.5.201505241946-runtime.jar=destfile=/home/jenkins/jenkins-slave/workspace/axiom-1.2.x/axiom/systests/jboss-tests/target/jacoco.exec,sessionid=mvn>:org.apache.ws.commons.axiom:jboss-tests:1.2.20-SNAPSHOT:failsafe
-jar <https://builds.apache.org/job/axiom-1.2.x/ws/axiom/systests/jboss-tests/target/surefire/surefirebooter142268010274442898.jar>
<https://builds.apache.org/job/axiom-1.2.x/ws/axiom/systests/jboss-tests/target/surefire/surefire5143427647315810378tmp>
<https://builds.apache.org/job/axiom-1.2.x/ws/axiom/systests/jboss-tests/target/surefire/surefire_02047001705170338944tmp>
[ERROR] -> [Help 1]
[ERROR] 
[ERROR] To see the full stack trace of the errors, re-run Maven with the -e switch.
[ERROR] Re-run Maven using the -X switch to enable full debug logging.
[ERROR] 
[ERROR] For more information about the errors and possible solutions, please read the following
articles:
[ERROR] [Help 1] http://cwiki.apache.org/confluence/display/MAVEN/PluginExecutionException
[ERROR] 
[ERROR] After correcting the problems, you can resume the build with the command
[ERROR]   mvn <goals> -rf :jboss-tests
[JENKINS] Archiving <https://builds.apache.org/job/axiom-1.2.x/ws/axiom/aspects/core-aspects/pom.xml>
to org.apache.ws.commons.axiom/core-aspects/1.2.20-SNAPSHOT/core-aspects-1.2.20-SNAPSHOT.pom
[JENKINS] Archiving <https://builds.apache.org/job/axiom-1.2.x/ws/axiom/aspects/core-aspects/target/core-aspects-1.2.20-SNAPSHOT.jar>
to org.apache.ws.commons.axiom/core-aspects/1.2.20-20160926.072657-7/core-aspects-1.2.20-20160926.072657-7.jar
[JENKINS] Archiving <https://builds.apache.org/job/axiom-1.2.x/ws/axiom/aspects/core-aspects/target/core-aspects-1.2.20-SNAPSHOT-sources.jar>
to org.apache.ws.commons.axiom/core-aspects/1.2.20-20160926.072657-7/core-aspects-1.2.20-20160926.072657-7-sources.jar
[JENKINS] Archiving <https://builds.apache.org/job/axiom-1.2.x/ws/axiom/aspects/core-aspects/target/core-aspects-1.2.20-SNAPSHOT-javadoc.jar>
to org.apache.ws.commons.axiom/core-aspects/1.2.20-20160926.072657-7/core-aspects-1.2.20-20160926.072657-7-javadoc.jar
[JENKINS] Archiving <https://builds.apache.org/job/axiom-1.2.x/ws/axiom/components/xml-utils/pom.xml>
to org.apache.ws.commons.axiom/xml-utils/1.2.20-SNAPSHOT/xml-utils-1.2.20-SNAPSHOT.pom
[JENKINS] Archiving <https://builds.apache.org/job/axiom-1.2.x/ws/axiom/components/xml-utils/target/xml-utils-1.2.20-SNAPSHOT.jar>
to org.apache.ws.commons.axiom/xml-utils/1.2.20-20160926.072322-7/xml-utils-1.2.20-20160926.072322-7.jar
[JENKINS] Archiving <https://builds.apache.org/job/axiom-1.2.x/ws/axiom/components/xml-utils/target/xml-utils-1.2.20-SNAPSHOT-sources.jar>
to org.apache.ws.commons.axiom/xml-utils/1.2.20-20160926.072322-7/xml-utils-1.2.20-20160926.072322-7-sources.jar
[JENKINS] Archiving <https://builds.apache.org/job/axiom-1.2.x/ws/axiom/components/xml-utils/target/xml-utils-1.2.20-SNAPSHOT-javadoc.jar>
to org.apache.ws.commons.axiom/xml-utils/1.2.20-20160926.072322-7/xml-utils-1.2.20-20160926.072322-7-javadoc.jar
[JENKINS] Archiving <https://builds.apache.org/job/axiom-1.2.x/ws/axiom/components/xml-utils/target/jacoco.exec>
to org.apache.ws.commons.axiom/xml-utils/1.2.20-20160926.072322-7/xml-utils-1.2.20-20160926.072322-7-jacoco.exec
[JENKINS] Archiving <https://builds.apache.org/job/axiom-1.2.x/ws/axiom/axiom-c14n/pom.xml>
to org.apache.ws.commons.axiom/axiom-c14n/1.2.20-SNAPSHOT/axiom-c14n-1.2.20-SNAPSHOT.pom
[JENKINS] Archiving <https://builds.apache.org/job/axiom-1.2.x/ws/axiom/axiom-c14n/target/axiom-c14n-1.2.20-SNAPSHOT.jar>
to org.apache.ws.commons.axiom/axiom-c14n/1.2.20-20160926.074606-7/axiom-c14n-1.2.20-20160926.074606-7.jar
[JENKINS] Archiving <https://builds.apache.org/job/axiom-1.2.x/ws/axiom/axiom-c14n/target/axiom-c14n-1.2.20-SNAPSHOT-sources.jar>
to org.apache.ws.commons.axiom/axiom-c14n/1.2.20-20160926.074606-7/axiom-c14n-1.2.20-20160926.074606-7-sources.jar
[JENKINS] Archiving <https://builds.apache.org/job/axiom-1.2.x/ws/axiom/axiom-c14n/target/axiom-c14n-1.2.20-SNAPSHOT-javadoc.jar>
to org.apache.ws.commons.axiom/axiom-c14n/1.2.20-20160926.074606-7/axiom-c14n-1.2.20-20160926.074606-7-javadoc.jar
[JENKINS] Archiving <https://builds.apache.org/job/axiom-1.2.x/ws/axiom/axiom-c14n/target/jacoco.exec>
to org.apache.ws.commons.axiom/axiom-c14n/1.2.20-20160926.074606-7/axiom-c14n-1.2.20-20160926.074606-7-jacoco.exec
[JENKINS] Archiving <https://builds.apache.org/job/axiom-1.2.x/ws/axiom/systests/wss4j-tests/pom.xml>
to org.apache.ws.commons.axiom/wss4j-tests/1.2.20-SNAPSHOT/wss4j-tests-1.2.20-SNAPSHOT.pom
[JENKINS] Archiving <https://builds.apache.org/job/axiom-1.2.x/ws/axiom/pom.xml> to
org.apache.ws.commons.axiom/axiom/1.2.20-SNAPSHOT/axiom-1.2.20-SNAPSHOT.pom
[JENKINS] Archiving <https://builds.apache.org/job/axiom-1.2.x/ws/axiom/target/axiom-1.2.20-SNAPSHOT-site.xml>
to org.apache.ws.commons.axiom/axiom/1.2.20-20160926.071840-7/axiom-1.2.20-20160926.071840-7-site.xml
Compressed 65.15 KB of artifacts by 49.1% relative to #38
[JENKINS] Archiving <https://builds.apache.org/job/axiom-1.2.x/ws/axiom/testing/soap-testsuite/pom.xml>
to org.apache.ws.commons.axiom/soap-testsuite/1.2.20-SNAPSHOT/soap-testsuite-1.2.20-SNAPSHOT.pom
[JENKINS] Archiving <https://builds.apache.org/job/axiom-1.2.x/ws/axiom/testing/soap-testsuite/target/soap-testsuite-1.2.20-SNAPSHOT.jar>
to org.apache.ws.commons.axiom/soap-testsuite/1.2.20-20160926.072347-7/soap-testsuite-1.2.20-20160926.072347-7.jar
[JENKINS] Archiving <https://builds.apache.org/job/axiom-1.2.x/ws/axiom/testing/soap-testsuite/target/soap-testsuite-1.2.20-SNAPSHOT-sources.jar>
to org.apache.ws.commons.axiom/soap-testsuite/1.2.20-20160926.072347-7/soap-testsuite-1.2.20-20160926.072347-7-sources.jar
[JENKINS] Archiving <https://builds.apache.org/job/axiom-1.2.x/ws/axiom/testing/soap-testsuite/target/soap-testsuite-1.2.20-SNAPSHOT-javadoc.jar>
to org.apache.ws.commons.axiom/soap-testsuite/1.2.20-20160926.072347-7/soap-testsuite-1.2.20-20160926.072347-7-javadoc.jar
[JENKINS] Archiving <https://builds.apache.org/job/axiom-1.2.x/ws/axiom/testing/soap-testsuite/target/jacoco.exec>
to org.apache.ws.commons.axiom/soap-testsuite/1.2.20-20160926.072347-7/soap-testsuite-1.2.20-20160926.072347-7-jacoco.exec
Compressed 400.79 KB of artifacts by 31.9% relative to #38
[JENKINS] Archiving <https://builds.apache.org/job/axiom-1.2.x/ws/axiom/userguide/pom.xml>
to org.apache.ws.commons.axiom/userguide/1.2.20-SNAPSHOT/userguide-1.2.20-SNAPSHOT.pom
[JENKINS] Archiving <https://builds.apache.org/job/axiom-1.2.x/ws/axiom/devguide/pom.xml>
to org.apache.ws.commons.axiom/devguide/1.2.20-SNAPSHOT/devguide-1.2.20-SNAPSHOT.pom
[JENKINS] Archiving <https://builds.apache.org/job/axiom-1.2.x/ws/axiom/buildutils/jar-resource-bundle/pom.xml>
to org.apache.ws.commons.axiom/jar-resource-bundle/1.2.20-SNAPSHOT/jar-resource-bundle-1.2.20-SNAPSHOT.pom
[JENKINS] Archiving <https://builds.apache.org/job/axiom-1.2.x/ws/axiom/buildutils/jar-resource-bundle/target/jar-resource-bundle-1.2.20-SNAPSHOT.jar>
to org.apache.ws.commons.axiom/jar-resource-bundle/1.2.20-20160926.071901-7/jar-resource-bundle-1.2.20-20160926.071901-7.jar
[JENKINS] Archiving <https://builds.apache.org/job/axiom-1.2.x/ws/axiom/buildutils/jar-resource-bundle/target/jar-resource-bundle-1.2.20-SNAPSHOT-sources.jar>
to org.apache.ws.commons.axiom/jar-resource-bundle/1.2.20-20160926.071901-7/jar-resource-bundle-1.2.20-20160926.071901-7-sources.jar
[JENKINS] Archiving <https://builds.apache.org/job/axiom-1.2.x/ws/axiom/testing/pom.xml>
to org.apache.ws.commons.axiom/testing/1.2.20-SNAPSHOT/testing-1.2.20-SNAPSHOT.pom
[JENKINS] Archiving <https://builds.apache.org/job/axiom-1.2.x/ws/axiom/testing/target/testing-1.2.20-SNAPSHOT-site.xml>
to org.apache.ws.commons.axiom/testing/1.2.20-20160926.072033-7/testing-1.2.20-20160926.072033-7-site.xml
[JENKINS] Archiving <https://builds.apache.org/job/axiom-1.2.x/ws/axiom/buildutils/javadoc-postprocessor-plugin/pom.xml>
to org.apache.ws.commons.axiom/javadoc-postprocessor-plugin/1.2.20-SNAPSHOT/javadoc-postprocessor-plugin-1.2.20-SNAPSHOT.pom
[JENKINS] Archiving <https://builds.apache.org/job/axiom-1.2.x/ws/axiom/buildutils/javadoc-postprocessor-plugin/target/javadoc-postprocessor-plugin-1.2.20-SNAPSHOT.jar>
to org.apache.ws.commons.axiom/javadoc-postprocessor-plugin/1.2.20-20160926.072003-7/javadoc-postprocessor-plugin-1.2.20-20160926.072003-7.jar
[JENKINS] Archiving <https://builds.apache.org/job/axiom-1.2.x/ws/axiom/buildutils/javadoc-postprocessor-plugin/target/javadoc-postprocessor-plugin-1.2.20-SNAPSHOT-sources.jar>
to org.apache.ws.commons.axiom/javadoc-postprocessor-plugin/1.2.20-20160926.072003-7/javadoc-postprocessor-plugin-1.2.20-20160926.072003-7-sources.jar
[JENKINS] Archiving <https://builds.apache.org/job/axiom-1.2.x/ws/axiom/buildutils/javadoc-postprocessor-plugin/target/javadoc-postprocessor-plugin-1.2.20-SNAPSHOT-javadoc.jar>
to org.apache.ws.commons.axiom/javadoc-postprocessor-plugin/1.2.20-20160926.072003-7/javadoc-postprocessor-plugin-1.2.20-20160926.072003-7-javadoc.jar
[JENKINS] Archiving <https://builds.apache.org/job/axiom-1.2.x/ws/axiom/systests/osgi-tests/pom.xml>
to org.apache.ws.commons.axiom/osgi-tests/1.2.20-SNAPSHOT/osgi-tests-1.2.20-SNAPSHOT.pom
[JENKINS] Archiving <https://builds.apache.org/job/axiom-1.2.x/ws/axiom/testing/saaj-testsuite/pom.xml>
to org.apache.ws.commons.axiom/saaj-testsuite/1.2.20-SNAPSHOT/saaj-testsuite-1.2.20-SNAPSHOT.pom
[JENKINS] Archiving <https://builds.apache.org/job/axiom-1.2.x/ws/axiom/systests/cross-om-tests/pom.xml>
to org.apache.ws.commons.axiom/cross-om-tests/1.2.20-SNAPSHOT/cross-om-tests-1.2.20-SNAPSHOT.pom
[JENKINS] Archiving <https://builds.apache.org/job/axiom-1.2.x/ws/axiom/systests/cross-om-tests/target/cross-om-tests-1.2.20-SNAPSHOT.jar>
to org.apache.ws.commons.axiom/cross-om-tests/1.2.20-SNAPSHOT/cross-om-tests-1.2.20-SNAPSHOT.jar
[JENKINS] Archiving <https://builds.apache.org/job/axiom-1.2.x/ws/axiom/systests/cross-om-tests/target/cross-om-tests-1.2.20-SNAPSHOT-sources.jar>
to org.apache.ws.commons.axiom/cross-om-tests/1.2.20-SNAPSHOT/cross-om-tests-1.2.20-SNAPSHOT-sources.jar
[JENKINS] Archiving <https://builds.apache.org/job/axiom-1.2.x/ws/axiom/systests/cross-om-tests/target/jacoco.exec>
to org.apache.ws.commons.axiom/cross-om-tests/1.2.20-SNAPSHOT/cross-om-tests-1.2.20-SNAPSHOT-jacoco.exec
[JENKINS] Archiving <https://builds.apache.org/job/axiom-1.2.x/ws/axiom/testing/spring-ws-testsuite/pom.xml>
to org.apache.ws.commons.axiom/spring-ws-testsuite/1.2.20-SNAPSHOT/spring-ws-testsuite-1.2.20-SNAPSHOT.pom
[JENKINS] Archiving <https://builds.apache.org/job/axiom-1.2.x/ws/axiom/aspects/dom-aspects/pom.xml>
to org.apache.ws.commons.axiom/dom-aspects/1.2.20-SNAPSHOT/dom-aspects-1.2.20-SNAPSHOT.pom
[JENKINS] Archiving <https://builds.apache.org/job/axiom-1.2.x/ws/axiom/aspects/dom-aspects/target/dom-aspects-1.2.20-SNAPSHOT.jar>
to org.apache.ws.commons.axiom/dom-aspects/1.2.20-20160926.073552-7/dom-aspects-1.2.20-20160926.073552-7.jar
[JENKINS] Archiving <https://builds.apache.org/job/axiom-1.2.x/ws/axiom/aspects/dom-aspects/target/dom-aspects-1.2.20-SNAPSHOT-sources.jar>
to org.apache.ws.commons.axiom/dom-aspects/1.2.20-20160926.073552-7/dom-aspects-1.2.20-20160926.073552-7-sources.jar
[JENKINS] Archiving <https://builds.apache.org/job/axiom-1.2.x/ws/axiom/aspects/dom-aspects/target/dom-aspects-1.2.20-SNAPSHOT-javadoc.jar>
to org.apache.ws.commons.axiom/dom-aspects/1.2.20-20160926.073552-7/dom-aspects-1.2.20-20160926.073552-7-javadoc.jar
[JENKINS] Archiving <https://builds.apache.org/job/axiom-1.2.x/ws/axiom/aspects/dom-aspects/target/jacoco.exec>
to org.apache.ws.commons.axiom/dom-aspects/1.2.20-20160926.073552-7/dom-aspects-1.2.20-20160926.073552-7-jacoco.exec
[JENKINS] Archiving <https://builds.apache.org/job/axiom-1.2.x/ws/axiom/implementations/axiom-dom/pom.xml>
to org.apache.ws.commons.axiom/axiom-dom/1.2.20-SNAPSHOT/axiom-dom-1.2.20-SNAPSHOT.pom
[JENKINS] Archiving <https://builds.apache.org/job/axiom-1.2.x/ws/axiom/implementations/axiom-dom/target/axiom-dom-1.2.20-SNAPSHOT.jar>
to org.apache.ws.commons.axiom/axiom-dom/1.2.20-20160926.074356-7/axiom-dom-1.2.20-20160926.074356-7.jar
[JENKINS] Archiving <https://builds.apache.org/job/axiom-1.2.x/ws/axiom/implementations/axiom-dom/target/axiom-dom-1.2.20-SNAPSHOT-sources.jar>
to org.apache.ws.commons.axiom/axiom-dom/1.2.20-20160926.074356-7/axiom-dom-1.2.20-20160926.074356-7-sources.jar
[JENKINS] Archiving <https://builds.apache.org/job/axiom-1.2.x/ws/axiom/implementations/axiom-dom/target/axiom-dom-1.2.20-SNAPSHOT-javadoc.jar>
to org.apache.ws.commons.axiom/axiom-dom/1.2.20-20160926.074356-7/axiom-dom-1.2.20-20160926.074356-7-javadoc.jar
[JENKINS] Archiving <https://builds.apache.org/job/axiom-1.2.x/ws/axiom/implementations/axiom-dom/target/jacoco.exec>
to org.apache.ws.commons.axiom/axiom-dom/1.2.20-20160926.074356-7/axiom-dom-1.2.20-20160926.074356-7-jacoco.exec
[JENKINS] Archiving <https://builds.apache.org/job/axiom-1.2.x/ws/axiom/testing/jaxp-testsuite/pom.xml>
to org.apache.ws.commons.axiom/jaxp-testsuite/1.2.20-SNAPSHOT/jaxp-testsuite-1.2.20-SNAPSHOT.pom
[JENKINS] Archiving <https://builds.apache.org/job/axiom-1.2.x/ws/axiom/testing/jaxp-testsuite/target/jaxp-testsuite-1.2.20-SNAPSHOT.jar>
to org.apache.ws.commons.axiom/jaxp-testsuite/1.2.20-20160926.072203-7/jaxp-testsuite-1.2.20-20160926.072203-7.jar
[JENKINS] Archiving <https://builds.apache.org/job/axiom-1.2.x/ws/axiom/testing/jaxp-testsuite/target/jaxp-testsuite-1.2.20-SNAPSHOT-sources.jar>
to org.apache.ws.commons.axiom/jaxp-testsuite/1.2.20-20160926.072203-7/jaxp-testsuite-1.2.20-20160926.072203-7-sources.jar
[JENKINS] Archiving <https://builds.apache.org/job/axiom-1.2.x/ws/axiom/testing/jaxp-testsuite/target/jaxp-testsuite-1.2.20-SNAPSHOT-javadoc.jar>
to org.apache.ws.commons.axiom/jaxp-testsuite/1.2.20-20160926.072203-7/jaxp-testsuite-1.2.20-20160926.072203-7-javadoc.jar
[JENKINS] Archiving <https://builds.apache.org/job/axiom-1.2.x/ws/axiom/aspects/fom-aspects/pom.xml>
to org.apache.ws.commons.axiom/fom-aspects/1.2.20-SNAPSHOT/fom-aspects-1.2.20-SNAPSHOT.pom
[JENKINS] Archiving <https://builds.apache.org/job/axiom-1.2.x/ws/axiom/axiom-api/pom.xml>
to org.apache.ws.commons.axiom/axiom-api/1.2.20-SNAPSHOT/axiom-api-1.2.20-SNAPSHOT.pom
[JENKINS] Archiving <https://builds.apache.org/job/axiom-1.2.x/ws/axiom/axiom-api/target/axiom-api-1.2.20-SNAPSHOT.jar>
to org.apache.ws.commons.axiom/axiom-api/1.2.20-20160926.072609-7/axiom-api-1.2.20-20160926.072609-7.jar
[JENKINS] Archiving <https://builds.apache.org/job/axiom-1.2.x/ws/axiom/axiom-api/target/axiom-api-1.2.20-SNAPSHOT-sources.jar>
to org.apache.ws.commons.axiom/axiom-api/1.2.20-20160926.072609-7/axiom-api-1.2.20-20160926.072609-7-sources.jar
[JENKINS] Archiving <https://builds.apache.org/job/axiom-1.2.x/ws/axiom/axiom-api/target/axiom-api-1.2.20-SNAPSHOT-javadoc.jar>
to org.apache.ws.commons.axiom/axiom-api/1.2.20-20160926.072609-7/axiom-api-1.2.20-20160926.072609-7-javadoc.jar
[JENKINS] Archiving <https://builds.apache.org/job/axiom-1.2.x/ws/axiom/axiom-api/target/axiom-api-1.2.20-SNAPSHOT-tests.jar>
to org.apache.ws.commons.axiom/axiom-api/1.2.20-20160926.072609-7/axiom-api-1.2.20-20160926.072609-7-tests.jar
[JENKINS] Archiving <https://builds.apache.org/job/axiom-1.2.x/ws/axiom/axiom-api/target/jacoco.exec>
to org.apache.ws.commons.axiom/axiom-api/1.2.20-20160926.072609-7/axiom-api-1.2.20-20160926.072609-7-jacoco.exec
[JENKINS] Archiving <https://builds.apache.org/job/axiom-1.2.x/ws/axiom/testing/fom-testsuite/pom.xml>
to org.apache.ws.commons.axiom/fom-testsuite/1.2.20-SNAPSHOT/fom-testsuite-1.2.20-SNAPSHOT.pom
[JENKINS] Archiving <https://builds.apache.org/job/axiom-1.2.x/ws/axiom/testing/dom-testsuite/pom.xml>
to org.apache.ws.commons.axiom/dom-testsuite/1.2.20-SNAPSHOT/dom-testsuite-1.2.20-SNAPSHOT.pom
[JENKINS] Archiving <https://builds.apache.org/job/axiom-1.2.x/ws/axiom/testing/dom-testsuite/target/dom-testsuite-1.2.20-SNAPSHOT.jar>
to org.apache.ws.commons.axiom/dom-testsuite/1.2.20-20160926.073754-7/dom-testsuite-1.2.20-20160926.073754-7.jar
[JENKINS] Archiving <https://builds.apache.org/job/axiom-1.2.x/ws/axiom/testing/dom-testsuite/target/dom-testsuite-1.2.20-SNAPSHOT-sources.jar>
to org.apache.ws.commons.axiom/dom-testsuite/1.2.20-20160926.073754-7/dom-testsuite-1.2.20-20160926.073754-7-sources.jar
[JENKINS] Archiving <https://builds.apache.org/job/axiom-1.2.x/ws/axiom/testing/dom-testsuite/target/dom-testsuite-1.2.20-SNAPSHOT-javadoc.jar>
to org.apache.ws.commons.axiom/dom-testsuite/1.2.20-20160926.073754-7/dom-testsuite-1.2.20-20160926.073754-7-javadoc.jar
[JENKINS] Archiving <https://builds.apache.org/job/axiom-1.2.x/ws/axiom/testing/dom-testsuite/target/jacoco.exec>
to org.apache.ws.commons.axiom/dom-testsuite/1.2.20-20160926.073754-7/dom-testsuite-1.2.20-20160926.073754-7-jacoco.exec
[JENKINS] Archiving <https://builds.apache.org/job/axiom-1.2.x/ws/axiom/implementations/axiom-impl/pom.xml>
to org.apache.ws.commons.axiom/axiom-impl/1.2.20-SNAPSHOT/axiom-impl-1.2.20-SNAPSHOT.pom
[JENKINS] Archiving <https://builds.apache.org/job/axiom-1.2.x/ws/axiom/implementations/axiom-impl/target/axiom-impl-1.2.20-SNAPSHOT.jar>
to org.apache.ws.commons.axiom/axiom-impl/1.2.20-20160926.073521-7/axiom-impl-1.2.20-20160926.073521-7.jar
[JENKINS] Archiving <https://builds.apache.org/job/axiom-1.2.x/ws/axiom/implementations/axiom-impl/target/axiom-impl-1.2.20-SNAPSHOT-sources.jar>
to org.apache.ws.commons.axiom/axiom-impl/1.2.20-20160926.073521-7/axiom-impl-1.2.20-20160926.073521-7-sources.jar
[JENKINS] Archiving <https://builds.apache.org/job/axiom-1.2.x/ws/axiom/implementations/axiom-impl/target/axiom-impl-1.2.20-SNAPSHOT-javadoc.jar>
to org.apache.ws.commons.axiom/axiom-impl/1.2.20-20160926.073521-7/axiom-impl-1.2.20-20160926.073521-7-javadoc.jar
[JENKINS] Archiving <https://builds.apache.org/job/axiom-1.2.x/ws/axiom/implementations/axiom-impl/target/jacoco.exec>
to org.apache.ws.commons.axiom/axiom-impl/1.2.20-20160926.073521-7/axiom-impl-1.2.20-20160926.073521-7-jacoco.exec
[JENKINS] Archiving <https://builds.apache.org/job/axiom-1.2.x/ws/axiom/implementations/fom-impl/pom.xml>
to org.apache.ws.commons.axiom/fom-impl/1.2.20-SNAPSHOT/fom-impl-1.2.20-SNAPSHOT.pom
[JENKINS] Archiving <https://builds.apache.org/job/axiom-1.2.x/ws/axiom/testing/testutils/pom.xml>
to org.apache.ws.commons.axiom/testutils/1.2.20-SNAPSHOT/testutils-1.2.20-SNAPSHOT.pom
[JENKINS] Archiving <https://builds.apache.org/job/axiom-1.2.x/ws/axiom/testing/testutils/target/testutils-1.2.20-SNAPSHOT.jar>
to org.apache.ws.commons.axiom/testutils/1.2.20-20160926.072123-7/testutils-1.2.20-20160926.072123-7.jar
[JENKINS] Archiving <https://builds.apache.org/job/axiom-1.2.x/ws/axiom/testing/testutils/target/testutils-1.2.20-SNAPSHOT-sources.jar>
to org.apache.ws.commons.axiom/testutils/1.2.20-20160926.072123-7/testutils-1.2.20-20160926.072123-7-sources.jar
[JENKINS] Archiving <https://builds.apache.org/job/axiom-1.2.x/ws/axiom/testing/testutils/target/testutils-1.2.20-SNAPSHOT-javadoc.jar>
to org.apache.ws.commons.axiom/testutils/1.2.20-20160926.072123-7/testutils-1.2.20-20160926.072123-7-javadoc.jar
[JENKINS] Archiving <https://builds.apache.org/job/axiom-1.2.x/ws/axiom/testing/testutils/target/jacoco.exec>
to org.apache.ws.commons.axiom/testutils/1.2.20-20160926.072123-7/testutils-1.2.20-20160926.072123-7-jacoco.exec
[JENKINS] Archiving <https://builds.apache.org/job/axiom-1.2.x/ws/axiom/testing/xml-truth/pom.xml>
to org.apache.ws.commons.axiom/xml-truth/1.2.20-SNAPSHOT/xml-truth-1.2.20-SNAPSHOT.pom
[JENKINS] Archiving <https://builds.apache.org/job/axiom-1.2.x/ws/axiom/testing/xml-truth/target/xml-truth-1.2.20-SNAPSHOT.jar>
to org.apache.ws.commons.axiom/xml-truth/1.2.20-20160926.072230-7/xml-truth-1.2.20-20160926.072230-7.jar
[JENKINS] Archiving <https://builds.apache.org/job/axiom-1.2.x/ws/axiom/testing/xml-truth/target/xml-truth-1.2.20-SNAPSHOT-sources.jar>
to org.apache.ws.commons.axiom/xml-truth/1.2.20-20160926.072230-7/xml-truth-1.2.20-20160926.072230-7-sources.jar
[JENKINS] Archiving <https://builds.apache.org/job/axiom-1.2.x/ws/axiom/testing/xml-truth/target/xml-truth-1.2.20-SNAPSHOT-javadoc.jar>
to org.apache.ws.commons.axiom/xml-truth/1.2.20-20160926.072230-7/xml-truth-1.2.20-20160926.072230-7-javadoc.jar
[JENKINS] Archiving <https://builds.apache.org/job/axiom-1.2.x/ws/axiom/testing/xml-truth/target/jacoco.exec>
to org.apache.ws.commons.axiom/xml-truth/1.2.20-20160926.072230-7/xml-truth-1.2.20-20160926.072230-7-jacoco.exec
[JENKINS] Archiving <https://builds.apache.org/job/axiom-1.2.x/ws/axiom/apidocs/pom.xml>
to org.apache.ws.commons.axiom/apidocs/1.2.20-SNAPSHOT/apidocs-1.2.20-SNAPSHOT.pom
[JENKINS] Archiving <https://builds.apache.org/job/axiom-1.2.x/ws/axiom/testing/xml-testsuite/pom.xml>
to org.apache.ws.commons.axiom/xml-testsuite/1.2.20-SNAPSHOT/xml-testsuite-1.2.20-SNAPSHOT.pom
[JENKINS] Archiving <https://builds.apache.org/job/axiom-1.2.x/ws/axiom/testing/xml-testsuite/target/xml-testsuite-1.2.20-SNAPSHOT.jar>
to org.apache.ws.commons.axiom/xml-testsuite/1.2.20-20160926.072144-7/xml-testsuite-1.2.20-20160926.072144-7.jar
[JENKINS] Archiving <https://builds.apache.org/job/axiom-1.2.x/ws/axiom/testing/xml-testsuite/target/xml-testsuite-1.2.20-SNAPSHOT-sources.jar>
to org.apache.ws.commons.axiom/xml-testsuite/1.2.20-20160926.072144-7/xml-testsuite-1.2.20-20160926.072144-7-sources.jar
[JENKINS] Archiving <https://builds.apache.org/job/axiom-1.2.x/ws/axiom/testing/xml-testsuite/target/xml-testsuite-1.2.20-SNAPSHOT-javadoc.jar>
to org.apache.ws.commons.axiom/xml-testsuite/1.2.20-20160926.072144-7/xml-testsuite-1.2.20-20160926.072144-7-javadoc.jar
[JENKINS] Archiving <https://builds.apache.org/job/axiom-1.2.x/ws/axiom/samples/pom.xml>
to org.apache.ws.commons.axiom/samples/1.2.20-SNAPSHOT/samples-1.2.20-SNAPSHOT.pom
[JENKINS] Archiving <https://builds.apache.org/job/axiom-1.2.x/ws/axiom/samples/target/samples-1.2.20-SNAPSHOT.jar>
to org.apache.ws.commons.axiom/samples/1.2.20-SNAPSHOT/samples-1.2.20-SNAPSHOT.jar
[JENKINS] Archiving <https://builds.apache.org/job/axiom-1.2.x/ws/axiom/samples/target/samples-1.2.20-SNAPSHOT-sources.jar>
to org.apache.ws.commons.axiom/samples/1.2.20-SNAPSHOT/samples-1.2.20-SNAPSHOT-sources.jar
[JENKINS] Archiving <https://builds.apache.org/job/axiom-1.2.x/ws/axiom/samples/target/jacoco.exec>
to org.apache.ws.commons.axiom/samples/1.2.20-SNAPSHOT/samples-1.2.20-SNAPSHOT-jacoco.exec
[JENKINS] Archiving <https://builds.apache.org/job/axiom-1.2.x/ws/axiom/buildutils/pom.xml>
to org.apache.ws.commons.axiom/buildutils/1.2.20-SNAPSHOT/buildutils-1.2.20-SNAPSHOT.pom
[JENKINS] Archiving <https://builds.apache.org/job/axiom-1.2.x/ws/axiom/axiom-all/pom.xml>
to org.apache.ws.commons.axiom/axiom-all/1.2.20-SNAPSHOT/axiom-all-1.2.20-SNAPSHOT.pom
[JENKINS] Archiving <https://builds.apache.org/job/axiom-1.2.x/ws/axiom/axiom-all/target/axiom-all-1.2.20-SNAPSHOT.jar>
to org.apache.ws.commons.axiom/axiom-all/1.2.20-SNAPSHOT/axiom-all-1.2.20-SNAPSHOT.jar
[JENKINS] Archiving <https://builds.apache.org/job/axiom-1.2.x/ws/axiom/axiom-all/target/axiom-all-1.2.20-SNAPSHOT-sources.jar>
to org.apache.ws.commons.axiom/axiom-all/1.2.20-SNAPSHOT/axiom-all-1.2.20-SNAPSHOT-sources.jar
[JENKINS] Archiving <https://builds.apache.org/job/axiom-1.2.x/ws/axiom/code-coverage/pom.xml>
to org.apache.ws.commons.axiom/code-coverage/1.2.20-SNAPSHOT/code-coverage-1.2.20-SNAPSHOT.pom
[JENKINS] Archiving <https://builds.apache.org/job/axiom-1.2.x/ws/axiom/implementations/pom.xml>
to org.apache.ws.commons.axiom/implementations/1.2.20-SNAPSHOT/implementations-1.2.20-SNAPSHOT.pom
[JENKINS] Archiving <https://builds.apache.org/job/axiom-1.2.x/ws/axiom/implementations/target/implementations-1.2.20-SNAPSHOT-site.xml>
to org.apache.ws.commons.axiom/implementations/1.2.20-20160926.073024-7/implementations-1.2.20-20160926.073024-7-site.xml
[JENKINS] Archiving <https://builds.apache.org/job/axiom-1.2.x/ws/axiom/systests/pom.xml>
to org.apache.ws.commons.axiom/systests/1.2.20-SNAPSHOT/systests-1.2.20-SNAPSHOT.pom
[JENKINS] Archiving <https://builds.apache.org/job/axiom-1.2.x/ws/axiom/distribution/pom.xml>
to org.apache.ws.commons.axiom/distribution/1.2.20-SNAPSHOT/distribution-1.2.20-SNAPSHOT.pom
[JENKINS] Archiving <https://builds.apache.org/job/axiom-1.2.x/ws/axiom/testing/axiom-truth/pom.xml>
to org.apache.ws.commons.axiom/axiom-truth/1.2.20-SNAPSHOT/axiom-truth-1.2.20-SNAPSHOT.pom
[JENKINS] Archiving <https://builds.apache.org/job/axiom-1.2.x/ws/axiom/testing/axiom-truth/target/axiom-truth-1.2.20-SNAPSHOT.jar>
to org.apache.ws.commons.axiom/axiom-truth/1.2.20-20160926.072843-7/axiom-truth-1.2.20-20160926.072843-7.jar
[JENKINS] Archiving <https://builds.apache.org/job/axiom-1.2.x/ws/axiom/testing/axiom-truth/target/axiom-truth-1.2.20-SNAPSHOT-sources.jar>
to org.apache.ws.commons.axiom/axiom-truth/1.2.20-20160926.072843-7/axiom-truth-1.2.20-20160926.072843-7-sources.jar
[JENKINS] Archiving <https://builds.apache.org/job/axiom-1.2.x/ws/axiom/testing/axiom-truth/target/axiom-truth-1.2.20-SNAPSHOT-javadoc.jar>
to org.apache.ws.commons.axiom/axiom-truth/1.2.20-20160926.072843-7/axiom-truth-1.2.20-20160926.072843-7-javadoc.jar
[JENKINS] Archiving <https://builds.apache.org/job/axiom-1.2.x/ws/axiom/systests/jboss-tests/pom.xml>
to org.apache.ws.commons.axiom/jboss-tests/1.2.20-SNAPSHOT/jboss-tests-1.2.20-SNAPSHOT.pom
[JENKINS] Archiving <https://builds.apache.org/job/axiom-1.2.x/ws/axiom/systests/jboss-tests/target/jboss-tests-1.2.20-SNAPSHOT.jar>
to org.apache.ws.commons.axiom/jboss-tests/1.2.20-SNAPSHOT/jboss-tests-1.2.20-SNAPSHOT.jar
[JENKINS] Archiving <https://builds.apache.org/job/axiom-1.2.x/ws/axiom/systests/jboss-tests/target/jboss-tests-1.2.20-SNAPSHOT-sources.jar>
to org.apache.ws.commons.axiom/jboss-tests/1.2.20-SNAPSHOT/jboss-tests-1.2.20-SNAPSHOT-sources.jar
[JENKINS] Archiving <https://builds.apache.org/job/axiom-1.2.x/ws/axiom/systests/spring-ws-tests/pom.xml>
to org.apache.ws.commons.axiom/spring-ws-tests/1.2.20-SNAPSHOT/spring-ws-tests-1.2.20-SNAPSHOT.pom
[JENKINS] Archiving <https://builds.apache.org/job/axiom-1.2.x/ws/axiom/aspects/om-aspects/pom.xml>
to org.apache.ws.commons.axiom/om-aspects/1.2.20-SNAPSHOT/om-aspects-1.2.20-SNAPSHOT.pom
[JENKINS] Archiving <https://builds.apache.org/job/axiom-1.2.x/ws/axiom/aspects/om-aspects/target/om-aspects-1.2.20-SNAPSHOT.jar>
to org.apache.ws.commons.axiom/om-aspects/1.2.20-20160926.072817-7/om-aspects-1.2.20-20160926.072817-7.jar
[JENKINS] Archiving <https://builds.apache.org/job/axiom-1.2.x/ws/axiom/aspects/om-aspects/target/om-aspects-1.2.20-SNAPSHOT-sources.jar>
to org.apache.ws.commons.axiom/om-aspects/1.2.20-20160926.072817-7/om-aspects-1.2.20-20160926.072817-7-sources.jar
[JENKINS] Archiving <https://builds.apache.org/job/axiom-1.2.x/ws/axiom/aspects/om-aspects/target/om-aspects-1.2.20-SNAPSHOT-javadoc.jar>
to org.apache.ws.commons.axiom/om-aspects/1.2.20-20160926.072817-7/om-aspects-1.2.20-20160926.072817-7-javadoc.jar
[JENKINS] Archiving <https://builds.apache.org/job/axiom-1.2.x/ws/axiom/aspects/om-aspects/target/jacoco.exec>
to org.apache.ws.commons.axiom/om-aspects/1.2.20-20160926.072817-7/om-aspects-1.2.20-20160926.072817-7-jacoco.exec
Compressed 1.50 MB of artifacts by 27.0% relative to #38
[JENKINS] Archiving <https://builds.apache.org/job/axiom-1.2.x/ws/axiom/testing/jaxen-testsuite/pom.xml>
to org.apache.ws.commons.axiom/jaxen-testsuite/1.2.20-SNAPSHOT/jaxen-testsuite-1.2.20-SNAPSHOT.pom
[JENKINS] Archiving <https://builds.apache.org/job/axiom-1.2.x/ws/axiom/testing/jaxen-testsuite/target/jaxen-testsuite-1.2.20-SNAPSHOT.jar>
to org.apache.ws.commons.axiom/jaxen-testsuite/1.2.20-20160926.072906-7/jaxen-testsuite-1.2.20-20160926.072906-7.jar
[JENKINS] Archiving <https://builds.apache.org/job/axiom-1.2.x/ws/axiom/testing/jaxen-testsuite/target/jaxen-testsuite-1.2.20-SNAPSHOT-sources.jar>
to org.apache.ws.commons.axiom/jaxen-testsuite/1.2.20-20160926.072906-7/jaxen-testsuite-1.2.20-20160926.072906-7-sources.jar
[JENKINS] Archiving <https://builds.apache.org/job/axiom-1.2.x/ws/axiom/testing/jaxen-testsuite/target/jaxen-testsuite-1.2.20-SNAPSHOT-javadoc.jar>
to org.apache.ws.commons.axiom/jaxen-testsuite/1.2.20-20160926.072906-7/jaxen-testsuite-1.2.20-20160926.072906-7-javadoc.jar
Compressed 248.45 KB of artifacts by 25.8% relative to #38
[JENKINS] Archiving <https://builds.apache.org/job/axiom-1.2.x/ws/axiom/systests/eclipse-tests/pom.xml>
to org.apache.ws.commons.axiom/eclipse-tests/1.2.20-SNAPSHOT/eclipse-tests-1.2.20-SNAPSHOT.pom
[JENKINS] Archiving <https://builds.apache.org/job/axiom-1.2.x/ws/axiom/systests/eclipse-tests/target/it/project/target/jacoco.exec>
to org.apache.ws.commons.axiom/eclipse-tests/1.2.20-SNAPSHOT/eclipse-tests-1.2.20-SNAPSHOT-jacoco.exec
[JENKINS] Archiving <https://builds.apache.org/job/axiom-1.2.x/ws/axiom/aspects/shared-aspects/pom.xml>
to org.apache.ws.commons.axiom/shared-aspects/1.2.20-SNAPSHOT/shared-aspects-1.2.20-SNAPSHOT.pom
[JENKINS] Archiving <https://builds.apache.org/job/axiom-1.2.x/ws/axiom/aspects/shared-aspects/target/shared-aspects-1.2.20-SNAPSHOT.jar>
to org.apache.ws.commons.axiom/shared-aspects/1.2.20-20160926.072723-7/shared-aspects-1.2.20-20160926.072723-7.jar
[JENKINS] Archiving <https://builds.apache.org/job/axiom-1.2.x/ws/axiom/aspects/shared-aspects/target/shared-aspects-1.2.20-SNAPSHOT-sources.jar>
to org.apache.ws.commons.axiom/shared-aspects/1.2.20-20160926.072723-7/shared-aspects-1.2.20-20160926.072723-7-sources.jar
[JENKINS] Archiving <https://builds.apache.org/job/axiom-1.2.x/ws/axiom/aspects/shared-aspects/target/shared-aspects-1.2.20-SNAPSHOT-javadoc.jar>
to org.apache.ws.commons.axiom/shared-aspects/1.2.20-20160926.072723-7/shared-aspects-1.2.20-20160926.072723-7-javadoc.jar
[JENKINS] Archiving <https://builds.apache.org/job/axiom-1.2.x/ws/axiom/buildutils/shade-osgi/pom.xml>
to org.apache.ws.commons.axiom/shade-osgi/1.2.20-SNAPSHOT/shade-osgi-1.2.20-SNAPSHOT.pom
[JENKINS] Archiving <https://builds.apache.org/job/axiom-1.2.x/ws/axiom/buildutils/shade-osgi/target/shade-osgi-1.2.20-SNAPSHOT.jar>
to org.apache.ws.commons.axiom/shade-osgi/1.2.20-20160926.071942-7/shade-osgi-1.2.20-20160926.071942-7.jar
[JENKINS] Archiving <https://builds.apache.org/job/axiom-1.2.x/ws/axiom/buildutils/shade-osgi/target/shade-osgi-1.2.20-SNAPSHOT-sources.jar>
to org.apache.ws.commons.axiom/shade-osgi/1.2.20-20160926.071942-7/shade-osgi-1.2.20-20160926.071942-7-sources.jar
[JENKINS] Archiving <https://builds.apache.org/job/axiom-1.2.x/ws/axiom/buildutils/shade-osgi/target/shade-osgi-1.2.20-SNAPSHOT-javadoc.jar>
to org.apache.ws.commons.axiom/shade-osgi/1.2.20-20160926.071942-7/shade-osgi-1.2.20-20160926.071942-7-javadoc.jar
[JENKINS] Archiving <https://builds.apache.org/job/axiom-1.2.x/ws/axiom/buildutils/shade-axiom-xml/pom.xml>
to org.apache.ws.commons.axiom/shade-axiom-xml/1.2.20-SNAPSHOT/shade-axiom-xml-1.2.20-SNAPSHOT.pom
[JENKINS] Archiving <https://builds.apache.org/job/axiom-1.2.x/ws/axiom/buildutils/shade-axiom-xml/target/shade-axiom-xml-1.2.20-SNAPSHOT.jar>
to org.apache.ws.commons.axiom/shade-axiom-xml/1.2.20-20160926.071925-7/shade-axiom-xml-1.2.20-20160926.071925-7.jar
[JENKINS] Archiving <https://builds.apache.org/job/axiom-1.2.x/ws/axiom/buildutils/shade-axiom-xml/target/shade-axiom-xml-1.2.20-SNAPSHOT-sources.jar>
to org.apache.ws.commons.axiom/shade-axiom-xml/1.2.20-20160926.071925-7/shade-axiom-xml-1.2.20-20160926.071925-7-sources.jar
[JENKINS] Archiving <https://builds.apache.org/job/axiom-1.2.x/ws/axiom/buildutils/shade-axiom-xml/target/shade-axiom-xml-1.2.20-SNAPSHOT-javadoc.jar>
to org.apache.ws.commons.axiom/shade-axiom-xml/1.2.20-20160926.071925-7/shade-axiom-xml-1.2.20-20160926.071925-7-javadoc.jar
[JENKINS] Archiving <https://builds.apache.org/job/axiom-1.2.x/ws/axiom/axiom-jaxb/pom.xml>
to org.apache.ws.commons.axiom/axiom-jaxb/1.2.20-SNAPSHOT/axiom-jaxb-1.2.20-SNAPSHOT.pom
[JENKINS] Archiving <https://builds.apache.org/job/axiom-1.2.x/ws/axiom/axiom-jaxb/target/axiom-jaxb-1.2.20-SNAPSHOT.jar>
to org.apache.ws.commons.axiom/axiom-jaxb/1.2.20-20160926.074534-7/axiom-jaxb-1.2.20-20160926.074534-7.jar
[JENKINS] Archiving <https://builds.apache.org/job/axiom-1.2.x/ws/axiom/axiom-jaxb/target/axiom-jaxb-1.2.20-SNAPSHOT-sources.jar>
to org.apache.ws.commons.axiom/axiom-jaxb/1.2.20-20160926.074534-7/axiom-jaxb-1.2.20-20160926.074534-7-sources.jar
[JENKINS] Archiving <https://builds.apache.org/job/axiom-1.2.x/ws/axiom/axiom-jaxb/target/axiom-jaxb-1.2.20-SNAPSHOT-javadoc.jar>
to org.apache.ws.commons.axiom/axiom-jaxb/1.2.20-20160926.074534-7/axiom-jaxb-1.2.20-20160926.074534-7-javadoc.jar
[JENKINS] Archiving <https://builds.apache.org/job/axiom-1.2.x/ws/axiom/axiom-jaxb/target/jacoco.exec>
to org.apache.ws.commons.axiom/axiom-jaxb/1.2.20-20160926.074534-7/axiom-jaxb-1.2.20-20160926.074534-7-jacoco.exec
[JENKINS] Archiving <https://builds.apache.org/job/axiom-1.2.x/ws/axiom/testing/axiom-testsuite/pom.xml>
to org.apache.ws.commons.axiom/axiom-testsuite/1.2.20-SNAPSHOT/axiom-testsuite-1.2.20-SNAPSHOT.pom
[JENKINS] Archiving <https://builds.apache.org/job/axiom-1.2.x/ws/axiom/testing/axiom-testsuite/target/axiom-testsuite-1.2.20-SNAPSHOT.jar>
to org.apache.ws.commons.axiom/axiom-testsuite/1.2.20-20160926.073010-7/axiom-testsuite-1.2.20-20160926.073010-7.jar
[JENKINS] Archiving <https://builds.apache.org/job/axiom-1.2.x/ws/axiom/testing/axiom-testsuite/target/axiom-testsuite-1.2.20-SNAPSHOT-sources.jar>
to org.apache.ws.commons.axiom/axiom-testsuite/1.2.20-20160926.073010-7/axiom-testsuite-1.2.20-20160926.073010-7-sources.jar
[JENKINS] Archiving <https://builds.apache.org/job/axiom-1.2.x/ws/axiom/testing/axiom-testsuite/target/axiom-testsuite-1.2.20-SNAPSHOT-javadoc.jar>
to org.apache.ws.commons.axiom/axiom-testsuite/1.2.20-20160926.073010-7/axiom-testsuite-1.2.20-20160926.073010-7-javadoc.jar
[JENKINS] Archiving <https://builds.apache.org/job/axiom-1.2.x/ws/axiom/testing/multiton/pom.xml>
to org.apache.ws.commons.axiom/multiton/1.2.20-SNAPSHOT/multiton-1.2.20-SNAPSHOT.pom
[JENKINS] Archiving <https://builds.apache.org/job/axiom-1.2.x/ws/axiom/testing/multiton/target/multiton-1.2.20-SNAPSHOT.jar>
to org.apache.ws.commons.axiom/multiton/1.2.20-20160926.072046-7/multiton-1.2.20-20160926.072046-7.jar
[JENKINS] Archiving <https://builds.apache.org/job/axiom-1.2.x/ws/axiom/testing/multiton/target/multiton-1.2.20-SNAPSHOT-sources.jar>
to org.apache.ws.commons.axiom/multiton/1.2.20-20160926.072046-7/multiton-1.2.20-20160926.072046-7-sources.jar
[JENKINS] Archiving <https://builds.apache.org/job/axiom-1.2.x/ws/axiom/testing/multiton/target/multiton-1.2.20-SNAPSHOT-javadoc.jar>
to org.apache.ws.commons.axiom/multiton/1.2.20-20160926.072046-7/multiton-1.2.20-20160926.072046-7-javadoc.jar
[JENKINS] Archiving <https://builds.apache.org/job/axiom-1.2.x/ws/axiom/buildutils/no-package-cycles-enforcer-rule/pom.xml>
to org.apache.ws.commons.axiom/no-package-cycles-enforcer-rule/1.2.20-SNAPSHOT/no-package-cycles-enforcer-rule-1.2.20-SNAPSHOT.pom
[JENKINS] Archiving <https://builds.apache.org/job/axiom-1.2.x/ws/axiom/buildutils/no-package-cycles-enforcer-rule/target/no-package-cycles-enforcer-rule-1.2.20-SNAPSHOT.jar>
to org.apache.ws.commons.axiom/no-package-cycles-enforcer-rule/1.2.20-20160926.072021-7/no-package-cycles-enforcer-rule-1.2.20-20160926.072021-7.jar
[JENKINS] Archiving <https://builds.apache.org/job/axiom-1.2.x/ws/axiom/buildutils/no-package-cycles-enforcer-rule/target/no-package-cycles-enforcer-rule-1.2.20-SNAPSHOT-sources.jar>
to org.apache.ws.commons.axiom/no-package-cycles-enforcer-rule/1.2.20-20160926.072021-7/no-package-cycles-enforcer-rule-1.2.20-20160926.072021-7-sources.jar
[JENKINS] Archiving <https://builds.apache.org/job/axiom-1.2.x/ws/axiom/buildutils/no-package-cycles-enforcer-rule/target/no-package-cycles-enforcer-rule-1.2.20-SNAPSHOT-javadoc.jar>
to org.apache.ws.commons.axiom/no-package-cycles-enforcer-rule/1.2.20-20160926.072021-7/no-package-cycles-enforcer-rule-1.2.20-20160926.072021-7-javadoc.jar
[JENKINS] Archiving <https://builds.apache.org/job/axiom-1.2.x/ws/axiom/axiom-compat/pom.xml>
to org.apache.ws.commons.axiom/axiom-compat/1.2.20-SNAPSHOT/axiom-compat-1.2.20-SNAPSHOT.pom
[JENKINS] Archiving <https://builds.apache.org/job/axiom-1.2.x/ws/axiom/axiom-compat/target/axiom-compat-1.2.20-SNAPSHOT.jar>
to org.apache.ws.commons.axiom/axiom-compat/1.2.20-20160926.074436-7/axiom-compat-1.2.20-20160926.074436-7.jar
[JENKINS] Archiving <https://builds.apache.org/job/axiom-1.2.x/ws/axiom/axiom-compat/target/axiom-compat-1.2.20-SNAPSHOT-sources.jar>
to org.apache.ws.commons.axiom/axiom-compat/1.2.20-20160926.074436-7/axiom-compat-1.2.20-20160926.074436-7-sources.jar
[JENKINS] Archiving <https://builds.apache.org/job/axiom-1.2.x/ws/axiom/axiom-compat/target/axiom-compat-1.2.20-SNAPSHOT-javadoc.jar>
to org.apache.ws.commons.axiom/axiom-compat/1.2.20-20160926.074436-7/axiom-compat-1.2.20-20160926.074436-7-javadoc.jar
[JENKINS] Archiving <https://builds.apache.org/job/axiom-1.2.x/ws/axiom/axiom-compat/target/jacoco.exec>
to org.apache.ws.commons.axiom/axiom-compat/1.2.20-20160926.074436-7/axiom-compat-1.2.20-20160926.074436-7-jacoco.exec
[JENKINS] Archiving <https://builds.apache.org/job/axiom-1.2.x/ws/axiom/systests/old-tests/pom.xml>
to org.apache.ws.commons.axiom/old-tests/1.2.20-SNAPSHOT/old-tests-1.2.20-SNAPSHOT.pom
[JENKINS] Archiving <https://builds.apache.org/job/axiom-1.2.x/ws/axiom/components/pom.xml>
to org.apache.ws.commons.axiom/components/1.2.20-SNAPSHOT/components-1.2.20-SNAPSHOT.pom
[JENKINS] Archiving <https://builds.apache.org/job/axiom-1.2.x/ws/axiom/aspects/pom.xml>
to org.apache.ws.commons.axiom/aspects/1.2.20-SNAPSHOT/aspects-1.2.20-SNAPSHOT.pom
Sending e-mails to: dev@ws.apache.org
channel stopped

---------------------------------------------------------------------
To unsubscribe, e-mail: dev-unsubscribe@ws.apache.org
For additional commands, e-mail: dev-help@ws.apache.org


Mime
View raw message