ws-dev mailing list archives

Site index · List index
Message view « Date » · « Thread »
Top « Date » · « Thread »
From Apache Jenkins Server <jenk...@builds.apache.org>
Subject Build failed in Jenkins: axiom-1.2.x #43
Date Sun, 08 Jan 2017 18:20:52 GMT
See <https://builds.apache.org/job/axiom-1.2.x/43/changes>

Changes:

[veithen] Merge r1777898 to the 1.2 branch.

------------------------------------------
[...truncated 7208 lines...]
[INFO] 
[INFO] --- maven-gpg-plugin:1.6:sign (sign-release-artifacts) @ javadoc-postprocessor-plugin
---
[INFO] 
[INFO] --- apache-rat-plugin:0.11:check (default) @ javadoc-postprocessor-plugin ---
[INFO] 51 implicit excludes (use -debug for more details).
[INFO] Exclude: RELEASE-NOTE.txt
[INFO] Exclude: src/site/markdown/release-notes/**
[INFO] Exclude: **/*.svg
[INFO] Exclude: legal/jaxen-LICENSE.txt
[INFO] Exclude: legal/stax2-api-LICENSE.txt
[INFO] Exclude: *.sonarj
[INFO] Exclude: release.properties
[INFO] Exclude: src/test/resources/**
[INFO] Exclude: dependency-reduced-pom.xml
[INFO] 2 resources included (use -debug for more details)
[INFO] Rat check: Summary of files. Unapproved: 0 unknown: 0 generated: 0 approved: 2 licence.
[INFO] 
[INFO] --- maven-install-plugin:2.5.2:install (default-install) @ javadoc-postprocessor-plugin
---
[INFO] Installing <https://builds.apache.org/job/axiom-1.2.x/ws/axiom/buildutils/javadoc-postprocessor-plugin/target/javadoc-postprocessor-plugin-1.2.21-SNAPSHOT.jar>
to <https://builds.apache.org/job/axiom-1.2.x/ws/.repository/org/apache/ws/commons/axiom/javadoc-postprocessor-plugin/1.2.21-SNAPSHOT/javadoc-postprocessor-plugin-1.2.21-SNAPSHOT.jar>
[INFO] Installing <https://builds.apache.org/job/axiom-1.2.x/ws/axiom/buildutils/javadoc-postprocessor-plugin/pom.xml>
to <https://builds.apache.org/job/axiom-1.2.x/ws/.repository/org/apache/ws/commons/axiom/javadoc-postprocessor-plugin/1.2.21-SNAPSHOT/javadoc-postprocessor-plugin-1.2.21-SNAPSHOT.pom>
[INFO] Installing <https://builds.apache.org/job/axiom-1.2.x/ws/axiom/buildutils/javadoc-postprocessor-plugin/target/javadoc-postprocessor-plugin-1.2.21-SNAPSHOT-sources.jar>
to <https://builds.apache.org/job/axiom-1.2.x/ws/.repository/org/apache/ws/commons/axiom/javadoc-postprocessor-plugin/1.2.21-SNAPSHOT/javadoc-postprocessor-plugin-1.2.21-SNAPSHOT-sources.jar>
[INFO] Installing <https://builds.apache.org/job/axiom-1.2.x/ws/axiom/buildutils/javadoc-postprocessor-plugin/target/javadoc-postprocessor-plugin-1.2.21-SNAPSHOT-javadoc.jar>
to <https://builds.apache.org/job/axiom-1.2.x/ws/.repository/org/apache/ws/commons/axiom/javadoc-postprocessor-plugin/1.2.21-SNAPSHOT/javadoc-postprocessor-plugin-1.2.21-SNAPSHOT-javadoc.jar>
[INFO] 
[INFO] --- maven-deploy-plugin:2.8.2:deploy (default-deploy) @ javadoc-postprocessor-plugin
---
[INFO] Downloading: https://repository.apache.org/content/repositories/snapshots/org/apache/ws/commons/axiom/javadoc-postprocessor-plugin/1.2.21-SNAPSHOT/maven-metadata.xml
[INFO] Downloaded: https://repository.apache.org/content/repositories/snapshots/org/apache/ws/commons/axiom/javadoc-postprocessor-plugin/1.2.21-SNAPSHOT/maven-metadata.xml
(2 KB at 2.1 KB/sec)
[INFO] Uploading: https://repository.apache.org/content/repositories/snapshots/org/apache/ws/commons/axiom/javadoc-postprocessor-plugin/1.2.21-SNAPSHOT/javadoc-postprocessor-plugin-1.2.21-20170108.182112-3.jar
[INFO] Uploaded: https://repository.apache.org/content/repositories/snapshots/org/apache/ws/commons/axiom/javadoc-postprocessor-plugin/1.2.21-SNAPSHOT/javadoc-postprocessor-plugin-1.2.21-20170108.182112-3.jar
(14 KB at 14.4 KB/sec)
[INFO] Uploading: https://repository.apache.org/content/repositories/snapshots/org/apache/ws/commons/axiom/javadoc-postprocessor-plugin/1.2.21-SNAPSHOT/javadoc-postprocessor-plugin-1.2.21-20170108.182112-3.pom
[INFO] Uploaded: https://repository.apache.org/content/repositories/snapshots/org/apache/ws/commons/axiom/javadoc-postprocessor-plugin/1.2.21-SNAPSHOT/javadoc-postprocessor-plugin-1.2.21-20170108.182112-3.pom
(4 KB at 4.3 KB/sec)
[INFO] Downloading: https://repository.apache.org/content/repositories/snapshots/org/apache/ws/commons/axiom/javadoc-postprocessor-plugin/maven-metadata.xml
[INFO] Downloaded: https://repository.apache.org/content/repositories/snapshots/org/apache/ws/commons/axiom/javadoc-postprocessor-plugin/maven-metadata.xml
(437 B at 0.8 KB/sec)
[INFO] Downloading: https://repository.apache.org/content/repositories/snapshots/org/apache/ws/commons/axiom/maven-metadata.xml
[INFO] Downloaded: https://repository.apache.org/content/repositories/snapshots/org/apache/ws/commons/axiom/maven-metadata.xml
(469 B at 0.9 KB/sec)
[INFO] Uploading: https://repository.apache.org/content/repositories/snapshots/org/apache/ws/commons/axiom/javadoc-postprocessor-plugin/1.2.21-SNAPSHOT/maven-metadata.xml
[INFO] Uploaded: https://repository.apache.org/content/repositories/snapshots/org/apache/ws/commons/axiom/javadoc-postprocessor-plugin/1.2.21-SNAPSHOT/maven-metadata.xml
(2 KB at 1.5 KB/sec)
[INFO] Uploading: https://repository.apache.org/content/repositories/snapshots/org/apache/ws/commons/axiom/javadoc-postprocessor-plugin/maven-metadata.xml
[INFO] Uploaded: https://repository.apache.org/content/repositories/snapshots/org/apache/ws/commons/axiom/javadoc-postprocessor-plugin/maven-metadata.xml
(417 B at 0.5 KB/sec)
[INFO] Uploading: https://repository.apache.org/content/repositories/snapshots/org/apache/ws/commons/axiom/maven-metadata.xml
[INFO] Uploaded: https://repository.apache.org/content/repositories/snapshots/org/apache/ws/commons/axiom/maven-metadata.xml
(469 B at 0.6 KB/sec)
[INFO] Uploading: https://repository.apache.org/content/repositories/snapshots/org/apache/ws/commons/axiom/javadoc-postprocessor-plugin/1.2.21-SNAPSHOT/javadoc-postprocessor-plugin-1.2.21-20170108.182112-3-sources.jar
[INFO] Uploaded: https://repository.apache.org/content/repositories/snapshots/org/apache/ws/commons/axiom/javadoc-postprocessor-plugin/1.2.21-SNAPSHOT/javadoc-postprocessor-plugin-1.2.21-20170108.182112-3-sources.jar
(11 KB at 11.5 KB/sec)
[INFO] Uploading: https://repository.apache.org/content/repositories/snapshots/org/apache/ws/commons/axiom/javadoc-postprocessor-plugin/1.2.21-SNAPSHOT/maven-metadata.xml
[INFO] Uploaded: https://repository.apache.org/content/repositories/snapshots/org/apache/ws/commons/axiom/javadoc-postprocessor-plugin/1.2.21-SNAPSHOT/maven-metadata.xml
(2 KB at 1.4 KB/sec)
[INFO] Uploading: https://repository.apache.org/content/repositories/snapshots/org/apache/ws/commons/axiom/javadoc-postprocessor-plugin/1.2.21-SNAPSHOT/javadoc-postprocessor-plugin-1.2.21-20170108.182112-3-javadoc.jar
[INFO] Uploaded: https://repository.apache.org/content/repositories/snapshots/org/apache/ws/commons/axiom/javadoc-postprocessor-plugin/1.2.21-SNAPSHOT/javadoc-postprocessor-plugin-1.2.21-20170108.182112-3-javadoc.jar
(30 KB at 32.2 KB/sec)
[INFO] Uploading: https://repository.apache.org/content/repositories/snapshots/org/apache/ws/commons/axiom/javadoc-postprocessor-plugin/1.2.21-SNAPSHOT/maven-metadata.xml
[INFO] Uploaded: https://repository.apache.org/content/repositories/snapshots/org/apache/ws/commons/axiom/javadoc-postprocessor-plugin/1.2.21-SNAPSHOT/maven-metadata.xml
(2 KB at 1.4 KB/sec)
[INFO]                                                                         
[INFO] ------------------------------------------------------------------------
[INFO] Building no-package-cycles-enforcer-rule 1.2.21-SNAPSHOT
[INFO] ------------------------------------------------------------------------
[INFO] Downloading: https://repo.maven.apache.org/maven2/org/ow2/asm/asm/5.0.4/asm-5.0.4.pom
[INFO] Downloaded: https://repo.maven.apache.org/maven2/org/ow2/asm/asm/5.0.4/asm-5.0.4.pom
(2 KB at 118.1 KB/sec)
[INFO] Downloading: https://repo.maven.apache.org/maven2/org/ow2/asm/asm-parent/5.0.4/asm-parent-5.0.4.pom
[INFO] Downloaded: https://repo.maven.apache.org/maven2/org/ow2/asm/asm-parent/5.0.4/asm-parent-5.0.4.pom
(6 KB at 357.7 KB/sec)
[INFO] Downloading: https://repo.maven.apache.org/maven2/net/sf/jgrapht/jgrapht/0.8.3/jgrapht-0.8.3.pom
[INFO] Downloaded: https://repo.maven.apache.org/maven2/net/sf/jgrapht/jgrapht/0.8.3/jgrapht-0.8.3.pom
(4 KB at 256.1 KB/sec)
[INFO] Downloading: https://repo.maven.apache.org/maven2/org/codehaus/plexus/plexus-utils/1.0.4/plexus-utils-1.0.4.jar
[INFO] Downloading: https://repo.maven.apache.org/maven2/org/ow2/asm/asm/5.0.4/asm-5.0.4.jar
[INFO] Downloading: https://repo.maven.apache.org/maven2/net/sf/jgrapht/jgrapht/0.8.3/jgrapht-0.8.3.jar
[INFO] Downloaded: https://repo.maven.apache.org/maven2/org/ow2/asm/asm/5.0.4/asm-5.0.4.jar
(53 KB at 2365.8 KB/sec)
[INFO] Downloaded: https://repo.maven.apache.org/maven2/org/codehaus/plexus/plexus-utils/1.0.4/plexus-utils-1.0.4.jar
(160 KB at 5713.0 KB/sec)
[INFO] Downloaded: https://repo.maven.apache.org/maven2/net/sf/jgrapht/jgrapht/0.8.3/jgrapht-0.8.3.jar
(240 KB at 7258.1 KB/sec)
[INFO] 
[INFO] --- maven-clean-plugin:3.0.0:clean (default-clean) @ no-package-cycles-enforcer-rule
---
[INFO] 
[INFO] --- maven-enforcer-plugin:1.4.1:enforce (default) @ no-package-cycles-enforcer-rule
---
[INFO] 
[INFO] --- tidy-maven-plugin:1.0-beta-1:check (default) @ no-package-cycles-enforcer-rule
---
[INFO] 
[INFO] --- gmavenplus-plugin:1.5:execute (initialize) @ no-package-cycles-enforcer-rule ---
[INFO] Using Groovy 2.4.4 to perform execute.
[INFO] 
[INFO] --- jacoco-maven-plugin:0.7.5.201505241946:prepare-agent (prepare-agent-for-surefire)
@ no-package-cycles-enforcer-rule ---
[INFO] jacoco.surefireArgLine set to -javaagent:<https://builds.apache.org/job/axiom-1.2.x/ws/.repository/org/jacoco/org.jacoco.agent/0.7.5.201505241946/org.jacoco.agent-0.7.5.201505241946-runtime.jar=destfile=/home/jenkins/jenkins-slave/workspace/axiom-1.2.x/axiom/buildutils/no-package-cycles-enforcer-rule/target/jacoco.exec,sessionid=mvn>:org.apache.ws.commons.axiom:no-package-cycles-enforcer-rule:1.2.21-SNAPSHOT:surefire
[INFO] 
[INFO] --- jacoco-maven-plugin:0.7.5.201505241946:prepare-agent (prepare-agent-for-failsafe)
@ no-package-cycles-enforcer-rule ---
[INFO] jacoco.failsafeArgLine set to -javaagent:<https://builds.apache.org/job/axiom-1.2.x/ws/.repository/org/jacoco/org.jacoco.agent/0.7.5.201505241946/org.jacoco.agent-0.7.5.201505241946-runtime.jar=destfile=/home/jenkins/jenkins-slave/workspace/axiom-1.2.x/axiom/buildutils/no-package-cycles-enforcer-rule/target/jacoco.exec,sessionid=mvn>:org.apache.ws.commons.axiom:no-package-cycles-enforcer-rule:1.2.21-SNAPSHOT:failsafe
[INFO] 
[INFO] --- maven-remote-resources-plugin:1.5:process (process-resource-bundles) @ no-package-cycles-enforcer-rule
---
[INFO] 
[INFO] --- maven-remote-resources-plugin:1.5:process (default) @ no-package-cycles-enforcer-rule
---
[INFO] 
[INFO] --- maven-resources-plugin:2.7:resources (default-resources) @ no-package-cycles-enforcer-rule
---
[INFO] Using 'UTF-8' encoding to copy filtered resources.
[INFO] skip non existing resourceDirectory <https://builds.apache.org/job/axiom-1.2.x/ws/axiom/buildutils/no-package-cycles-enforcer-rule/src/main/resources>
[INFO] Copying 3 resources
[INFO] Copying 3 resources
[INFO] 
[INFO] --- maven-compiler-plugin:2.3.2:compile (default-compile) @ no-package-cycles-enforcer-rule
---
[INFO] Compiling 6 source files to <https://builds.apache.org/job/axiom-1.2.x/ws/axiom/buildutils/no-package-cycles-enforcer-rule/target/classes>
[INFO] 
[INFO] --- gmavenplus-plugin:1.5:execute (generate-policy-file) @ no-package-cycles-enforcer-rule
---
[INFO] Using Groovy 2.4.4 to perform execute.
[INFO] 
[INFO] --- maven-resources-plugin:2.7:testResources (default-testResources) @ no-package-cycles-enforcer-rule
---
[INFO] Using 'UTF-8' encoding to copy filtered resources.
[INFO] skip non existing resourceDirectory <https://builds.apache.org/job/axiom-1.2.x/ws/axiom/buildutils/no-package-cycles-enforcer-rule/src/test/resources>
[INFO] Copying 3 resources
[INFO] Copying 3 resources
[INFO] 
[INFO] --- maven-compiler-plugin:2.3.2:testCompile (default-testCompile) @ no-package-cycles-enforcer-rule
---
[INFO] No sources to compile
[INFO] 
[INFO] --- maven-surefire-plugin:2.16:test (default-test) @ no-package-cycles-enforcer-rule
---
[JENKINS] Recording test results[INFO] 
[INFO] --- maven-source-plugin:3.0.0:jar-no-fork (source-jars) @ no-package-cycles-enforcer-rule
---
[INFO] Building jar: <https://builds.apache.org/job/axiom-1.2.x/ws/axiom/buildutils/no-package-cycles-enforcer-rule/target/no-package-cycles-enforcer-rule-1.2.21-SNAPSHOT-sources.jar>

[INFO] ------------------------------------------------------------------------
[INFO] Reactor Summary:
[INFO] 
[INFO] Axiom .............................................. SUCCESS [ 22.519 s]
[INFO] Build utilities .................................... SUCCESS [  5.209 s]
[INFO] JAR Resource Bundle ................................ SUCCESS [ 11.074 s]
[INFO] Resource Transformer for META-INF/axiom.xml files .. SUCCESS [ 15.870 s]
[INFO] Resource Transformer for OSGi Manifests ............ SUCCESS [ 13.338 s]
[INFO] javadoc-postprocessor-plugin ....................... SUCCESS [ 17.054 s]
[INFO] no-package-cycles-enforcer-rule .................... FAILURE [  4.882 s]
[INFO] Testing ............................................ SKIPPED
[INFO] Multiton pattern implementation .................... SKIPPED
[INFO] Axiom Test Utilities ............................... SKIPPED
[INFO] XML Test Suite ..................................... SKIPPED
[INFO] jaxp-testsuite ..................................... SKIPPED
[INFO] Google Truth extension for XML ..................... SKIPPED
[INFO] components ......................................... SKIPPED
[INFO] xml-utils .......................................... SKIPPED
[INFO] SOAP Test Suite .................................... SKIPPED
[INFO] Axiom API .......................................... SKIPPED
[INFO] Aspects ............................................ SKIPPED
[INFO] Core Aspects ....................................... SKIPPED
[INFO] Shared Aspects ..................................... SKIPPED
[INFO] OM Aspects ......................................... SKIPPED
[INFO] Google Truth extension for Axiom ................... SKIPPED
[INFO] Jaxen Test Suite ................................... SKIPPED
[INFO] Axiom Implementation Test Suite .................... SKIPPED
[INFO] Implementations .................................... SKIPPED
[INFO] LLOM ............................................... SKIPPED
[INFO] DOM Aspects ........................................ SKIPPED
[INFO] DOM Test Suite ..................................... SKIPPED
[INFO] DOOM ............................................... SKIPPED
[INFO] Axiom Compatibility Classes ........................ SKIPPED
[INFO] Axiom JAXB Integration ............................. SKIPPED
[INFO] Axiom C14N ......................................... SKIPPED
[INFO] Axiom Uber-JAR ..................................... SKIPPED
[INFO] Samples ............................................ SKIPPED
[INFO] System Tests ....................................... SKIPPED
[INFO] Cross OM Tests ..................................... SKIPPED
[INFO] Eclipse Tests ...................................... SKIPPED
[INFO] JBoss Tests ........................................ SKIPPED
[INFO] Axiom Test Suite (old) ............................. SKIPPED
[INFO] Axiom OSGi Tests ................................... SKIPPED
[INFO] Spring-WS Test Suite ............................... SKIPPED
[INFO] Spring WS Tests .................................... SKIPPED
[INFO] WSS4J Tests ........................................ SKIPPED
[INFO] Developer Guide .................................... SKIPPED
[INFO] User Guide ......................................... SKIPPED
[INFO] Javadoc ............................................ SKIPPED
[INFO] FOM Aspects ........................................ SKIPPED
[INFO] FOM Test Suite ..................................... SKIPPED
[INFO] Abdera Model (FOM) Implementation .................. SKIPPED
[INFO] Distribution ....................................... SKIPPED
[INFO] Code Coverage Report ............................... SKIPPED
[INFO] SAAJ Test Suite .................................... SKIPPED
[INFO] ------------------------------------------------------------------------
[INFO] BUILD FAILURE
[INFO] ------------------------------------------------------------------------
[INFO] Total time: 01:48 min
[INFO] Finished at: 2017-01-08T18:21:36+00:00
[INFO] Final Memory: 145M/228M
[INFO] ------------------------------------------------------------------------
Waiting for Jenkins to finish collecting data
[ERROR] Failed to execute goal org.apache.maven.plugins:maven-source-plugin:3.0.0:jar-no-fork
(source-jars) on project no-package-cycles-enforcer-rule: Error creating source archive: Problem
creating jar: Execution exception: Java heap space -> [Help 1]
[ERROR] 
[ERROR] To see the full stack trace of the errors, re-run Maven with the -e switch.
[ERROR] Re-run Maven using the -X switch to enable full debug logging.
[ERROR] 
[ERROR] For more information about the errors and possible solutions, please read the following
articles:
[ERROR] [Help 1] http://cwiki.apache.org/confluence/display/MAVEN/MojoExecutionException
[ERROR] 
[ERROR] After correcting the problems, you can resume the build with the command
[ERROR]   mvn <goals> -rf :no-package-cycles-enforcer-rule
[JENKINS] Archiving <https://builds.apache.org/job/axiom-1.2.x/ws/axiom/aspects/core-aspects/pom.xml>
to org.apache.ws.commons.axiom/core-aspects/1.2.21-SNAPSHOT/core-aspects-1.2.21-SNAPSHOT.pom
[JENKINS] Archiving <https://builds.apache.org/job/axiom-1.2.x/ws/axiom/components/xml-utils/pom.xml>
to org.apache.ws.commons.axiom/xml-utils/1.2.21-SNAPSHOT/xml-utils-1.2.21-SNAPSHOT.pom
[JENKINS] Archiving <https://builds.apache.org/job/axiom-1.2.x/ws/axiom/axiom-c14n/pom.xml>
to org.apache.ws.commons.axiom/axiom-c14n/1.2.21-SNAPSHOT/axiom-c14n-1.2.21-SNAPSHOT.pom
[JENKINS] Archiving <https://builds.apache.org/job/axiom-1.2.x/ws/axiom/systests/wss4j-tests/pom.xml>
to org.apache.ws.commons.axiom/wss4j-tests/1.2.21-SNAPSHOT/wss4j-tests-1.2.21-SNAPSHOT.pom
[JENKINS] Archiving <https://builds.apache.org/job/axiom-1.2.x/ws/axiom/pom.xml> to
org.apache.ws.commons.axiom/axiom/1.2.21-SNAPSHOT/axiom-1.2.21-SNAPSHOT.pom
[JENKINS] Archiving <https://builds.apache.org/job/axiom-1.2.x/ws/axiom/target/axiom-1.2.21-SNAPSHOT-site.xml>
to org.apache.ws.commons.axiom/axiom/1.2.21-20170108.182010-3/axiom-1.2.21-20170108.182010-3-site.xml
[JENKINS] Archiving <https://builds.apache.org/job/axiom-1.2.x/ws/axiom/testing/soap-testsuite/pom.xml>
to org.apache.ws.commons.axiom/soap-testsuite/1.2.21-SNAPSHOT/soap-testsuite-1.2.21-SNAPSHOT.pom
[JENKINS] Archiving <https://builds.apache.org/job/axiom-1.2.x/ws/axiom/userguide/pom.xml>
to org.apache.ws.commons.axiom/userguide/1.2.21-SNAPSHOT/userguide-1.2.21-SNAPSHOT.pom
[JENKINS] Archiving <https://builds.apache.org/job/axiom-1.2.x/ws/axiom/devguide/pom.xml>
to org.apache.ws.commons.axiom/devguide/1.2.21-SNAPSHOT/devguide-1.2.21-SNAPSHOT.pom
[JENKINS] Archiving <https://builds.apache.org/job/axiom-1.2.x/ws/axiom/buildutils/jar-resource-bundle/pom.xml>
to org.apache.ws.commons.axiom/jar-resource-bundle/1.2.21-SNAPSHOT/jar-resource-bundle-1.2.21-SNAPSHOT.pom
[JENKINS] Archiving <https://builds.apache.org/job/axiom-1.2.x/ws/axiom/buildutils/jar-resource-bundle/target/jar-resource-bundle-1.2.21-SNAPSHOT.jar>
to org.apache.ws.commons.axiom/jar-resource-bundle/1.2.21-20170108.182027-3/jar-resource-bundle-1.2.21-20170108.182027-3.jar
[JENKINS] Archiving <https://builds.apache.org/job/axiom-1.2.x/ws/axiom/buildutils/jar-resource-bundle/target/jar-resource-bundle-1.2.21-SNAPSHOT-sources.jar>
to org.apache.ws.commons.axiom/jar-resource-bundle/1.2.21-20170108.182027-3/jar-resource-bundle-1.2.21-20170108.182027-3-sources.jar
[JENKINS] Archiving <https://builds.apache.org/job/axiom-1.2.x/ws/axiom/testing/pom.xml>
to org.apache.ws.commons.axiom/testing/1.2.21-SNAPSHOT/testing-1.2.21-SNAPSHOT.pom
[JENKINS] Archiving <https://builds.apache.org/job/axiom-1.2.x/ws/axiom/buildutils/javadoc-postprocessor-plugin/pom.xml>
to org.apache.ws.commons.axiom/javadoc-postprocessor-plugin/1.2.21-SNAPSHOT/javadoc-postprocessor-plugin-1.2.21-SNAPSHOT.pom
[JENKINS] Archiving <https://builds.apache.org/job/axiom-1.2.x/ws/axiom/buildutils/javadoc-postprocessor-plugin/target/javadoc-postprocessor-plugin-1.2.21-SNAPSHOT.jar>
to org.apache.ws.commons.axiom/javadoc-postprocessor-plugin/1.2.21-20170108.182112-3/javadoc-postprocessor-plugin-1.2.21-20170108.182112-3.jar
[JENKINS] Archiving <https://builds.apache.org/job/axiom-1.2.x/ws/axiom/buildutils/javadoc-postprocessor-plugin/target/javadoc-postprocessor-plugin-1.2.21-SNAPSHOT-sources.jar>
to org.apache.ws.commons.axiom/javadoc-postprocessor-plugin/1.2.21-20170108.182112-3/javadoc-postprocessor-plugin-1.2.21-20170108.182112-3-sources.jar
[JENKINS] Archiving <https://builds.apache.org/job/axiom-1.2.x/ws/axiom/buildutils/javadoc-postprocessor-plugin/target/javadoc-postprocessor-plugin-1.2.21-SNAPSHOT-javadoc.jar>
to org.apache.ws.commons.axiom/javadoc-postprocessor-plugin/1.2.21-20170108.182112-3/javadoc-postprocessor-plugin-1.2.21-20170108.182112-3-javadoc.jar
[JENKINS] Archiving <https://builds.apache.org/job/axiom-1.2.x/ws/axiom/systests/osgi-tests/pom.xml>
to org.apache.ws.commons.axiom/osgi-tests/1.2.21-SNAPSHOT/osgi-tests-1.2.21-SNAPSHOT.pom
[JENKINS] Archiving <https://builds.apache.org/job/axiom-1.2.x/ws/axiom/testing/saaj-testsuite/pom.xml>
to org.apache.ws.commons.axiom/saaj-testsuite/1.2.21-SNAPSHOT/saaj-testsuite-1.2.21-SNAPSHOT.pom
[JENKINS] Archiving <https://builds.apache.org/job/axiom-1.2.x/ws/axiom/systests/cross-om-tests/pom.xml>
to org.apache.ws.commons.axiom/cross-om-tests/1.2.21-SNAPSHOT/cross-om-tests-1.2.21-SNAPSHOT.pom
[JENKINS] Archiving <https://builds.apache.org/job/axiom-1.2.x/ws/axiom/testing/spring-ws-testsuite/pom.xml>
to org.apache.ws.commons.axiom/spring-ws-testsuite/1.2.21-SNAPSHOT/spring-ws-testsuite-1.2.21-SNAPSHOT.pom
[JENKINS] Archiving <https://builds.apache.org/job/axiom-1.2.x/ws/axiom/aspects/dom-aspects/pom.xml>
to org.apache.ws.commons.axiom/dom-aspects/1.2.21-SNAPSHOT/dom-aspects-1.2.21-SNAPSHOT.pom
[JENKINS] Archiving <https://builds.apache.org/job/axiom-1.2.x/ws/axiom/implementations/axiom-dom/pom.xml>
to org.apache.ws.commons.axiom/axiom-dom/1.2.21-SNAPSHOT/axiom-dom-1.2.21-SNAPSHOT.pom
[JENKINS] Archiving <https://builds.apache.org/job/axiom-1.2.x/ws/axiom/testing/jaxp-testsuite/pom.xml>
to org.apache.ws.commons.axiom/jaxp-testsuite/1.2.21-SNAPSHOT/jaxp-testsuite-1.2.21-SNAPSHOT.pom
[JENKINS] Archiving <https://builds.apache.org/job/axiom-1.2.x/ws/axiom/aspects/fom-aspects/pom.xml>
to org.apache.ws.commons.axiom/fom-aspects/1.2.21-SNAPSHOT/fom-aspects-1.2.21-SNAPSHOT.pom
[JENKINS] Archiving <https://builds.apache.org/job/axiom-1.2.x/ws/axiom/axiom-api/pom.xml>
to org.apache.ws.commons.axiom/axiom-api/1.2.21-SNAPSHOT/axiom-api-1.2.21-SNAPSHOT.pom
[JENKINS] Archiving <https://builds.apache.org/job/axiom-1.2.x/ws/axiom/testing/fom-testsuite/pom.xml>
to org.apache.ws.commons.axiom/fom-testsuite/1.2.21-SNAPSHOT/fom-testsuite-1.2.21-SNAPSHOT.pom
[JENKINS] Archiving <https://builds.apache.org/job/axiom-1.2.x/ws/axiom/testing/dom-testsuite/pom.xml>
to org.apache.ws.commons.axiom/dom-testsuite/1.2.21-SNAPSHOT/dom-testsuite-1.2.21-SNAPSHOT.pom
[JENKINS] Archiving <https://builds.apache.org/job/axiom-1.2.x/ws/axiom/implementations/axiom-impl/pom.xml>
to org.apache.ws.commons.axiom/axiom-impl/1.2.21-SNAPSHOT/axiom-impl-1.2.21-SNAPSHOT.pom
[JENKINS] Archiving <https://builds.apache.org/job/axiom-1.2.x/ws/axiom/implementations/fom-impl/pom.xml>
to org.apache.ws.commons.axiom/fom-impl/1.2.21-SNAPSHOT/fom-impl-1.2.21-SNAPSHOT.pom
[JENKINS] Archiving <https://builds.apache.org/job/axiom-1.2.x/ws/axiom/testing/testutils/pom.xml>
to org.apache.ws.commons.axiom/testutils/1.2.21-SNAPSHOT/testutils-1.2.21-SNAPSHOT.pom
[JENKINS] Archiving <https://builds.apache.org/job/axiom-1.2.x/ws/axiom/testing/xml-truth/pom.xml>
to org.apache.ws.commons.axiom/xml-truth/1.2.21-SNAPSHOT/xml-truth-1.2.21-SNAPSHOT.pom
[JENKINS] Archiving <https://builds.apache.org/job/axiom-1.2.x/ws/axiom/apidocs/pom.xml>
to org.apache.ws.commons.axiom/apidocs/1.2.21-SNAPSHOT/apidocs-1.2.21-SNAPSHOT.pom
[JENKINS] Archiving <https://builds.apache.org/job/axiom-1.2.x/ws/axiom/testing/xml-testsuite/pom.xml>
to org.apache.ws.commons.axiom/xml-testsuite/1.2.21-SNAPSHOT/xml-testsuite-1.2.21-SNAPSHOT.pom
[JENKINS] Archiving <https://builds.apache.org/job/axiom-1.2.x/ws/axiom/samples/pom.xml>
to org.apache.ws.commons.axiom/samples/1.2.21-SNAPSHOT/samples-1.2.21-SNAPSHOT.pom
[JENKINS] Archiving <https://builds.apache.org/job/axiom-1.2.x/ws/axiom/buildutils/pom.xml>
to org.apache.ws.commons.axiom/buildutils/1.2.21-SNAPSHOT/buildutils-1.2.21-SNAPSHOT.pom
[JENKINS] Archiving <https://builds.apache.org/job/axiom-1.2.x/ws/axiom/axiom-all/pom.xml>
to org.apache.ws.commons.axiom/axiom-all/1.2.21-SNAPSHOT/axiom-all-1.2.21-SNAPSHOT.pom
[JENKINS] Archiving <https://builds.apache.org/job/axiom-1.2.x/ws/axiom/code-coverage/pom.xml>
to org.apache.ws.commons.axiom/code-coverage/1.2.21-SNAPSHOT/code-coverage-1.2.21-SNAPSHOT.pom
[JENKINS] Archiving <https://builds.apache.org/job/axiom-1.2.x/ws/axiom/implementations/pom.xml>
to org.apache.ws.commons.axiom/implementations/1.2.21-SNAPSHOT/implementations-1.2.21-SNAPSHOT.pom
[JENKINS] Archiving <https://builds.apache.org/job/axiom-1.2.x/ws/axiom/systests/pom.xml>
to org.apache.ws.commons.axiom/systests/1.2.21-SNAPSHOT/systests-1.2.21-SNAPSHOT.pom
[JENKINS] Archiving <https://builds.apache.org/job/axiom-1.2.x/ws/axiom/distribution/pom.xml>
to org.apache.ws.commons.axiom/distribution/1.2.21-SNAPSHOT/distribution-1.2.21-SNAPSHOT.pom
[JENKINS] Archiving <https://builds.apache.org/job/axiom-1.2.x/ws/axiom/testing/axiom-truth/pom.xml>
to org.apache.ws.commons.axiom/axiom-truth/1.2.21-SNAPSHOT/axiom-truth-1.2.21-SNAPSHOT.pom
[JENKINS] Archiving <https://builds.apache.org/job/axiom-1.2.x/ws/axiom/systests/jboss-tests/pom.xml>
to org.apache.ws.commons.axiom/jboss-tests/1.2.21-SNAPSHOT/jboss-tests-1.2.21-SNAPSHOT.pom
[JENKINS] Archiving <https://builds.apache.org/job/axiom-1.2.x/ws/axiom/systests/spring-ws-tests/pom.xml>
to org.apache.ws.commons.axiom/spring-ws-tests/1.2.21-SNAPSHOT/spring-ws-tests-1.2.21-SNAPSHOT.pom
[JENKINS] Archiving <https://builds.apache.org/job/axiom-1.2.x/ws/axiom/aspects/om-aspects/pom.xml>
to org.apache.ws.commons.axiom/om-aspects/1.2.21-SNAPSHOT/om-aspects-1.2.21-SNAPSHOT.pom
[JENKINS] Archiving <https://builds.apache.org/job/axiom-1.2.x/ws/axiom/testing/jaxen-testsuite/pom.xml>
to org.apache.ws.commons.axiom/jaxen-testsuite/1.2.21-SNAPSHOT/jaxen-testsuite-1.2.21-SNAPSHOT.pom
[JENKINS] Archiving <https://builds.apache.org/job/axiom-1.2.x/ws/axiom/systests/eclipse-tests/pom.xml>
to org.apache.ws.commons.axiom/eclipse-tests/1.2.21-SNAPSHOT/eclipse-tests-1.2.21-SNAPSHOT.pom
[JENKINS] Archiving <https://builds.apache.org/job/axiom-1.2.x/ws/axiom/aspects/shared-aspects/pom.xml>
to org.apache.ws.commons.axiom/shared-aspects/1.2.21-SNAPSHOT/shared-aspects-1.2.21-SNAPSHOT.pom
[JENKINS] Archiving <https://builds.apache.org/job/axiom-1.2.x/ws/axiom/buildutils/shade-osgi/pom.xml>
to org.apache.ws.commons.axiom/shade-osgi/1.2.21-SNAPSHOT/shade-osgi-1.2.21-SNAPSHOT.pom
[JENKINS] Archiving <https://builds.apache.org/job/axiom-1.2.x/ws/axiom/buildutils/shade-osgi/target/shade-osgi-1.2.21-SNAPSHOT.jar>
to org.apache.ws.commons.axiom/shade-osgi/1.2.21-20170108.182056-3/shade-osgi-1.2.21-20170108.182056-3.jar
[JENKINS] Archiving <https://builds.apache.org/job/axiom-1.2.x/ws/axiom/buildutils/shade-osgi/target/shade-osgi-1.2.21-SNAPSHOT-sources.jar>
to org.apache.ws.commons.axiom/shade-osgi/1.2.21-20170108.182056-3/shade-osgi-1.2.21-20170108.182056-3-sources.jar
[JENKINS] Archiving <https://builds.apache.org/job/axiom-1.2.x/ws/axiom/buildutils/shade-osgi/target/shade-osgi-1.2.21-SNAPSHOT-javadoc.jar>
to org.apache.ws.commons.axiom/shade-osgi/1.2.21-20170108.182056-3/shade-osgi-1.2.21-20170108.182056-3-javadoc.jar
[JENKINS] Archiving <https://builds.apache.org/job/axiom-1.2.x/ws/axiom/buildutils/shade-axiom-xml/pom.xml>
to org.apache.ws.commons.axiom/shade-axiom-xml/1.2.21-SNAPSHOT/shade-axiom-xml-1.2.21-SNAPSHOT.pom
[JENKINS] Archiving <https://builds.apache.org/job/axiom-1.2.x/ws/axiom/buildutils/shade-axiom-xml/target/shade-axiom-xml-1.2.21-SNAPSHOT.jar>
to org.apache.ws.commons.axiom/shade-axiom-xml/1.2.21-20170108.182042-3/shade-axiom-xml-1.2.21-20170108.182042-3.jar
[JENKINS] Archiving <https://builds.apache.org/job/axiom-1.2.x/ws/axiom/buildutils/shade-axiom-xml/target/shade-axiom-xml-1.2.21-SNAPSHOT-sources.jar>
to org.apache.ws.commons.axiom/shade-axiom-xml/1.2.21-20170108.182042-3/shade-axiom-xml-1.2.21-20170108.182042-3-sources.jar
[JENKINS] Archiving <https://builds.apache.org/job/axiom-1.2.x/ws/axiom/buildutils/shade-axiom-xml/target/shade-axiom-xml-1.2.21-SNAPSHOT-javadoc.jar>
to org.apache.ws.commons.axiom/shade-axiom-xml/1.2.21-20170108.182042-3/shade-axiom-xml-1.2.21-20170108.182042-3-javadoc.jar
[JENKINS] Archiving <https://builds.apache.org/job/axiom-1.2.x/ws/axiom/axiom-jaxb/pom.xml>
to org.apache.ws.commons.axiom/axiom-jaxb/1.2.21-SNAPSHOT/axiom-jaxb-1.2.21-SNAPSHOT.pom
[JENKINS] Archiving <https://builds.apache.org/job/axiom-1.2.x/ws/axiom/testing/axiom-testsuite/pom.xml>
to org.apache.ws.commons.axiom/axiom-testsuite/1.2.21-SNAPSHOT/axiom-testsuite-1.2.21-SNAPSHOT.pom
[JENKINS] Archiving <https://builds.apache.org/job/axiom-1.2.x/ws/axiom/testing/multiton/pom.xml>
to org.apache.ws.commons.axiom/multiton/1.2.21-SNAPSHOT/multiton-1.2.21-SNAPSHOT.pom
[JENKINS] Archiving <https://builds.apache.org/job/axiom-1.2.x/ws/axiom/buildutils/no-package-cycles-enforcer-rule/pom.xml>
to org.apache.ws.commons.axiom/no-package-cycles-enforcer-rule/1.2.21-SNAPSHOT/no-package-cycles-enforcer-rule-1.2.21-SNAPSHOT.pom
[JENKINS] Archiving <https://builds.apache.org/job/axiom-1.2.x/ws/axiom/axiom-compat/pom.xml>
to org.apache.ws.commons.axiom/axiom-compat/1.2.21-SNAPSHOT/axiom-compat-1.2.21-SNAPSHOT.pom
[JENKINS] Archiving <https://builds.apache.org/job/axiom-1.2.x/ws/axiom/systests/old-tests/pom.xml>
to org.apache.ws.commons.axiom/old-tests/1.2.21-SNAPSHOT/old-tests-1.2.21-SNAPSHOT.pom
[JENKINS] Archiving <https://builds.apache.org/job/axiom-1.2.x/ws/axiom/components/pom.xml>
to org.apache.ws.commons.axiom/components/1.2.21-SNAPSHOT/components-1.2.21-SNAPSHOT.pom
[JENKINS] Archiving <https://builds.apache.org/job/axiom-1.2.x/ws/axiom/aspects/pom.xml>
to org.apache.ws.commons.axiom/aspects/1.2.21-SNAPSHOT/aspects-1.2.21-SNAPSHOT.pom
Sending e-mails to: dev@ws.apache.org
channel stopped

---------------------------------------------------------------------
To unsubscribe, e-mail: dev-unsubscribe@ws.apache.org
For additional commands, e-mail: dev-help@ws.apache.org


Mime
View raw message