ws-dev mailing list archives

Site index · List index
Message view « Date » · « Thread »
Top « Date » · « Thread »
From Apache Jenkins Server <jenk...@builds.apache.org>
Subject Build failed in Jenkins: axiom-trunk #2892
Date Thu, 08 Jun 2017 12:52:25 GMT
See <https://builds.apache.org/job/axiom-trunk/2892/display/redirect>

------------------------------------------
[...truncated 7.94 KB...]

Parsing POMs
Downloaded artifact http://repository.apache.org/snapshots/org/apache/ws/ws-parent/3-SNAPSHOT/maven-metadata.xml
Modules changed, recalculating dependency graph
Established TCP socket on 37835
maven33-agent.jar already up to date
maven33-interceptor.jar already up to date
maven3-interceptor-commons.jar already up to date
[axiom] $ /home/jenkins/tools/java/latest1.8/bin/java -Xmx512m -Xms128m -XX:MaxPermSize=128m
-cp /home/jenkins/jenkins-slave/maven33-agent.jar:/home/jenkins/tools/maven/apache-maven-3.3.9/boot/plexus-classworlds-2.5.2.jar:/home/jenkins/tools/maven/apache-maven-3.3.9/conf/logging
jenkins.maven3.agent.Maven33Main /home/jenkins/tools/maven/apache-maven-3.3.9 /home/jenkins/jenkins-slave/slave.jar
/home/jenkins/jenkins-slave/maven33-interceptor.jar /home/jenkins/jenkins-slave/maven3-interceptor-commons.jar
37835
Java HotSpot(TM) 64-Bit Server VM warning: ignoring option MaxPermSize=128m; support was removed
in 8.0
<===[JENKINS REMOTING CAPACITY]===>   channel started
Executing Maven:  -B -f <https://builds.apache.org/job/axiom-trunk/ws/axiom/pom.xml>
-Dmaven.repo.local=<https://builds.apache.org/job/axiom-trunk/ws/.repository> -U clean
deploy -Papache-release -Dgpg.skip=true
[INFO] Scanning for projects...
[INFO] Downloading: http://repository.apache.org/snapshots/org/apache/ws/ws-parent/3-SNAPSHOT/maven-metadata.xml
[INFO] Downloaded: http://repository.apache.org/snapshots/org/apache/ws/ws-parent/3-SNAPSHOT/maven-metadata.xml
(1015 B at 1.8 KB/sec)
[WARNING] 
[WARNING] Some problems were encountered while building the effective model for org.apache.ws.commons.axiom:axiom-api:bundle:1.3.0-SNAPSHOT
[WARNING] 'build.plugins.plugin.(groupId:artifactId)' must be unique but found duplicate declaration
of plugin ${project.groupId}:buildutils-maven-plugin @ org.apache.ws.commons.axiom:axiom-api:[unknown-version],
<https://builds.apache.org/job/axiom-trunk/ws/axiom/axiom-api/pom.xml,> line 264, column
21
[WARNING] 
[WARNING] It is highly recommended to fix these problems because they threaten the stability
of your build.
[WARNING] 
[WARNING] For this reason, future Maven versions might no longer support building such malformed
projects.
[WARNING] 
[INFO] ------------------------------------------------------------------------
[INFO] Reactor Build Order:
[INFO] 
[INFO] Axiom
[INFO] Build utilities
[INFO] buildutils-maven-plugin
[INFO] JAR Resource Bundle
[INFO] Resource Transformer for META-INF/axiom.xml files
[INFO] components
[INFO] base64-utils
[INFO] Testing
[INFO] Multiton pattern implementation
[INFO] Axiom Test Utilities
[INFO] XML Test Suite
[INFO] jaxp-testsuite
[INFO] Google Truth extension for XML
[INFO] xml-utils
[INFO] SOAP Test Suite
[INFO] Axiom API
[INFO] core-streams
[INFO] Aspects
[INFO] Core Aspects
[INFO] Shared Aspects
[INFO] OM Aspects
[INFO] Google Truth extension for Axiom
[INFO] Jaxen Test Suite
[INFO] Axiom Implementation Test Suite
[INFO] Implementations
[INFO] LLOM
[INFO] DOM Aspects
[INFO] DOM Test Suite
[INFO] DOOM
[INFO] Axiom Compatibility Classes
[INFO] Axiom Uber-JAR
[INFO] Samples
[INFO] System Tests
[INFO] compat-tests
[INFO] Cross OM Tests
[INFO] Eclipse Tests
[INFO] Wildfly Tests
[INFO] Axiom Test Suite (old)
[INFO] Axiom OSGi Tests
[INFO] Spring-WS Test Suite
[INFO] Spring WS Tests
[INFO] WSS4J Tests
[INFO] Developer Guide
[INFO] User Guide
[INFO] Javadoc
[INFO] Distribution
[INFO] Code Coverage Report
[INFO] SAAJ Test Suite
[INFO]                                                                         
[INFO] ------------------------------------------------------------------------
[INFO] Building Axiom 1.3.0-SNAPSHOT
[INFO] ------------------------------------------------------------------------
[INFO] 
[INFO] --- maven-clean-plugin:3.0.0:clean (default-clean) @ axiom ---
[INFO] 
[INFO] --- maven-enforcer-plugin:1.4.1:enforce (default) @ axiom ---
[INFO] 
[INFO] --- tidy-maven-plugin:1.0-beta-1:check (default) @ axiom ---
[INFO] 
[INFO] --- gmavenplus-plugin:1.5:execute (initialize) @ axiom ---
[INFO] Using Groovy 2.4.10 to perform execute.
[INFO] 
[INFO] --- jacoco-maven-plugin:0.7.9:prepare-agent (prepare-agent-for-surefire) @ axiom ---
[INFO] jacoco.surefireArgLine set to -javaagent:<https://builds.apache.org/job/axiom-trunk/ws/.repository/org/jacoco/org.jacoco.agent/0.7.9/org.jacoco.agent-0.7.9-runtime.jar=destfile=/home/jenkins/jenkins-slave/workspace/axiom-trunk/axiom/target/jacoco.exec,sessionid=mvn>:org.apache.ws.commons.axiom:axiom:1.3.0-SNAPSHOT:surefire
[INFO] 
[INFO] --- jacoco-maven-plugin:0.7.9:prepare-agent (prepare-agent-for-failsafe) @ axiom ---
[INFO] jacoco.failsafeArgLine set to -javaagent:<https://builds.apache.org/job/axiom-trunk/ws/.repository/org/jacoco/org.jacoco.agent/0.7.9/org.jacoco.agent-0.7.9-runtime.jar=destfile=/home/jenkins/jenkins-slave/workspace/axiom-trunk/axiom/target/jacoco.exec,sessionid=mvn>:org.apache.ws.commons.axiom:axiom:1.3.0-SNAPSHOT:failsafe
[INFO] 
[INFO] --- maven-remote-resources-plugin:1.5:process (process-resource-bundles) @ axiom ---
[INFO] 
[INFO] --- maven-remote-resources-plugin:1.5:process (default) @ axiom ---
[INFO] 
[INFO] --- gmavenplus-plugin:1.5:execute (generate-policy-file) @ axiom ---
[INFO] Using Groovy 2.4.10 to perform execute.
[INFO] 
[INFO] --- maven-source-plugin:3.0.1:jar-no-fork (source-jars) @ axiom ---
[INFO] 
[INFO] --- maven-site-plugin:3.6:attach-descriptor (attach-descriptor) @ axiom ---
[INFO] Attaching 'src/site/site.xml' site descriptor with classifier 'site'.
[INFO] 
[INFO] --- maven-javadoc-plugin:2.10.3:jar (attach-javadocs) @ axiom ---
[INFO] Not executing Javadoc as the project is not a Java classpath-capable package
[INFO] 
[INFO] --- gmavenplus-plugin:1.5:execute (check-jacoco-exec) @ axiom ---
[INFO] Using Groovy 2.4.10 to perform execute.
[INFO] 
[INFO] --- build-helper-maven-plugin:1.7:attach-artifact (attach-jacoco-exec) @ axiom ---
[INFO] Skip attaching artifacts
[INFO] 
[INFO] --- animal-sniffer-maven-plugin:1.14:check (check) @ axiom ---
[INFO] Checking unresolved references to org.codehaus.mojo.signature:java17:1.0
[INFO] 
[INFO] --- maven-gpg-plugin:1.6:sign (sign-release-artifacts) @ axiom ---
[INFO] 
[INFO] --- apache-rat-plugin:0.11:check (default) @ axiom ---
[INFO] 66 implicit excludes (use -debug for more details).
[INFO] Exclude: RELEASE-NOTE.txt
[INFO] Exclude: src/site/markdown/release-notes/**
[INFO] Exclude: **/*.svg
[INFO] Exclude: legal/jaxen-LICENSE.txt
[INFO] Exclude: legal/stax2-api-LICENSE.txt
[INFO] Exclude: *.sonarj
[INFO] Exclude: release.properties
[INFO] Exclude: src/test/resources/**
[INFO] Exclude: dependency-reduced-pom.xml
[INFO] 46 resources included (use -debug for more details)
[INFO] Rat check: Summary of files. Unapproved: 1 unknown: 1 generated: 0 approved: 26 licence.
[INFO] ------------------------------------------------------------------------
[INFO] Reactor Summary:
[INFO] 
[INFO] Axiom .............................................. FAILURE [ 11.387 s]
[INFO] Build utilities .................................... SKIPPED
[INFO] buildutils-maven-plugin ............................ SKIPPED
[INFO] JAR Resource Bundle ................................ SKIPPED
[INFO] Resource Transformer for META-INF/axiom.xml files .. SKIPPED
[INFO] components ......................................... SKIPPED
[INFO] base64-utils ....................................... SKIPPED
[INFO] Testing ............................................ SKIPPED
[INFO] Multiton pattern implementation .................... SKIPPED
[INFO] Axiom Test Utilities ............................... SKIPPED
[INFO] XML Test Suite ..................................... SKIPPED
[INFO] jaxp-testsuite ..................................... SKIPPED
[INFO] Google Truth extension for XML ..................... SKIPPED
[INFO] xml-utils .......................................... SKIPPED
[INFO] SOAP Test Suite .................................... SKIPPED
[INFO] Axiom API .......................................... SKIPPED
[INFO] core-streams ....................................... SKIPPED
[INFO] Aspects ............................................ SKIPPED
[INFO] Core Aspects ....................................... SKIPPED
[INFO] Shared Aspects ..................................... SKIPPED
[INFO] OM Aspects ......................................... SKIPPED
[INFO] Google Truth extension for Axiom ................... SKIPPED
[INFO] Jaxen Test Suite ................................... SKIPPED
[INFO] Axiom Implementation Test Suite .................... SKIPPED
[INFO] Implementations .................................... SKIPPED
[INFO] LLOM ............................................... SKIPPED
[INFO] DOM Aspects ........................................ SKIPPED
[INFO] DOM Test Suite ..................................... SKIPPED
[INFO] DOOM ............................................... SKIPPED
[INFO] Axiom Compatibility Classes ........................ SKIPPED
[INFO] Axiom Uber-JAR ..................................... SKIPPED
[INFO] Samples ............................................ SKIPPED
[INFO] System Tests ....................................... SKIPPED
[INFO] compat-tests ....................................... SKIPPED
[INFO] Cross OM Tests ..................................... SKIPPED
[INFO] Eclipse Tests ...................................... SKIPPED
[INFO] Wildfly Tests ...................................... SKIPPED
[INFO] Axiom Test Suite (old) ............................. SKIPPED
[INFO] Axiom OSGi Tests ................................... SKIPPED
[INFO] Spring-WS Test Suite ............................... SKIPPED
[INFO] Spring WS Tests .................................... SKIPPED
[INFO] WSS4J Tests ........................................ SKIPPED
[INFO] Developer Guide .................................... SKIPPED
[INFO] User Guide ......................................... SKIPPED
[INFO] Javadoc ............................................ SKIPPED
[INFO] Distribution ....................................... SKIPPED
[INFO] Code Coverage Report ............................... SKIPPED
[INFO] SAAJ Test Suite .................................... SKIPPED
[INFO] ------------------------------------------------------------------------
[INFO] BUILD FAILURE
[INFO] ------------------------------------------------------------------------
[INFO] Total time: 24.312 s
[INFO] Finished at: 2017-06-08T12:51:56+00:00
[INFO] Final Memory: 48M/251M
[INFO] ------------------------------------------------------------------------
[ERROR] Failed to execute goal org.apache.rat:apache-rat-plugin:0.11:check (default) on project
axiom: Too many files with unapproved license: 1 See RAT report in: <https://builds.apache.org/job/axiom-trunk/ws/axiom/target/rat.txt>
-> [Help 1]
[ERROR] 
[ERROR] To see the full stack trace of the errors, re-run Maven with the -e switch.
[ERROR] Re-run Maven using the -X switch to enable full debug logging.
[ERROR] 
[ERROR] For more information about the errors and possible solutions, please read the following
articles:
[ERROR] [Help 1] http://cwiki.apache.org/confluence/display/MAVEN/MojoFailureException
[JENKINS] Archiving <https://builds.apache.org/job/axiom-trunk/ws/axiom/aspects/core-aspects/pom.xml>
to org.apache.ws.commons.axiom/core-aspects/1.3.0-SNAPSHOT/core-aspects-1.3.0-SNAPSHOT.pom
[JENKINS] Archiving <https://builds.apache.org/job/axiom-trunk/ws/axiom/components/xml-utils/pom.xml>
to org.apache.ws.commons.axiom/xml-utils/1.3.0-SNAPSHOT/xml-utils-1.3.0-SNAPSHOT.pom
[JENKINS] Archiving <https://builds.apache.org/job/axiom-trunk/ws/axiom/systests/wss4j-tests/pom.xml>
to org.apache.ws.commons.axiom/wss4j-tests/1.3.0-SNAPSHOT/wss4j-tests-1.3.0-SNAPSHOT.pom
[JENKINS] Archiving <https://builds.apache.org/job/axiom-trunk/ws/axiom/code-coverage/pom.xml>
to org.apache.ws.commons.axiom/code-coverage/1.3.0-SNAPSHOT/code-coverage-1.3.0-SNAPSHOT.pom
[JENKINS] Archiving <https://builds.apache.org/job/axiom-trunk/ws/axiom/pom.xml> to
org.apache.ws.commons.axiom/axiom/1.3.0-SNAPSHOT/axiom-1.3.0-SNAPSHOT.pom
[JENKINS] Archiving <https://builds.apache.org/job/axiom-trunk/ws/axiom/target/axiom-1.3.0-SNAPSHOT-site.xml>
to org.apache.ws.commons.axiom/axiom/1.3.0-SNAPSHOT/axiom-1.3.0-SNAPSHOT-site.xml
[JENKINS] Archiving <https://builds.apache.org/job/axiom-trunk/ws/axiom/testing/soap-testsuite/pom.xml>
to org.apache.ws.commons.axiom/soap-testsuite/1.3.0-SNAPSHOT/soap-testsuite-1.3.0-SNAPSHOT.pom
[JENKINS] Archiving <https://builds.apache.org/job/axiom-trunk/ws/axiom/implementations/pom.xml>
to org.apache.ws.commons.axiom/implementations/1.3.0-SNAPSHOT/implementations-1.3.0-SNAPSHOT.pom
[JENKINS] Archiving <https://builds.apache.org/job/axiom-trunk/ws/axiom/systests/pom.xml>
to org.apache.ws.commons.axiom/systests/1.3.0-SNAPSHOT/systests-1.3.0-SNAPSHOT.pom
[JENKINS] Archiving <https://builds.apache.org/job/axiom-trunk/ws/axiom/userguide/pom.xml>
to org.apache.ws.commons.axiom/userguide/1.3.0-SNAPSHOT/userguide-1.3.0-SNAPSHOT.pom
[JENKINS] Archiving <https://builds.apache.org/job/axiom-trunk/ws/axiom/devguide/pom.xml>
to org.apache.ws.commons.axiom/devguide/1.3.0-SNAPSHOT/devguide-1.3.0-SNAPSHOT.pom
[JENKINS] Archiving <https://builds.apache.org/job/axiom-trunk/ws/axiom/distribution/pom.xml>
to org.apache.ws.commons.axiom/distribution/1.3.0-SNAPSHOT/distribution-1.3.0-SNAPSHOT.pom
[JENKINS] Archiving <https://builds.apache.org/job/axiom-trunk/ws/axiom/testing/axiom-truth/pom.xml>
to org.apache.ws.commons.axiom/axiom-truth/1.3.0-SNAPSHOT/axiom-truth-1.3.0-SNAPSHOT.pom
[JENKINS] Archiving <https://builds.apache.org/job/axiom-trunk/ws/axiom/buildutils/jar-resource-bundle/pom.xml>
to org.apache.ws.commons.axiom/jar-resource-bundle/1.3.0-SNAPSHOT/jar-resource-bundle-1.3.0-SNAPSHOT.pom
[JENKINS] Archiving <https://builds.apache.org/job/axiom-trunk/ws/axiom/buildutils/buildutils-maven-plugin/pom.xml>
to org.apache.ws.commons.axiom/buildutils-maven-plugin/1.3.0-SNAPSHOT/buildutils-maven-plugin-1.3.0-SNAPSHOT.pom
[JENKINS] Archiving <https://builds.apache.org/job/axiom-trunk/ws/axiom/testing/pom.xml>
to org.apache.ws.commons.axiom/testing/1.3.0-SNAPSHOT/testing-1.3.0-SNAPSHOT.pom
[JENKINS] Archiving <https://builds.apache.org/job/axiom-trunk/ws/axiom/systests/osgi-tests/pom.xml>
to org.apache.ws.commons.axiom/osgi-tests/1.3.0-SNAPSHOT/osgi-tests-1.3.0-SNAPSHOT.pom
[JENKINS] Archiving <https://builds.apache.org/job/axiom-trunk/ws/axiom/testing/saaj-testsuite/pom.xml>
to org.apache.ws.commons.axiom/saaj-testsuite/1.3.0-SNAPSHOT/saaj-testsuite-1.3.0-SNAPSHOT.pom
[JENKINS] Archiving <https://builds.apache.org/job/axiom-trunk/ws/axiom/systests/spring-ws-tests/pom.xml>
to org.apache.ws.commons.axiom/spring-ws-tests/1.3.0-SNAPSHOT/spring-ws-tests-1.3.0-SNAPSHOT.pom
[JENKINS] Archiving <https://builds.apache.org/job/axiom-trunk/ws/axiom/systests/cross-om-tests/pom.xml>
to org.apache.ws.commons.axiom/cross-om-tests/1.3.0-SNAPSHOT/cross-om-tests-1.3.0-SNAPSHOT.pom
[JENKINS] Archiving <https://builds.apache.org/job/axiom-trunk/ws/axiom/testing/spring-ws-testsuite/pom.xml>
to org.apache.ws.commons.axiom/spring-ws-testsuite/1.3.0-SNAPSHOT/spring-ws-testsuite-1.3.0-SNAPSHOT.pom
[JENKINS] Archiving <https://builds.apache.org/job/axiom-trunk/ws/axiom/aspects/dom-aspects/pom.xml>
to org.apache.ws.commons.axiom/dom-aspects/1.3.0-SNAPSHOT/dom-aspects-1.3.0-SNAPSHOT.pom
[JENKINS] Archiving <https://builds.apache.org/job/axiom-trunk/ws/axiom/aspects/om-aspects/pom.xml>
to org.apache.ws.commons.axiom/om-aspects/1.3.0-SNAPSHOT/om-aspects-1.3.0-SNAPSHOT.pom
[JENKINS] Archiving <https://builds.apache.org/job/axiom-trunk/ws/axiom/implementations/axiom-dom/pom.xml>
to org.apache.ws.commons.axiom/axiom-dom/1.3.0-SNAPSHOT/axiom-dom-1.3.0-SNAPSHOT.pom
[JENKINS] Archiving <https://builds.apache.org/job/axiom-trunk/ws/axiom/components/base64-utils/pom.xml>
to org.apache.ws.commons.axiom/base64-utils/1.3.0-SNAPSHOT/base64-utils-1.3.0-SNAPSHOT.pom
[JENKINS] Archiving <https://builds.apache.org/job/axiom-trunk/ws/axiom/testing/jaxp-testsuite/pom.xml>
to org.apache.ws.commons.axiom/jaxp-testsuite/1.3.0-SNAPSHOT/jaxp-testsuite-1.3.0-SNAPSHOT.pom
[JENKINS] Archiving <https://builds.apache.org/job/axiom-trunk/ws/axiom/testing/jaxen-testsuite/pom.xml>
to org.apache.ws.commons.axiom/jaxen-testsuite/1.3.0-SNAPSHOT/jaxen-testsuite-1.3.0-SNAPSHOT.pom
[JENKINS] Archiving <https://builds.apache.org/job/axiom-trunk/ws/axiom/systests/eclipse-tests/pom.xml>
to org.apache.ws.commons.axiom/eclipse-tests/1.3.0-SNAPSHOT/eclipse-tests-1.3.0-SNAPSHOT.pom
[JENKINS] Archiving <https://builds.apache.org/job/axiom-trunk/ws/axiom/aspects/shared-aspects/pom.xml>
to org.apache.ws.commons.axiom/shared-aspects/1.3.0-SNAPSHOT/shared-aspects-1.3.0-SNAPSHOT.pom
[JENKINS] Archiving <https://builds.apache.org/job/axiom-trunk/ws/axiom/axiom-api/pom.xml>
to org.apache.ws.commons.axiom/axiom-api/1.3.0-SNAPSHOT/axiom-api-1.3.0-SNAPSHOT.pom
[JENKINS] Archiving <https://builds.apache.org/job/axiom-trunk/ws/axiom/buildutils/shade-axiom-xml/pom.xml>
to org.apache.ws.commons.axiom/shade-axiom-xml/1.3.0-SNAPSHOT/shade-axiom-xml-1.3.0-SNAPSHOT.pom
[JENKINS] Archiving <https://builds.apache.org/job/axiom-trunk/ws/axiom/testing/dom-testsuite/pom.xml>
to org.apache.ws.commons.axiom/dom-testsuite/1.3.0-SNAPSHOT/dom-testsuite-1.3.0-SNAPSHOT.pom
[JENKINS] Archiving <https://builds.apache.org/job/axiom-trunk/ws/axiom/implementations/axiom-impl/pom.xml>
to org.apache.ws.commons.axiom/axiom-impl/1.3.0-SNAPSHOT/axiom-impl-1.3.0-SNAPSHOT.pom
[JENKINS] Archiving <https://builds.apache.org/job/axiom-trunk/ws/axiom/systests/wildfly-tests/pom.xml>
to org.apache.ws.commons.axiom/wildfly-tests/1.3.0-SNAPSHOT/wildfly-tests-1.3.0-SNAPSHOT.pom
[JENKINS] Archiving <https://builds.apache.org/job/axiom-trunk/ws/axiom/components/core-streams/pom.xml>
to org.apache.ws.commons.axiom/core-streams/1.3.0-SNAPSHOT/core-streams-1.3.0-SNAPSHOT.pom
[JENKINS] Archiving <https://builds.apache.org/job/axiom-trunk/ws/axiom/testing/testutils/pom.xml>
to org.apache.ws.commons.axiom/testutils/1.3.0-SNAPSHOT/testutils-1.3.0-SNAPSHOT.pom
[JENKINS] Archiving <https://builds.apache.org/job/axiom-trunk/ws/axiom/testing/xml-truth/pom.xml>
to org.apache.ws.commons.axiom/xml-truth/1.3.0-SNAPSHOT/xml-truth-1.3.0-SNAPSHOT.pom
[JENKINS] Archiving <https://builds.apache.org/job/axiom-trunk/ws/axiom/testing/axiom-testsuite/pom.xml>
to org.apache.ws.commons.axiom/axiom-testsuite/1.3.0-SNAPSHOT/axiom-testsuite-1.3.0-SNAPSHOT.pom
[JENKINS] Archiving <https://builds.apache.org/job/axiom-trunk/ws/axiom/testing/multiton/pom.xml>
to org.apache.ws.commons.axiom/multiton/1.3.0-SNAPSHOT/multiton-1.3.0-SNAPSHOT.pom
[JENKINS] Archiving <https://builds.apache.org/job/axiom-trunk/ws/axiom/apidocs/pom.xml>
to org.apache.ws.commons.axiom/apidocs/1.3.0-SNAPSHOT/apidocs-1.3.0-SNAPSHOT.pom
[JENKINS] Archiving <https://builds.apache.org/job/axiom-trunk/ws/axiom/axiom-compat/pom.xml>
to org.apache.ws.commons.axiom/axiom-compat/1.3.0-SNAPSHOT/axiom-compat-1.3.0-SNAPSHOT.pom
[JENKINS] Archiving <https://builds.apache.org/job/axiom-trunk/ws/axiom/testing/xml-testsuite/pom.xml>
to org.apache.ws.commons.axiom/xml-testsuite/1.3.0-SNAPSHOT/xml-testsuite-1.3.0-SNAPSHOT.pom
[JENKINS] Archiving <https://builds.apache.org/job/axiom-trunk/ws/axiom/systests/old-tests/pom.xml>
to org.apache.ws.commons.axiom/old-tests/1.3.0-SNAPSHOT/old-tests-1.3.0-SNAPSHOT.pom
[JENKINS] Archiving <https://builds.apache.org/job/axiom-trunk/ws/axiom/systests/compat-tests/pom.xml>
to org.apache.ws.commons.axiom/compat-tests/1.3.0-SNAPSHOT/compat-tests-1.3.0-SNAPSHOT.pom
[JENKINS] Archiving <https://builds.apache.org/job/axiom-trunk/ws/axiom/components/pom.xml>
to org.apache.ws.commons.axiom/components/1.3.0-SNAPSHOT/components-1.3.0-SNAPSHOT.pom
[JENKINS] Archiving <https://builds.apache.org/job/axiom-trunk/ws/axiom/samples/pom.xml>
to org.apache.ws.commons.axiom/samples/1.3.0-SNAPSHOT/samples-1.3.0-SNAPSHOT.pom
[JENKINS] Archiving <https://builds.apache.org/job/axiom-trunk/ws/axiom/buildutils/pom.xml>
to org.apache.ws.commons.axiom/buildutils/1.3.0-SNAPSHOT/buildutils-1.3.0-SNAPSHOT.pom
[JENKINS] Archiving <https://builds.apache.org/job/axiom-trunk/ws/axiom/axiom-all/pom.xml>
to org.apache.ws.commons.axiom/axiom-all/1.3.0-SNAPSHOT/axiom-all-1.3.0-SNAPSHOT.pom
[JENKINS] Archiving <https://builds.apache.org/job/axiom-trunk/ws/axiom/aspects/pom.xml>
to org.apache.ws.commons.axiom/aspects/1.3.0-SNAPSHOT/aspects-1.3.0-SNAPSHOT.pom
Sending e-mails to: dev@ws.apache.org
channel stopped

---------------------------------------------------------------------
To unsubscribe, e-mail: dev-unsubscribe@ws.apache.org
For additional commands, e-mail: dev-help@ws.apache.org


Mime
View raw message