ws-dev mailing list archives

Site index · List index
Message view « Date » · « Thread »
Top « Date » · « Thread »
From Apache Jenkins Server <jenk...@builds.apache.org>
Subject Build failed in Jenkins: axiom-1.2.x #60
Date Sun, 10 Dec 2017 23:33:07 GMT
See <https://builds.apache.org/job/axiom-1.2.x/60/display/redirect?page=changes>

Changes:

[veithen] Merge r1781319 to the 1.2 branch.

------------------------------------------
[...truncated 2.08 MB...]
[INFO] Testing ............................................ SUCCESS [  9.264 s]
[INFO] Multiton pattern implementation .................... SUCCESS [ 16.597 s]
[INFO] Axiom Test Utilities ............................... SUCCESS [01:14 min]
[INFO] XML Test Suite ..................................... SUCCESS [ 17.742 s]
[INFO] jaxp-testsuite ..................................... SUCCESS [ 16.681 s]
[INFO] Google Truth extension for XML ..................... SUCCESS [ 24.920 s]
[INFO] components ......................................... SUCCESS [  7.308 s]
[INFO] xml-utils .......................................... SUCCESS [ 24.114 s]
[INFO] SOAP Test Suite .................................... SUCCESS [ 23.938 s]
[INFO] Axiom API .......................................... SUCCESS [01:58 min]
[INFO] Aspects ............................................ SUCCESS [  7.995 s]
[INFO] Core Aspects ....................................... SUCCESS [ 21.547 s]
[INFO] Shared Aspects ..................................... SUCCESS [ 15.935 s]
[INFO] OM Aspects ......................................... SUCCESS [ 36.052 s]
[INFO] Google Truth extension for Axiom ................... SUCCESS [ 17.267 s]
[INFO] Jaxen Test Suite ................................... SUCCESS [ 19.523 s]
[INFO] Axiom Implementation Test Suite .................... SUCCESS [ 41.782 s]
[INFO] Implementations .................................... SUCCESS [  9.628 s]
[INFO] LLOM ............................................... SUCCESS [02:58 min]
[INFO] DOM Aspects ........................................ SUCCESS [ 23.216 s]
[INFO] DOM Test Suite ..................................... SUCCESS [01:02 min]
[INFO] DOOM ............................................... SUCCESS [03:25 min]
[INFO] Axiom Compatibility Classes ........................ SUCCESS [ 25.732 s]
[INFO] Axiom JAXB Integration ............................. SUCCESS [ 23.736 s]
[INFO] Axiom C14N ......................................... SUCCESS [ 25.111 s]
[INFO] Axiom Uber-JAR ..................................... SUCCESS [  6.738 s]
[INFO] Samples ............................................ SUCCESS [ 13.127 s]
[INFO] System Tests ....................................... SUCCESS [  3.889 s]
[INFO] Cross OM Tests ..................................... SUCCESS [  8.233 s]
[INFO] Eclipse Tests ...................................... SUCCESS [ 35.346 s]
[INFO] JBoss Tests ........................................ SUCCESS [ 26.219 s]
[INFO] Axiom Test Suite (old) ............................. SUCCESS [ 11.516 s]
[INFO] Axiom OSGi Tests ................................... SUCCESS [ 15.125 s]
[INFO] Spring-WS Test Suite ............................... SUCCESS [ 59.424 s]
[INFO] Spring WS Tests .................................... SUCCESS [ 37.455 s]
[INFO] WSS4J Tests ........................................ SUCCESS [ 30.118 s]
[INFO] Developer Guide .................................... SUCCESS [ 12.889 s]
[INFO] User Guide ......................................... SUCCESS [  7.104 s]
[INFO] Javadoc ............................................ SUCCESS [ 16.131 s]
[INFO] FOM Aspects ........................................ FAILURE [ 11.640 s]
[INFO] FOM Test Suite ..................................... SKIPPED
[INFO] Abdera Model (FOM) Implementation .................. SKIPPED
[INFO] Distribution ....................................... SKIPPED
[INFO] Code Coverage Report ............................... SKIPPED
[INFO] SAAJ Test Suite .................................... SKIPPED
[INFO] ------------------------------------------------------------------------
[INFO] BUILD FAILURE
[INFO] ------------------------------------------------------------------------
[INFO] Total time: 27:25 min
[INFO] Finished at: 2017-12-10T23:31:57+00:00
[INFO] Final Memory: 317M/443M
[INFO] ------------------------------------------------------------------------
[ERROR] Failed to execute goal org.apache.maven.plugins:maven-source-plugin:3.0.0:jar-no-fork
(source-jars) on project fom-aspects: Error creating source archive: Problem creating jar:
Execution exception: Java heap space -> [Help 1]
[ERROR] 
[ERROR] To see the full stack trace of the errors, re-run Maven with the -e switch.
[ERROR] Re-run Maven using the -X switch to enable full debug logging.
[ERROR] 
[ERROR] For more information about the errors and possible solutions, please read the following
articles:
[ERROR] [Help 1] http://cwiki.apache.org/confluence/display/MAVEN/MojoExecutionException
[ERROR] 
[ERROR] After correcting the problems, you can resume the build with the command
[ERROR]   mvn <goals> -rf :fom-aspects
[JENKINS] Archiving <https://builds.apache.org/job/axiom-1.2.x/ws/axiom/aspects/core-aspects/pom.xml>
to org.apache.ws.commons.axiom/core-aspects/1.2.21-SNAPSHOT/core-aspects-1.2.21-SNAPSHOT.pom
[JENKINS] Archiving <https://builds.apache.org/job/axiom-1.2.x/ws/axiom/aspects/core-aspects/target/core-aspects-1.2.21-SNAPSHOT.jar>
to org.apache.ws.commons.axiom/core-aspects/1.2.21-20171210.231257-19/core-aspects-1.2.21-20171210.231257-19.jar
[JENKINS] Archiving <https://builds.apache.org/job/axiom-1.2.x/ws/axiom/aspects/core-aspects/target/core-aspects-1.2.21-SNAPSHOT-sources.jar>
to org.apache.ws.commons.axiom/core-aspects/1.2.21-20171210.231257-19/core-aspects-1.2.21-20171210.231257-19-sources.jar
[JENKINS] Archiving <https://builds.apache.org/job/axiom-1.2.x/ws/axiom/aspects/core-aspects/target/core-aspects-1.2.21-SNAPSHOT-javadoc.jar>
to org.apache.ws.commons.axiom/core-aspects/1.2.21-20171210.231257-19/core-aspects-1.2.21-20171210.231257-19-javadoc.jar
[JENKINS] Archiving <https://builds.apache.org/job/axiom-1.2.x/ws/axiom/components/xml-utils/pom.xml>
to org.apache.ws.commons.axiom/xml-utils/1.2.21-SNAPSHOT/xml-utils-1.2.21-SNAPSHOT.pom
[JENKINS] Archiving <https://builds.apache.org/job/axiom-1.2.x/ws/axiom/components/xml-utils/target/xml-utils-1.2.21-SNAPSHOT.jar>
to org.apache.ws.commons.axiom/xml-utils/1.2.21-20171210.230956-19/xml-utils-1.2.21-20171210.230956-19.jar
[JENKINS] Archiving <https://builds.apache.org/job/axiom-1.2.x/ws/axiom/components/xml-utils/target/xml-utils-1.2.21-SNAPSHOT-sources.jar>
to org.apache.ws.commons.axiom/xml-utils/1.2.21-20171210.230956-19/xml-utils-1.2.21-20171210.230956-19-sources.jar
[JENKINS] Archiving <https://builds.apache.org/job/axiom-1.2.x/ws/axiom/components/xml-utils/target/xml-utils-1.2.21-SNAPSHOT-javadoc.jar>
to org.apache.ws.commons.axiom/xml-utils/1.2.21-20171210.230956-19/xml-utils-1.2.21-20171210.230956-19-javadoc.jar
[JENKINS] Archiving <https://builds.apache.org/job/axiom-1.2.x/ws/axiom/components/xml-utils/target/jacoco.exec>
to org.apache.ws.commons.axiom/xml-utils/1.2.21-20171210.230956-19/xml-utils-1.2.21-20171210.230956-19-jacoco.exec
[JENKINS] Archiving <https://builds.apache.org/job/axiom-1.2.x/ws/axiom/axiom-c14n/pom.xml>
to org.apache.ws.commons.axiom/axiom-c14n/1.2.21-SNAPSHOT/axiom-c14n-1.2.21-SNAPSHOT.pom
[JENKINS] Archiving <https://builds.apache.org/job/axiom-1.2.x/ws/axiom/axiom-c14n/target/axiom-c14n-1.2.21-SNAPSHOT.jar>
to org.apache.ws.commons.axiom/axiom-c14n/1.2.21-20171210.232451-19/axiom-c14n-1.2.21-20171210.232451-19.jar
[JENKINS] Archiving <https://builds.apache.org/job/axiom-1.2.x/ws/axiom/axiom-c14n/target/axiom-c14n-1.2.21-SNAPSHOT-sources.jar>
to org.apache.ws.commons.axiom/axiom-c14n/1.2.21-20171210.232451-19/axiom-c14n-1.2.21-20171210.232451-19-sources.jar
[JENKINS] Archiving <https://builds.apache.org/job/axiom-1.2.x/ws/axiom/axiom-c14n/target/axiom-c14n-1.2.21-SNAPSHOT-javadoc.jar>
to org.apache.ws.commons.axiom/axiom-c14n/1.2.21-20171210.232451-19/axiom-c14n-1.2.21-20171210.232451-19-javadoc.jar
[JENKINS] Archiving <https://builds.apache.org/job/axiom-1.2.x/ws/axiom/axiom-c14n/target/jacoco.exec>
to org.apache.ws.commons.axiom/axiom-c14n/1.2.21-20171210.232451-19/axiom-c14n-1.2.21-20171210.232451-19-jacoco.exec
[JENKINS] Archiving <https://builds.apache.org/job/axiom-1.2.x/ws/axiom/systests/wss4j-tests/pom.xml>
to org.apache.ws.commons.axiom/wss4j-tests/1.2.21-SNAPSHOT/wss4j-tests-1.2.21-SNAPSHOT.pom
[JENKINS] Archiving <https://builds.apache.org/job/axiom-1.2.x/ws/axiom/systests/wss4j-tests/target/wss4j-tests-1.2.21-SNAPSHOT.jar>
to org.apache.ws.commons.axiom/wss4j-tests/1.2.21-SNAPSHOT/wss4j-tests-1.2.21-SNAPSHOT.jar
[JENKINS] Archiving <https://builds.apache.org/job/axiom-1.2.x/ws/axiom/systests/wss4j-tests/target/wss4j-tests-1.2.21-SNAPSHOT-sources.jar>
to org.apache.ws.commons.axiom/wss4j-tests/1.2.21-SNAPSHOT/wss4j-tests-1.2.21-SNAPSHOT-sources.jar
[JENKINS] Archiving <https://builds.apache.org/job/axiom-1.2.x/ws/axiom/systests/wss4j-tests/target/jacoco.exec>
to org.apache.ws.commons.axiom/wss4j-tests/1.2.21-SNAPSHOT/wss4j-tests-1.2.21-SNAPSHOT-jacoco.exec
[JENKINS] Archiving <https://builds.apache.org/job/axiom-1.2.x/ws/axiom/pom.xml> to
org.apache.ws.commons.axiom/axiom/1.2.21-SNAPSHOT/axiom-1.2.21-SNAPSHOT.pom
[JENKINS] Archiving <https://builds.apache.org/job/axiom-1.2.x/ws/axiom/target/axiom-1.2.21-SNAPSHOT-site.xml>
to org.apache.ws.commons.axiom/axiom/1.2.21-20171210.230448-20/axiom-1.2.21-20171210.230448-20-site.xml
[JENKINS] Archiving <https://builds.apache.org/job/axiom-1.2.x/ws/axiom/testing/soap-testsuite/pom.xml>
to org.apache.ws.commons.axiom/soap-testsuite/1.2.21-SNAPSHOT/soap-testsuite-1.2.21-SNAPSHOT.pom
[JENKINS] Archiving <https://builds.apache.org/job/axiom-1.2.x/ws/axiom/testing/soap-testsuite/target/soap-testsuite-1.2.21-SNAPSHOT.jar>
to org.apache.ws.commons.axiom/soap-testsuite/1.2.21-20171210.231022-19/soap-testsuite-1.2.21-20171210.231022-19.jar
[JENKINS] Archiving <https://builds.apache.org/job/axiom-1.2.x/ws/axiom/testing/soap-testsuite/target/soap-testsuite-1.2.21-SNAPSHOT-sources.jar>
to org.apache.ws.commons.axiom/soap-testsuite/1.2.21-20171210.231022-19/soap-testsuite-1.2.21-20171210.231022-19-sources.jar
[JENKINS] Archiving <https://builds.apache.org/job/axiom-1.2.x/ws/axiom/testing/soap-testsuite/target/soap-testsuite-1.2.21-SNAPSHOT-javadoc.jar>
to org.apache.ws.commons.axiom/soap-testsuite/1.2.21-20171210.231022-19/soap-testsuite-1.2.21-20171210.231022-19-javadoc.jar
[JENKINS] Archiving <https://builds.apache.org/job/axiom-1.2.x/ws/axiom/testing/soap-testsuite/target/jacoco.exec>
to org.apache.ws.commons.axiom/soap-testsuite/1.2.21-20171210.231022-19/soap-testsuite-1.2.21-20171210.231022-19-jacoco.exec
[Fast Archiver] Compressed 405.78 KB of artifacts by 31.5% relative to #59
[JENKINS] Archiving <https://builds.apache.org/job/axiom-1.2.x/ws/axiom/userguide/pom.xml>
to org.apache.ws.commons.axiom/userguide/1.2.21-SNAPSHOT/userguide-1.2.21-SNAPSHOT.pom
[JENKINS] Archiving <https://builds.apache.org/job/axiom-1.2.x/ws/axiom/userguide/target/docbkx/pdf/userguide.pdf>
to org.apache.ws.commons.axiom/userguide/1.2.21-SNAPSHOT/userguide-1.2.21-SNAPSHOT.pdf
[Fast Archiver] Compressed 348.69 KB of artifacts by 82.6% relative to #58
[JENKINS] Archiving <https://builds.apache.org/job/axiom-1.2.x/ws/axiom/devguide/pom.xml>
to org.apache.ws.commons.axiom/devguide/1.2.21-SNAPSHOT/devguide-1.2.21-SNAPSHOT.pom
[JENKINS] Archiving <https://builds.apache.org/job/axiom-1.2.x/ws/axiom/devguide/target/docbkx/pdf/devguide.pdf>
to org.apache.ws.commons.axiom/devguide/1.2.21-SNAPSHOT/devguide-1.2.21-SNAPSHOT.pdf
[Fast Archiver] Compressed 353.29 KB of artifacts by 81.5% relative to #58
[JENKINS] Archiving <https://builds.apache.org/job/axiom-1.2.x/ws/axiom/buildutils/jar-resource-bundle/pom.xml>
to org.apache.ws.commons.axiom/jar-resource-bundle/1.2.21-SNAPSHOT/jar-resource-bundle-1.2.21-SNAPSHOT.pom
[JENKINS] Archiving <https://builds.apache.org/job/axiom-1.2.x/ws/axiom/buildutils/jar-resource-bundle/target/jar-resource-bundle-1.2.21-SNAPSHOT.jar>
to org.apache.ws.commons.axiom/jar-resource-bundle/1.2.21-20171210.230515-20/jar-resource-bundle-1.2.21-20171210.230515-20.jar
[JENKINS] Archiving <https://builds.apache.org/job/axiom-1.2.x/ws/axiom/buildutils/jar-resource-bundle/target/jar-resource-bundle-1.2.21-SNAPSHOT-sources.jar>
to org.apache.ws.commons.axiom/jar-resource-bundle/1.2.21-20171210.230515-20/jar-resource-bundle-1.2.21-20171210.230515-20-sources.jar
[JENKINS] Archiving <https://builds.apache.org/job/axiom-1.2.x/ws/axiom/testing/pom.xml>
to org.apache.ws.commons.axiom/testing/1.2.21-SNAPSHOT/testing-1.2.21-SNAPSHOT.pom
[JENKINS] Archiving <https://builds.apache.org/job/axiom-1.2.x/ws/axiom/testing/target/testing-1.2.21-SNAPSHOT-site.xml>
to org.apache.ws.commons.axiom/testing/1.2.21-20171210.230646-19/testing-1.2.21-20171210.230646-19-site.xml
[JENKINS] Archiving <https://builds.apache.org/job/axiom-1.2.x/ws/axiom/buildutils/javadoc-postprocessor-plugin/pom.xml>
to org.apache.ws.commons.axiom/javadoc-postprocessor-plugin/1.2.21-SNAPSHOT/javadoc-postprocessor-plugin-1.2.21-SNAPSHOT.pom
[JENKINS] Archiving <https://builds.apache.org/job/axiom-1.2.x/ws/axiom/buildutils/javadoc-postprocessor-plugin/target/javadoc-postprocessor-plugin-1.2.21-SNAPSHOT.jar>
to org.apache.ws.commons.axiom/javadoc-postprocessor-plugin/1.2.21-20171210.230612-20/javadoc-postprocessor-plugin-1.2.21-20171210.230612-20.jar
[JENKINS] Archiving <https://builds.apache.org/job/axiom-1.2.x/ws/axiom/buildutils/javadoc-postprocessor-plugin/target/javadoc-postprocessor-plugin-1.2.21-SNAPSHOT-sources.jar>
to org.apache.ws.commons.axiom/javadoc-postprocessor-plugin/1.2.21-20171210.230612-20/javadoc-postprocessor-plugin-1.2.21-20171210.230612-20-sources.jar
[JENKINS] Archiving <https://builds.apache.org/job/axiom-1.2.x/ws/axiom/buildutils/javadoc-postprocessor-plugin/target/javadoc-postprocessor-plugin-1.2.21-SNAPSHOT-javadoc.jar>
to org.apache.ws.commons.axiom/javadoc-postprocessor-plugin/1.2.21-20171210.230612-20/javadoc-postprocessor-plugin-1.2.21-20171210.230612-20-javadoc.jar
[JENKINS] Archiving <https://builds.apache.org/job/axiom-1.2.x/ws/axiom/systests/osgi-tests/pom.xml>
to org.apache.ws.commons.axiom/osgi-tests/1.2.21-SNAPSHOT/osgi-tests-1.2.21-SNAPSHOT.pom
[JENKINS] Archiving <https://builds.apache.org/job/axiom-1.2.x/ws/axiom/systests/osgi-tests/target/osgi-tests-1.2.21-SNAPSHOT.jar>
to org.apache.ws.commons.axiom/osgi-tests/1.2.21-SNAPSHOT/osgi-tests-1.2.21-SNAPSHOT.jar
[JENKINS] Archiving <https://builds.apache.org/job/axiom-1.2.x/ws/axiom/systests/osgi-tests/target/osgi-tests-1.2.21-SNAPSHOT-sources.jar>
to org.apache.ws.commons.axiom/osgi-tests/1.2.21-SNAPSHOT/osgi-tests-1.2.21-SNAPSHOT-sources.jar
[JENKINS] Archiving <https://builds.apache.org/job/axiom-1.2.x/ws/axiom/systests/osgi-tests/target/jacoco.exec>
to org.apache.ws.commons.axiom/osgi-tests/1.2.21-SNAPSHOT/osgi-tests-1.2.21-SNAPSHOT-jacoco.exec
[JENKINS] Archiving <https://builds.apache.org/job/axiom-1.2.x/ws/axiom/testing/saaj-testsuite/pom.xml>
to org.apache.ws.commons.axiom/saaj-testsuite/1.2.21-SNAPSHOT/saaj-testsuite-1.2.21-SNAPSHOT.pom
[JENKINS] Archiving <https://builds.apache.org/job/axiom-1.2.x/ws/axiom/systests/cross-om-tests/pom.xml>
to org.apache.ws.commons.axiom/cross-om-tests/1.2.21-SNAPSHOT/cross-om-tests-1.2.21-SNAPSHOT.pom
[JENKINS] Archiving <https://builds.apache.org/job/axiom-1.2.x/ws/axiom/systests/cross-om-tests/target/cross-om-tests-1.2.21-SNAPSHOT.jar>
to org.apache.ws.commons.axiom/cross-om-tests/1.2.21-SNAPSHOT/cross-om-tests-1.2.21-SNAPSHOT.jar
[JENKINS] Archiving <https://builds.apache.org/job/axiom-1.2.x/ws/axiom/systests/cross-om-tests/target/cross-om-tests-1.2.21-SNAPSHOT-sources.jar>
to org.apache.ws.commons.axiom/cross-om-tests/1.2.21-SNAPSHOT/cross-om-tests-1.2.21-SNAPSHOT-sources.jar
[JENKINS] Archiving <https://builds.apache.org/job/axiom-1.2.x/ws/axiom/systests/cross-om-tests/target/jacoco.exec>
to org.apache.ws.commons.axiom/cross-om-tests/1.2.21-SNAPSHOT/cross-om-tests-1.2.21-SNAPSHOT-jacoco.exec
[JENKINS] Archiving <https://builds.apache.org/job/axiom-1.2.x/ws/axiom/testing/spring-ws-testsuite/pom.xml>
to org.apache.ws.commons.axiom/spring-ws-testsuite/1.2.21-SNAPSHOT/spring-ws-testsuite-1.2.21-SNAPSHOT.pom
[JENKINS] Archiving <https://builds.apache.org/job/axiom-1.2.x/ws/axiom/testing/spring-ws-testsuite/target/spring-ws-testsuite-1.2.21-SNAPSHOT.jar>
to org.apache.ws.commons.axiom/spring-ws-testsuite/1.2.21-20171210.232807-15/spring-ws-testsuite-1.2.21-20171210.232807-15.jar
[JENKINS] Archiving <https://builds.apache.org/job/axiom-1.2.x/ws/axiom/testing/spring-ws-testsuite/target/spring-ws-testsuite-1.2.21-SNAPSHOT-sources.jar>
to org.apache.ws.commons.axiom/spring-ws-testsuite/1.2.21-20171210.232807-15/spring-ws-testsuite-1.2.21-20171210.232807-15-sources.jar
[JENKINS] Archiving <https://builds.apache.org/job/axiom-1.2.x/ws/axiom/testing/spring-ws-testsuite/target/spring-ws-testsuite-1.2.21-SNAPSHOT-javadoc.jar>
to org.apache.ws.commons.axiom/spring-ws-testsuite/1.2.21-20171210.232807-15/spring-ws-testsuite-1.2.21-20171210.232807-15-javadoc.jar
[JENKINS] Archiving <https://builds.apache.org/job/axiom-1.2.x/ws/axiom/testing/spring-ws-testsuite/target/jacoco.exec>
to org.apache.ws.commons.axiom/spring-ws-testsuite/1.2.21-20171210.232807-15/spring-ws-testsuite-1.2.21-20171210.232807-15-jacoco.exec
[JENKINS] Archiving <https://builds.apache.org/job/axiom-1.2.x/ws/axiom/aspects/dom-aspects/pom.xml>
to org.apache.ws.commons.axiom/dom-aspects/1.2.21-SNAPSHOT/dom-aspects-1.2.21-SNAPSHOT.pom
[JENKINS] Archiving <https://builds.apache.org/job/axiom-1.2.x/ws/axiom/aspects/dom-aspects/target/dom-aspects-1.2.21-SNAPSHOT.jar>
to org.apache.ws.commons.axiom/dom-aspects/1.2.21-20171210.231855-19/dom-aspects-1.2.21-20171210.231855-19.jar
[JENKINS] Archiving <https://builds.apache.org/job/axiom-1.2.x/ws/axiom/aspects/dom-aspects/target/dom-aspects-1.2.21-SNAPSHOT-sources.jar>
to org.apache.ws.commons.axiom/dom-aspects/1.2.21-20171210.231855-19/dom-aspects-1.2.21-20171210.231855-19-sources.jar
[JENKINS] Archiving <https://builds.apache.org/job/axiom-1.2.x/ws/axiom/aspects/dom-aspects/target/dom-aspects-1.2.21-SNAPSHOT-javadoc.jar>
to org.apache.ws.commons.axiom/dom-aspects/1.2.21-20171210.231855-19/dom-aspects-1.2.21-20171210.231855-19-javadoc.jar
[JENKINS] Archiving <https://builds.apache.org/job/axiom-1.2.x/ws/axiom/aspects/dom-aspects/target/jacoco.exec>
to org.apache.ws.commons.axiom/dom-aspects/1.2.21-20171210.231855-19/dom-aspects-1.2.21-20171210.231855-19-jacoco.exec
[JENKINS] Archiving <https://builds.apache.org/job/axiom-1.2.x/ws/axiom/implementations/axiom-dom/pom.xml>
to org.apache.ws.commons.axiom/axiom-dom/1.2.21-SNAPSHOT/axiom-dom-1.2.21-SNAPSHOT.pom
[JENKINS] Archiving <https://builds.apache.org/job/axiom-1.2.x/ws/axiom/implementations/axiom-dom/target/axiom-dom-1.2.21-SNAPSHOT.jar>
to org.apache.ws.commons.axiom/axiom-dom/1.2.21-20171210.232325-19/axiom-dom-1.2.21-20171210.232325-19.jar
[JENKINS] Archiving <https://builds.apache.org/job/axiom-1.2.x/ws/axiom/implementations/axiom-dom/target/axiom-dom-1.2.21-SNAPSHOT-sources.jar>
to org.apache.ws.commons.axiom/axiom-dom/1.2.21-20171210.232325-19/axiom-dom-1.2.21-20171210.232325-19-sources.jar
[JENKINS] Archiving <https://builds.apache.org/job/axiom-1.2.x/ws/axiom/implementations/axiom-dom/target/axiom-dom-1.2.21-SNAPSHOT-javadoc.jar>
to org.apache.ws.commons.axiom/axiom-dom/1.2.21-20171210.232325-19/axiom-dom-1.2.21-20171210.232325-19-javadoc.jar
[JENKINS] Archiving <https://builds.apache.org/job/axiom-1.2.x/ws/axiom/implementations/axiom-dom/target/jacoco.exec>
to org.apache.ws.commons.axiom/axiom-dom/1.2.21-20171210.232325-19/axiom-dom-1.2.21-20171210.232325-19-jacoco.exec
[JENKINS] Archiving <https://builds.apache.org/job/axiom-1.2.x/ws/axiom/testing/jaxp-testsuite/pom.xml>
to org.apache.ws.commons.axiom/jaxp-testsuite/1.2.21-SNAPSHOT/jaxp-testsuite-1.2.21-SNAPSHOT.pom
[JENKINS] Archiving <https://builds.apache.org/job/axiom-1.2.x/ws/axiom/testing/jaxp-testsuite/target/jaxp-testsuite-1.2.21-SNAPSHOT.jar>
to org.apache.ws.commons.axiom/jaxp-testsuite/1.2.21-20171210.230856-19/jaxp-testsuite-1.2.21-20171210.230856-19.jar
[JENKINS] Archiving <https://builds.apache.org/job/axiom-1.2.x/ws/axiom/testing/jaxp-testsuite/target/jaxp-testsuite-1.2.21-SNAPSHOT-sources.jar>
to org.apache.ws.commons.axiom/jaxp-testsuite/1.2.21-20171210.230856-19/jaxp-testsuite-1.2.21-20171210.230856-19-sources.jar
[JENKINS] Archiving <https://builds.apache.org/job/axiom-1.2.x/ws/axiom/testing/jaxp-testsuite/target/jaxp-testsuite-1.2.21-SNAPSHOT-javadoc.jar>
to org.apache.ws.commons.axiom/jaxp-testsuite/1.2.21-20171210.230856-19/jaxp-testsuite-1.2.21-20171210.230856-19-javadoc.jar
[JENKINS] Archiving <https://builds.apache.org/job/axiom-1.2.x/ws/axiom/aspects/fom-aspects/pom.xml>
to org.apache.ws.commons.axiom/fom-aspects/1.2.21-SNAPSHOT/fom-aspects-1.2.21-SNAPSHOT.pom
[JENKINS] Archiving <https://builds.apache.org/job/axiom-1.2.x/ws/axiom/axiom-api/pom.xml>
to org.apache.ws.commons.axiom/axiom-api/1.2.21-SNAPSHOT/axiom-api-1.2.21-SNAPSHOT.pom
[JENKINS] Archiving <https://builds.apache.org/job/axiom-1.2.x/ws/axiom/axiom-api/target/axiom-api-1.2.21-SNAPSHOT.jar>
to org.apache.ws.commons.axiom/axiom-api/1.2.21-20171210.231219-19/axiom-api-1.2.21-20171210.231219-19.jar
[JENKINS] Archiving <https://builds.apache.org/job/axiom-1.2.x/ws/axiom/axiom-api/target/axiom-api-1.2.21-SNAPSHOT-sources.jar>
to org.apache.ws.commons.axiom/axiom-api/1.2.21-20171210.231219-19/axiom-api-1.2.21-20171210.231219-19-sources.jar
[JENKINS] Archiving <https://builds.apache.org/job/axiom-1.2.x/ws/axiom/axiom-api/target/axiom-api-1.2.21-SNAPSHOT-javadoc.jar>
to org.apache.ws.commons.axiom/axiom-api/1.2.21-20171210.231219-19/axiom-api-1.2.21-20171210.231219-19-javadoc.jar
[JENKINS] Archiving <https://builds.apache.org/job/axiom-1.2.x/ws/axiom/axiom-api/target/axiom-api-1.2.21-SNAPSHOT-tests.jar>
to org.apache.ws.commons.axiom/axiom-api/1.2.21-20171210.231219-19/axiom-api-1.2.21-20171210.231219-19-tests.jar
[JENKINS] Archiving <https://builds.apache.org/job/axiom-1.2.x/ws/axiom/axiom-api/target/jacoco.exec>
to org.apache.ws.commons.axiom/axiom-api/1.2.21-20171210.231219-19/axiom-api-1.2.21-20171210.231219-19-jacoco.exec
[JENKINS] Archiving <https://builds.apache.org/job/axiom-1.2.x/ws/axiom/testing/fom-testsuite/pom.xml>
to org.apache.ws.commons.axiom/fom-testsuite/1.2.21-SNAPSHOT/fom-testsuite-1.2.21-SNAPSHOT.pom
[JENKINS] Archiving <https://builds.apache.org/job/axiom-1.2.x/ws/axiom/testing/dom-testsuite/pom.xml>
to org.apache.ws.commons.axiom/dom-testsuite/1.2.21-SNAPSHOT/dom-testsuite-1.2.21-SNAPSHOT.pom
[JENKINS] Archiving <https://builds.apache.org/job/axiom-1.2.x/ws/axiom/testing/dom-testsuite/target/dom-testsuite-1.2.21-SNAPSHOT.jar>
to org.apache.ws.commons.axiom/dom-testsuite/1.2.21-20171210.231958-19/dom-testsuite-1.2.21-20171210.231958-19.jar
[JENKINS] Archiving <https://builds.apache.org/job/axiom-1.2.x/ws/axiom/testing/dom-testsuite/target/dom-testsuite-1.2.21-SNAPSHOT-sources.jar>
to org.apache.ws.commons.axiom/dom-testsuite/1.2.21-20171210.231958-19/dom-testsuite-1.2.21-20171210.231958-19-sources.jar
[JENKINS] Archiving <https://builds.apache.org/job/axiom-1.2.x/ws/axiom/testing/dom-testsuite/target/dom-testsuite-1.2.21-SNAPSHOT-javadoc.jar>
to org.apache.ws.commons.axiom/dom-testsuite/1.2.21-20171210.231958-19/dom-testsuite-1.2.21-20171210.231958-19-javadoc.jar
[JENKINS] Archiving <https://builds.apache.org/job/axiom-1.2.x/ws/axiom/testing/dom-testsuite/target/jacoco.exec>
to org.apache.ws.commons.axiom/dom-testsuite/1.2.21-20171210.231958-19/dom-testsuite-1.2.21-20171210.231958-19-jacoco.exec
[JENKINS] Archiving <https://builds.apache.org/job/axiom-1.2.x/ws/axiom/implementations/axiom-impl/pom.xml>
to org.apache.ws.commons.axiom/axiom-impl/1.2.21-SNAPSHOT/axiom-impl-1.2.21-SNAPSHOT.pom
[JENKINS] Archiving <https://builds.apache.org/job/axiom-1.2.x/ws/axiom/implementations/axiom-impl/target/axiom-impl-1.2.21-SNAPSHOT.jar>
to org.apache.ws.commons.axiom/axiom-impl/1.2.21-20171210.231826-19/axiom-impl-1.2.21-20171210.231826-19.jar
[JENKINS] Archiving <https://builds.apache.org/job/axiom-1.2.x/ws/axiom/implementations/axiom-impl/target/axiom-impl-1.2.21-SNAPSHOT-sources.jar>
to org.apache.ws.commons.axiom/axiom-impl/1.2.21-20171210.231826-19/axiom-impl-1.2.21-20171210.231826-19-sources.jar
[JENKINS] Archiving <https://builds.apache.org/job/axiom-1.2.x/ws/axiom/implementations/axiom-impl/target/axiom-impl-1.2.21-SNAPSHOT-javadoc.jar>
to org.apache.ws.commons.axiom/axiom-impl/1.2.21-20171210.231826-19/axiom-impl-1.2.21-20171210.231826-19-javadoc.jar
[JENKINS] Archiving <https://builds.apache.org/job/axiom-1.2.x/ws/axiom/implementations/axiom-impl/target/jacoco.exec>
to org.apache.ws.commons.axiom/axiom-impl/1.2.21-20171210.231826-19/axiom-impl-1.2.21-20171210.231826-19-jacoco.exec
[JENKINS] Archiving <https://builds.apache.org/job/axiom-1.2.x/ws/axiom/implementations/fom-impl/pom.xml>
to org.apache.ws.commons.axiom/fom-impl/1.2.21-SNAPSHOT/fom-impl-1.2.21-SNAPSHOT.pom
[JENKINS] Archiving <https://builds.apache.org/job/axiom-1.2.x/ws/axiom/testing/testutils/pom.xml>
to org.apache.ws.commons.axiom/testutils/1.2.21-SNAPSHOT/testutils-1.2.21-SNAPSHOT.pom
[JENKINS] Archiving <https://builds.apache.org/job/axiom-1.2.x/ws/axiom/testing/testutils/target/testutils-1.2.21-SNAPSHOT.jar>
to org.apache.ws.commons.axiom/testutils/1.2.21-20171210.230815-19/testutils-1.2.21-20171210.230815-19.jar
[JENKINS] Archiving <https://builds.apache.org/job/axiom-1.2.x/ws/axiom/testing/testutils/target/testutils-1.2.21-SNAPSHOT-sources.jar>
to org.apache.ws.commons.axiom/testutils/1.2.21-20171210.230815-19/testutils-1.2.21-20171210.230815-19-sources.jar
[JENKINS] Archiving <https://builds.apache.org/job/axiom-1.2.x/ws/axiom/testing/testutils/target/testutils-1.2.21-SNAPSHOT-javadoc.jar>
to org.apache.ws.commons.axiom/testutils/1.2.21-20171210.230815-19/testutils-1.2.21-20171210.230815-19-javadoc.jar
[JENKINS] Archiving <https://builds.apache.org/job/axiom-1.2.x/ws/axiom/testing/testutils/target/jacoco.exec>
to org.apache.ws.commons.axiom/testutils/1.2.21-20171210.230815-19/testutils-1.2.21-20171210.230815-19-jacoco.exec
[JENKINS] Archiving <https://builds.apache.org/job/axiom-1.2.x/ws/axiom/testing/xml-truth/pom.xml>
to org.apache.ws.commons.axiom/xml-truth/1.2.21-SNAPSHOT/xml-truth-1.2.21-SNAPSHOT.pom
[JENKINS] Archiving <https://builds.apache.org/job/axiom-1.2.x/ws/axiom/testing/xml-truth/target/xml-truth-1.2.21-SNAPSHOT.jar>
to org.apache.ws.commons.axiom/xml-truth/1.2.21-20171210.230921-19/xml-truth-1.2.21-20171210.230921-19.jar
[JENKINS] Archiving <https://builds.apache.org/job/axiom-1.2.x/ws/axiom/testing/xml-truth/target/xml-truth-1.2.21-SNAPSHOT-sources.jar>
to org.apache.ws.commons.axiom/xml-truth/1.2.21-20171210.230921-19/xml-truth-1.2.21-20171210.230921-19-sources.jar
[JENKINS] Archiving <https://builds.apache.org/job/axiom-1.2.x/ws/axiom/testing/xml-truth/target/xml-truth-1.2.21-SNAPSHOT-javadoc.jar>
to org.apache.ws.commons.axiom/xml-truth/1.2.21-20171210.230921-19/xml-truth-1.2.21-20171210.230921-19-javadoc.jar
[JENKINS] Archiving <https://builds.apache.org/job/axiom-1.2.x/ws/axiom/testing/xml-truth/target/jacoco.exec>
to org.apache.ws.commons.axiom/xml-truth/1.2.21-20171210.230921-19/xml-truth-1.2.21-20171210.230921-19-jacoco.exec
[JENKINS] Archiving <https://builds.apache.org/job/axiom-1.2.x/ws/axiom/apidocs/pom.xml>
to org.apache.ws.commons.axiom/apidocs/1.2.21-SNAPSHOT/apidocs-1.2.21-SNAPSHOT.pom
[JENKINS] Archiving <https://builds.apache.org/job/axiom-1.2.x/ws/axiom/apidocs/target/apidocs-1.2.21-SNAPSHOT-javadoc.zip>
to org.apache.ws.commons.axiom/apidocs/1.2.21-SNAPSHOT/apidocs-1.2.21-SNAPSHOT-javadoc.zip
[JENKINS] Archiving <https://builds.apache.org/job/axiom-1.2.x/ws/axiom/testing/xml-testsuite/pom.xml>
to org.apache.ws.commons.axiom/xml-testsuite/1.2.21-SNAPSHOT/xml-testsuite-1.2.21-SNAPSHOT.pom
[JENKINS] Archiving <https://builds.apache.org/job/axiom-1.2.x/ws/axiom/testing/xml-testsuite/target/xml-testsuite-1.2.21-SNAPSHOT.jar>
to org.apache.ws.commons.axiom/xml-testsuite/1.2.21-20171210.230837-19/xml-testsuite-1.2.21-20171210.230837-19.jar
[JENKINS] Archiving <https://builds.apache.org/job/axiom-1.2.x/ws/axiom/testing/xml-testsuite/target/xml-testsuite-1.2.21-SNAPSHOT-sources.jar>
to org.apache.ws.commons.axiom/xml-testsuite/1.2.21-20171210.230837-19/xml-testsuite-1.2.21-20171210.230837-19-sources.jar
[JENKINS] Archiving <https://builds.apache.org/job/axiom-1.2.x/ws/axiom/testing/xml-testsuite/target/xml-testsuite-1.2.21-SNAPSHOT-javadoc.jar>
to org.apache.ws.commons.axiom/xml-testsuite/1.2.21-20171210.230837-19/xml-testsuite-1.2.21-20171210.230837-19-javadoc.jar
[JENKINS] Archiving <https://builds.apache.org/job/axiom-1.2.x/ws/axiom/samples/pom.xml>
to org.apache.ws.commons.axiom/samples/1.2.21-SNAPSHOT/samples-1.2.21-SNAPSHOT.pom
[JENKINS] Archiving <https://builds.apache.org/job/axiom-1.2.x/ws/axiom/samples/target/samples-1.2.21-SNAPSHOT.jar>
to org.apache.ws.commons.axiom/samples/1.2.21-SNAPSHOT/samples-1.2.21-SNAPSHOT.jar
[JENKINS] Archiving <https://builds.apache.org/job/axiom-1.2.x/ws/axiom/samples/target/samples-1.2.21-SNAPSHOT-sources.jar>
to org.apache.ws.commons.axiom/samples/1.2.21-SNAPSHOT/samples-1.2.21-SNAPSHOT-sources.jar
[JENKINS] Archiving <https://builds.apache.org/job/axiom-1.2.x/ws/axiom/samples/target/jacoco.exec>
to org.apache.ws.commons.axiom/samples/1.2.21-SNAPSHOT/samples-1.2.21-SNAPSHOT-jacoco.exec
[Fast Archiver] Compressed 101.94 KB of artifacts by 31.4% relative to #59
[JENKINS] Archiving <https://builds.apache.org/job/axiom-1.2.x/ws/axiom/buildutils/pom.xml>
to org.apache.ws.commons.axiom/buildutils/1.2.21-SNAPSHOT/buildutils-1.2.21-SNAPSHOT.pom
[JENKINS] Archiving <https://builds.apache.org/job/axiom-1.2.x/ws/axiom/axiom-all/pom.xml>
to org.apache.ws.commons.axiom/axiom-all/1.2.21-SNAPSHOT/axiom-all-1.2.21-SNAPSHOT.pom
[JENKINS] Archiving <https://builds.apache.org/job/axiom-1.2.x/ws/axiom/axiom-all/target/axiom-all-1.2.21-SNAPSHOT.jar>
to org.apache.ws.commons.axiom/axiom-all/1.2.21-SNAPSHOT/axiom-all-1.2.21-SNAPSHOT.jar
[JENKINS] Archiving <https://builds.apache.org/job/axiom-1.2.x/ws/axiom/axiom-all/target/axiom-all-1.2.21-SNAPSHOT-sources.jar>
to org.apache.ws.commons.axiom/axiom-all/1.2.21-SNAPSHOT/axiom-all-1.2.21-SNAPSHOT-sources.jar
[JENKINS] Archiving <https://builds.apache.org/job/axiom-1.2.x/ws/axiom/code-coverage/pom.xml>
to org.apache.ws.commons.axiom/code-coverage/1.2.21-SNAPSHOT/code-coverage-1.2.21-SNAPSHOT.pom
[JENKINS] Archiving <https://builds.apache.org/job/axiom-1.2.x/ws/axiom/implementations/pom.xml>
to org.apache.ws.commons.axiom/implementations/1.2.21-SNAPSHOT/implementations-1.2.21-SNAPSHOT.pom
[JENKINS] Archiving <https://builds.apache.org/job/axiom-1.2.x/ws/axiom/implementations/target/implementations-1.2.21-SNAPSHOT-site.xml>
to org.apache.ws.commons.axiom/implementations/1.2.21-20171210.231534-19/implementations-1.2.21-20171210.231534-19-site.xml
[JENKINS] Archiving <https://builds.apache.org/job/axiom-1.2.x/ws/axiom/systests/pom.xml>
to org.apache.ws.commons.axiom/systests/1.2.21-SNAPSHOT/systests-1.2.21-SNAPSHOT.pom
[JENKINS] Archiving <https://builds.apache.org/job/axiom-1.2.x/ws/axiom/distribution/pom.xml>
to org.apache.ws.commons.axiom/distribution/1.2.21-SNAPSHOT/distribution-1.2.21-SNAPSHOT.pom
[JENKINS] Archiving <https://builds.apache.org/job/axiom-1.2.x/ws/axiom/testing/axiom-truth/pom.xml>
to org.apache.ws.commons.axiom/axiom-truth/1.2.21-SNAPSHOT/axiom-truth-1.2.21-SNAPSHOT.pom
[JENKINS] Archiving <https://builds.apache.org/job/axiom-1.2.x/ws/axiom/testing/axiom-truth/target/axiom-truth-1.2.21-SNAPSHOT.jar>
to org.apache.ws.commons.axiom/axiom-truth/1.2.21-20171210.231414-19/axiom-truth-1.2.21-20171210.231414-19.jar
[JENKINS] Archiving <https://builds.apache.org/job/axiom-1.2.x/ws/axiom/testing/axiom-truth/target/axiom-truth-1.2.21-SNAPSHOT-sources.jar>
to org.apache.ws.commons.axiom/axiom-truth/1.2.21-20171210.231414-19/axiom-truth-1.2.21-20171210.231414-19-sources.jar
[JENKINS] Archiving <https://builds.apache.org/job/axiom-1.2.x/ws/axiom/testing/axiom-truth/target/axiom-truth-1.2.21-SNAPSHOT-javadoc.jar>
to org.apache.ws.commons.axiom/axiom-truth/1.2.21-20171210.231414-19/axiom-truth-1.2.21-20171210.231414-19-javadoc.jar
[JENKINS] Archiving <https://builds.apache.org/job/axiom-1.2.x/ws/axiom/systests/jboss-tests/pom.xml>
to org.apache.ws.commons.axiom/jboss-tests/1.2.21-SNAPSHOT/jboss-tests-1.2.21-SNAPSHOT.pom
[JENKINS] Archiving <https://builds.apache.org/job/axiom-1.2.x/ws/axiom/systests/jboss-tests/target/jboss-tests-1.2.21-SNAPSHOT.jar>
to org.apache.ws.commons.axiom/jboss-tests/1.2.21-SNAPSHOT/jboss-tests-1.2.21-SNAPSHOT.jar
[JENKINS] Archiving <https://builds.apache.org/job/axiom-1.2.x/ws/axiom/systests/jboss-tests/target/jboss-tests-1.2.21-SNAPSHOT-sources.jar>
to org.apache.ws.commons.axiom/jboss-tests/1.2.21-SNAPSHOT/jboss-tests-1.2.21-SNAPSHOT-sources.jar
[JENKINS] Archiving <https://builds.apache.org/job/axiom-1.2.x/ws/axiom/systests/jboss-tests/target/jacoco.exec>
to org.apache.ws.commons.axiom/jboss-tests/1.2.21-SNAPSHOT/jboss-tests-1.2.21-SNAPSHOT-jacoco.exec
[Fast Archiver] Compressed 458.43 KB of artifacts by 14.0% relative to #59
[JENKINS] Archiving <https://builds.apache.org/job/axiom-1.2.x/ws/axiom/systests/spring-ws-tests/pom.xml>
to org.apache.ws.commons.axiom/spring-ws-tests/1.2.21-SNAPSHOT/spring-ws-tests-1.2.21-SNAPSHOT.pom
[JENKINS] Archiving <https://builds.apache.org/job/axiom-1.2.x/ws/axiom/systests/spring-ws-tests/target/spring-ws-tests-1.2.21-SNAPSHOT.jar>
to org.apache.ws.commons.axiom/spring-ws-tests/1.2.21-SNAPSHOT/spring-ws-tests-1.2.21-SNAPSHOT.jar
[JENKINS] Archiving <https://builds.apache.org/job/axiom-1.2.x/ws/axiom/systests/spring-ws-tests/target/spring-ws-tests-1.2.21-SNAPSHOT-sources.jar>
to org.apache.ws.commons.axiom/spring-ws-tests/1.2.21-SNAPSHOT/spring-ws-tests-1.2.21-SNAPSHOT-sources.jar
[JENKINS] Archiving <https://builds.apache.org/job/axiom-1.2.x/ws/axiom/systests/spring-ws-tests/target/jacoco.exec>
to org.apache.ws.commons.axiom/spring-ws-tests/1.2.21-SNAPSHOT/spring-ws-tests-1.2.21-SNAPSHOT-jacoco.exec
[JENKINS] Archiving <https://builds.apache.org/job/axiom-1.2.x/ws/axiom/aspects/om-aspects/pom.xml>
to org.apache.ws.commons.axiom/om-aspects/1.2.21-SNAPSHOT/om-aspects-1.2.21-SNAPSHOT.pom
[JENKINS] Archiving <https://builds.apache.org/job/axiom-1.2.x/ws/axiom/aspects/om-aspects/target/om-aspects-1.2.21-SNAPSHOT.jar>
to org.apache.ws.commons.axiom/om-aspects/1.2.21-20171210.231351-19/om-aspects-1.2.21-20171210.231351-19.jar
[JENKINS] Archiving <https://builds.apache.org/job/axiom-1.2.x/ws/axiom/aspects/om-aspects/target/om-aspects-1.2.21-SNAPSHOT-sources.jar>
to org.apache.ws.commons.axiom/om-aspects/1.2.21-20171210.231351-19/om-aspects-1.2.21-20171210.231351-19-sources.jar
[JENKINS] Archiving <https://builds.apache.org/job/axiom-1.2.x/ws/axiom/aspects/om-aspects/target/om-aspects-1.2.21-SNAPSHOT-javadoc.jar>
to org.apache.ws.commons.axiom/om-aspects/1.2.21-20171210.231351-19/om-aspects-1.2.21-20171210.231351-19-javadoc.jar
[JENKINS] Archiving <https://builds.apache.org/job/axiom-1.2.x/ws/axiom/aspects/om-aspects/target/jacoco.exec>
to org.apache.ws.commons.axiom/om-aspects/1.2.21-20171210.231351-19/om-aspects-1.2.21-20171210.231351-19-jacoco.exec
[Fast Archiver] Compressed 1.51 MB of artifacts by 29.0% relative to #59
[JENKINS] Archiving <https://builds.apache.org/job/axiom-1.2.x/ws/axiom/testing/jaxen-testsuite/pom.xml>
to org.apache.ws.commons.axiom/jaxen-testsuite/1.2.21-SNAPSHOT/jaxen-testsuite-1.2.21-SNAPSHOT.pom
[JENKINS] Archiving <https://builds.apache.org/job/axiom-1.2.x/ws/axiom/testing/jaxen-testsuite/target/jaxen-testsuite-1.2.21-SNAPSHOT.jar>
to org.apache.ws.commons.axiom/jaxen-testsuite/1.2.21-20171210.231435-19/jaxen-testsuite-1.2.21-20171210.231435-19.jar
[JENKINS] Archiving <https://builds.apache.org/job/axiom-1.2.x/ws/axiom/testing/jaxen-testsuite/target/jaxen-testsuite-1.2.21-SNAPSHOT-sources.jar>
to org.apache.ws.commons.axiom/jaxen-testsuite/1.2.21-20171210.231435-19/jaxen-testsuite-1.2.21-20171210.231435-19-sources.jar
[JENKINS] Archiving <https://builds.apache.org/job/axiom-1.2.x/ws/axiom/testing/jaxen-testsuite/target/jaxen-testsuite-1.2.21-SNAPSHOT-javadoc.jar>
to org.apache.ws.commons.axiom/jaxen-testsuite/1.2.21-20171210.231435-19/jaxen-testsuite-1.2.21-20171210.231435-19-javadoc.jar
[Fast Archiver] Compressed 252.03 KB of artifacts by 25.4% relative to #59
[JENKINS] Archiving <https://builds.apache.org/job/axiom-1.2.x/ws/axiom/systests/eclipse-tests/pom.xml>
to org.apache.ws.commons.axiom/eclipse-tests/1.2.21-SNAPSHOT/eclipse-tests-1.2.21-SNAPSHOT.pom
[JENKINS] Archiving <https://builds.apache.org/job/axiom-1.2.x/ws/axiom/systests/eclipse-tests/target/it/project/target/jacoco.exec>
to org.apache.ws.commons.axiom/eclipse-tests/1.2.21-SNAPSHOT/eclipse-tests-1.2.21-SNAPSHOT-jacoco.exec
[JENKINS] Archiving <https://builds.apache.org/job/axiom-1.2.x/ws/axiom/aspects/shared-aspects/pom.xml>
to org.apache.ws.commons.axiom/shared-aspects/1.2.21-SNAPSHOT/shared-aspects-1.2.21-SNAPSHOT.pom
[JENKINS] Archiving <https://builds.apache.org/job/axiom-1.2.x/ws/axiom/aspects/shared-aspects/target/shared-aspects-1.2.21-SNAPSHOT.jar>
to org.apache.ws.commons.axiom/shared-aspects/1.2.21-20171210.231316-19/shared-aspects-1.2.21-20171210.231316-19.jar
[JENKINS] Archiving <https://builds.apache.org/job/axiom-1.2.x/ws/axiom/aspects/shared-aspects/target/shared-aspects-1.2.21-SNAPSHOT-sources.jar>
to org.apache.ws.commons.axiom/shared-aspects/1.2.21-20171210.231316-19/shared-aspects-1.2.21-20171210.231316-19-sources.jar
[JENKINS] Archiving <https://builds.apache.org/job/axiom-1.2.x/ws/axiom/aspects/shared-aspects/target/shared-aspects-1.2.21-SNAPSHOT-javadoc.jar>
to org.apache.ws.commons.axiom/shared-aspects/1.2.21-20171210.231316-19/shared-aspects-1.2.21-20171210.231316-19-javadoc.jar
[JENKINS] Archiving <https://builds.apache.org/job/axiom-1.2.x/ws/axiom/buildutils/shade-osgi/pom.xml>
to org.apache.ws.commons.axiom/shade-osgi/1.2.21-SNAPSHOT/shade-osgi-1.2.21-SNAPSHOT.pom
[JENKINS] Archiving <https://builds.apache.org/job/axiom-1.2.x/ws/axiom/buildutils/shade-osgi/target/shade-osgi-1.2.21-SNAPSHOT.jar>
to org.apache.ws.commons.axiom/shade-osgi/1.2.21-20171210.230551-20/shade-osgi-1.2.21-20171210.230551-20.jar
[JENKINS] Archiving <https://builds.apache.org/job/axiom-1.2.x/ws/axiom/buildutils/shade-osgi/target/shade-osgi-1.2.21-SNAPSHOT-sources.jar>
to org.apache.ws.commons.axiom/shade-osgi/1.2.21-20171210.230551-20/shade-osgi-1.2.21-20171210.230551-20-sources.jar
[JENKINS] Archiving <https://builds.apache.org/job/axiom-1.2.x/ws/axiom/buildutils/shade-osgi/target/shade-osgi-1.2.21-SNAPSHOT-javadoc.jar>
to org.apache.ws.commons.axiom/shade-osgi/1.2.21-20171210.230551-20/shade-osgi-1.2.21-20171210.230551-20-javadoc.jar
[JENKINS] Archiving <https://builds.apache.org/job/axiom-1.2.x/ws/axiom/buildutils/shade-axiom-xml/pom.xml>
to org.apache.ws.commons.axiom/shade-axiom-xml/1.2.21-SNAPSHOT/shade-axiom-xml-1.2.21-SNAPSHOT.pom
[JENKINS] Archiving <https://builds.apache.org/job/axiom-1.2.x/ws/axiom/buildutils/shade-axiom-xml/target/shade-axiom-xml-1.2.21-SNAPSHOT.jar>
to org.apache.ws.commons.axiom/shade-axiom-xml/1.2.21-20171210.230533-20/shade-axiom-xml-1.2.21-20171210.230533-20.jar
[JENKINS] Archiving <https://builds.apache.org/job/axiom-1.2.x/ws/axiom/buildutils/shade-axiom-xml/target/shade-axiom-xml-1.2.21-SNAPSHOT-sources.jar>
to org.apache.ws.commons.axiom/shade-axiom-xml/1.2.21-20171210.230533-20/shade-axiom-xml-1.2.21-20171210.230533-20-sources.jar
[JENKINS] Archiving <https://builds.apache.org/job/axiom-1.2.x/ws/axiom/buildutils/shade-axiom-xml/target/shade-axiom-xml-1.2.21-SNAPSHOT-javadoc.jar>
to org.apache.ws.commons.axiom/shade-axiom-xml/1.2.21-20171210.230533-20/shade-axiom-xml-1.2.21-20171210.230533-20-javadoc.jar
[JENKINS] Archiving <https://builds.apache.org/job/axiom-1.2.x/ws/axiom/axiom-jaxb/pom.xml>
to org.apache.ws.commons.axiom/axiom-jaxb/1.2.21-SNAPSHOT/axiom-jaxb-1.2.21-SNAPSHOT.pom
[JENKINS] Archiving <https://builds.apache.org/job/axiom-1.2.x/ws/axiom/axiom-jaxb/target/axiom-jaxb-1.2.21-SNAPSHOT.jar>
to org.apache.ws.commons.axiom/axiom-jaxb/1.2.21-20171210.232423-19/axiom-jaxb-1.2.21-20171210.232423-19.jar
[JENKINS] Archiving <https://builds.apache.org/job/axiom-1.2.x/ws/axiom/axiom-jaxb/target/axiom-jaxb-1.2.21-SNAPSHOT-sources.jar>
to org.apache.ws.commons.axiom/axiom-jaxb/1.2.21-20171210.232423-19/axiom-jaxb-1.2.21-20171210.232423-19-sources.jar
[JENKINS] Archiving <https://builds.apache.org/job/axiom-1.2.x/ws/axiom/axiom-jaxb/target/axiom-jaxb-1.2.21-SNAPSHOT-javadoc.jar>
to org.apache.ws.commons.axiom/axiom-jaxb/1.2.21-20171210.232423-19/axiom-jaxb-1.2.21-20171210.232423-19-javadoc.jar
[JENKINS] Archiving <https://builds.apache.org/job/axiom-1.2.x/ws/axiom/axiom-jaxb/target/jacoco.exec>
to org.apache.ws.commons.axiom/axiom-jaxb/1.2.21-20171210.232423-19/axiom-jaxb-1.2.21-20171210.232423-19-jacoco.exec
[JENKINS] Archiving <https://builds.apache.org/job/axiom-1.2.x/ws/axiom/testing/axiom-testsuite/pom.xml>
to org.apache.ws.commons.axiom/axiom-testsuite/1.2.21-SNAPSHOT/axiom-testsuite-1.2.21-SNAPSHOT.pom
[JENKINS] Archiving <https://builds.apache.org/job/axiom-1.2.x/ws/axiom/testing/axiom-testsuite/target/axiom-testsuite-1.2.21-SNAPSHOT.jar>
to org.apache.ws.commons.axiom/axiom-testsuite/1.2.21-20171210.231518-19/axiom-testsuite-1.2.21-20171210.231518-19.jar
[JENKINS] Archiving <https://builds.apache.org/job/axiom-1.2.x/ws/axiom/testing/axiom-testsuite/target/axiom-testsuite-1.2.21-SNAPSHOT-sources.jar>
to org.apache.ws.commons.axiom/axiom-testsuite/1.2.21-20171210.231518-19/axiom-testsuite-1.2.21-20171210.231518-19-sources.jar
[JENKINS] Archiving <https://builds.apache.org/job/axiom-1.2.x/ws/axiom/testing/axiom-testsuite/target/axiom-testsuite-1.2.21-SNAPSHOT-javadoc.jar>
to org.apache.ws.commons.axiom/axiom-testsuite/1.2.21-20171210.231518-19/axiom-testsuite-1.2.21-20171210.231518-19-javadoc.jar
[JENKINS] Archiving <https://builds.apache.org/job/axiom-1.2.x/ws/axiom/testing/multiton/pom.xml>
to org.apache.ws.commons.axiom/multiton/1.2.21-SNAPSHOT/multiton-1.2.21-SNAPSHOT.pom
[JENKINS] Archiving <https://builds.apache.org/job/axiom-1.2.x/ws/axiom/testing/multiton/target/multiton-1.2.21-SNAPSHOT.jar>
to org.apache.ws.commons.axiom/multiton/1.2.21-20171210.230700-19/multiton-1.2.21-20171210.230700-19.jar
[JENKINS] Archiving <https://builds.apache.org/job/axiom-1.2.x/ws/axiom/testing/multiton/target/multiton-1.2.21-SNAPSHOT-sources.jar>
to org.apache.ws.commons.axiom/multiton/1.2.21-20171210.230700-19/multiton-1.2.21-20171210.230700-19-sources.jar
[JENKINS] Archiving <https://builds.apache.org/job/axiom-1.2.x/ws/axiom/testing/multiton/target/multiton-1.2.21-SNAPSHOT-javadoc.jar>
to org.apache.ws.commons.axiom/multiton/1.2.21-20171210.230700-19/multiton-1.2.21-20171210.230700-19-javadoc.jar
[JENKINS] Archiving <https://builds.apache.org/job/axiom-1.2.x/ws/axiom/buildutils/no-package-cycles-enforcer-rule/pom.xml>
to org.apache.ws.commons.axiom/no-package-cycles-enforcer-rule/1.2.21-SNAPSHOT/no-package-cycles-enforcer-rule-1.2.21-SNAPSHOT.pom
[JENKINS] Archiving <https://builds.apache.org/job/axiom-1.2.x/ws/axiom/buildutils/no-package-cycles-enforcer-rule/target/no-package-cycles-enforcer-rule-1.2.21-SNAPSHOT.jar>
to org.apache.ws.commons.axiom/no-package-cycles-enforcer-rule/1.2.21-20171210.230632-19/no-package-cycles-enforcer-rule-1.2.21-20171210.230632-19.jar
[JENKINS] Archiving <https://builds.apache.org/job/axiom-1.2.x/ws/axiom/buildutils/no-package-cycles-enforcer-rule/target/no-package-cycles-enforcer-rule-1.2.21-SNAPSHOT-sources.jar>
to org.apache.ws.commons.axiom/no-package-cycles-enforcer-rule/1.2.21-20171210.230632-19/no-package-cycles-enforcer-rule-1.2.21-20171210.230632-19-sources.jar
[JENKINS] Archiving <https://builds.apache.org/job/axiom-1.2.x/ws/axiom/buildutils/no-package-cycles-enforcer-rule/target/no-package-cycles-enforcer-rule-1.2.21-SNAPSHOT-javadoc.jar>
to org.apache.ws.commons.axiom/no-package-cycles-enforcer-rule/1.2.21-20171210.230632-19/no-package-cycles-enforcer-rule-1.2.21-20171210.230632-19-javadoc.jar
[JENKINS] Archiving <https://builds.apache.org/job/axiom-1.2.x/ws/axiom/axiom-compat/pom.xml>
to org.apache.ws.commons.axiom/axiom-compat/1.2.21-SNAPSHOT/axiom-compat-1.2.21-SNAPSHOT.pom
[JENKINS] Archiving <https://builds.apache.org/job/axiom-1.2.x/ws/axiom/axiom-compat/target/axiom-compat-1.2.21-SNAPSHOT.jar>
to org.apache.ws.commons.axiom/axiom-compat/1.2.21-20171210.232357-19/axiom-compat-1.2.21-20171210.232357-19.jar
[JENKINS] Archiving <https://builds.apache.org/job/axiom-1.2.x/ws/axiom/axiom-compat/target/axiom-compat-1.2.21-SNAPSHOT-sources.jar>
to org.apache.ws.commons.axiom/axiom-compat/1.2.21-20171210.232357-19/axiom-compat-1.2.21-20171210.232357-19-sources.jar
[JENKINS] Archiving <https://builds.apache.org/job/axiom-1.2.x/ws/axiom/axiom-compat/target/axiom-compat-1.2.21-SNAPSHOT-javadoc.jar>
to org.apache.ws.commons.axiom/axiom-compat/1.2.21-20171210.232357-19/axiom-compat-1.2.21-20171210.232357-19-javadoc.jar
[JENKINS] Archiving <https://builds.apache.org/job/axiom-1.2.x/ws/axiom/axiom-compat/target/jacoco.exec>
to org.apache.ws.commons.axiom/axiom-compat/1.2.21-20171210.232357-19/axiom-compat-1.2.21-20171210.232357-19-jacoco.exec
[JENKINS] Archiving <https://builds.apache.org/job/axiom-1.2.x/ws/axiom/systests/old-tests/pom.xml>
to org.apache.ws.commons.axiom/old-tests/1.2.21-SNAPSHOT/old-tests-1.2.21-SNAPSHOT.pom
[JENKINS] Archiving <https://builds.apache.org/job/axiom-1.2.x/ws/axiom/systests/old-tests/target/old-tests-1.2.21-SNAPSHOT.jar>
to org.apache.ws.commons.axiom/old-tests/1.2.21-SNAPSHOT/old-tests-1.2.21-SNAPSHOT.jar
[JENKINS] Archiving <https://builds.apache.org/job/axiom-1.2.x/ws/axiom/systests/old-tests/target/old-tests-1.2.21-SNAPSHOT-sources.jar>
to org.apache.ws.commons.axiom/old-tests/1.2.21-SNAPSHOT/old-tests-1.2.21-SNAPSHOT-sources.jar
[JENKINS] Archiving <https://builds.apache.org/job/axiom-1.2.x/ws/axiom/systests/old-tests/target/jacoco.exec>
to org.apache.ws.commons.axiom/old-tests/1.2.21-SNAPSHOT/old-tests-1.2.21-SNAPSHOT-jacoco.exec
[JENKINS] Archiving <https://builds.apache.org/job/axiom-1.2.x/ws/axiom/components/pom.xml>
to org.apache.ws.commons.axiom/components/1.2.21-SNAPSHOT/components-1.2.21-SNAPSHOT.pom
[JENKINS] Archiving <https://builds.apache.org/job/axiom-1.2.x/ws/axiom/aspects/pom.xml>
to org.apache.ws.commons.axiom/aspects/1.2.21-SNAPSHOT/aspects-1.2.21-SNAPSHOT.pom
Sending e-mails to: dev@ws.apache.org
Sending e-mails to: dev@ws.apache.org
channel stopped


---------------------------------------------------------------------
To unsubscribe, e-mail: dev-unsubscribe@ws.apache.org
For additional commands, e-mail: dev-help@ws.apache.org


Mime
View raw message