ws-dev mailing list archives

Site index · List index
Message view « Date » · « Thread »
Top « Date » · « Thread »
From Apache Jenkins Server <jenk...@builds.apache.org>
Subject Build failed in Jenkins: axiom-1.2.x #59
Date Sun, 10 Dec 2017 20:50:39 GMT
See <https://builds.apache.org/job/axiom-1.2.x/59/display/redirect?page=changes>

Changes:

[veithen] Merge r1817725 and r1817727 to the 1.2 branch.

------------------------------------------
[...truncated 2.64 MB...]
[INFO] 
[INFO] --- maven-source-plugin:3.0.0:jar-no-fork (source-jars) @ spring-ws-testsuite ---
[INFO] Building jar: <https://builds.apache.org/job/axiom-1.2.x/ws/axiom/testing/spring-ws-testsuite/target/spring-ws-testsuite-1.2.21-SNAPSHOT-sources.jar>
[INFO] 
[INFO] --- maven-jar-plugin:3.0.0:jar (default-jar) @ spring-ws-testsuite ---
[INFO] Building jar: <https://builds.apache.org/job/axiom-1.2.x/ws/axiom/testing/spring-ws-testsuite/target/spring-ws-testsuite-1.2.21-SNAPSHOT.jar>
[INFO] ------------------------------------------------------------------------
[INFO] Reactor Summary:
[INFO] 
[INFO] Axiom .............................................. SUCCESS [ 28.378 s]
[INFO] Build utilities .................................... SUCCESS [  7.748 s]
[INFO] JAR Resource Bundle ................................ SUCCESS [ 15.077 s]
[INFO] Resource Transformer for META-INF/axiom.xml files .. SUCCESS [ 17.730 s]
[INFO] Resource Transformer for OSGi Manifests ............ SUCCESS [ 16.687 s]
[INFO] javadoc-postprocessor-plugin ....................... SUCCESS [ 20.398 s]
[INFO] no-package-cycles-enforcer-rule .................... SUCCESS [ 16.717 s]
[INFO] Testing ............................................ SUCCESS [  9.268 s]
[INFO] Multiton pattern implementation .................... SUCCESS [ 17.094 s]
[INFO] Axiom Test Utilities ............................... SUCCESS [01:17 min]
[INFO] XML Test Suite ..................................... SUCCESS [ 19.860 s]
[INFO] jaxp-testsuite ..................................... SUCCESS [ 17.541 s]
[INFO] Google Truth extension for XML ..................... SUCCESS [ 27.451 s]
[INFO] components ......................................... SUCCESS [  7.639 s]
[INFO] xml-utils .......................................... SUCCESS [ 33.133 s]
[INFO] SOAP Test Suite .................................... SUCCESS [ 24.094 s]
[INFO] Axiom API .......................................... SUCCESS [01:42 min]
[INFO] Aspects ............................................ SUCCESS [  9.040 s]
[INFO] Core Aspects ....................................... SUCCESS [ 22.045 s]
[INFO] Shared Aspects ..................................... SUCCESS [ 16.617 s]
[INFO] OM Aspects ......................................... SUCCESS [ 36.934 s]
[INFO] Google Truth extension for Axiom ................... SUCCESS [ 18.410 s]
[INFO] Jaxen Test Suite ................................... SUCCESS [ 19.420 s]
[INFO] Axiom Implementation Test Suite .................... SUCCESS [ 45.567 s]
[INFO] Implementations .................................... SUCCESS [  9.641 s]
[INFO] LLOM ............................................... SUCCESS [03:12 min]
[INFO] DOM Aspects ........................................ SUCCESS [ 23.393 s]
[INFO] DOM Test Suite ..................................... SUCCESS [01:06 min]
[INFO] DOOM ............................................... SUCCESS [03:41 min]
[INFO] Axiom Compatibility Classes ........................ SUCCESS [ 28.643 s]
[INFO] Axiom JAXB Integration ............................. SUCCESS [ 25.156 s]
[INFO] Axiom C14N ......................................... SUCCESS [ 25.651 s]
[INFO] Axiom Uber-JAR ..................................... SUCCESS [  6.985 s]
[INFO] Samples ............................................ SUCCESS [ 14.593 s]
[INFO] System Tests ....................................... SUCCESS [  4.149 s]
[INFO] Cross OM Tests ..................................... SUCCESS [  8.994 s]
[INFO] Eclipse Tests ...................................... SUCCESS [01:01 min]
[INFO] JBoss Tests ........................................ SUCCESS [ 43.933 s]
[INFO] Axiom Test Suite (old) ............................. SUCCESS [ 11.810 s]
[INFO] Axiom OSGi Tests ................................... SUCCESS [ 19.877 s]
[INFO] Spring-WS Test Suite ............................... FAILURE [ 35.032 s]
[INFO] Spring WS Tests .................................... SKIPPED
[INFO] WSS4J Tests ........................................ SKIPPED
[INFO] Developer Guide .................................... SKIPPED
[INFO] User Guide ......................................... SKIPPED
[INFO] Javadoc ............................................ SKIPPED
[INFO] FOM Aspects ........................................ SKIPPED
[INFO] FOM Test Suite ..................................... SKIPPED
[INFO] Abdera Model (FOM) Implementation .................. SKIPPED
[INFO] Distribution ....................................... SKIPPED
[INFO] Code Coverage Report ............................... SKIPPED
[INFO] SAAJ Test Suite .................................... SKIPPED
[INFO] ------------------------------------------------------------------------
[INFO] BUILD FAILURE
[INFO] ------------------------------------------------------------------------
[INFO] Total time: 26:44 min
[INFO] Finished at: 2017-12-10T20:49:30+00:00
[INFO] Final Memory: 327M/455M
[INFO] ------------------------------------------------------------------------
[ERROR] Failed to execute goal org.apache.maven.plugins:maven-jar-plugin:3.0.0:jar (default-jar)
on project spring-ws-testsuite: Error assembling JAR: Problem creating jar: Execution exception:
Java heap space -> [Help 1]
[ERROR] 
[ERROR] To see the full stack trace of the errors, re-run Maven with the -e switch.
[ERROR] Re-run Maven using the -X switch to enable full debug logging.
[ERROR] 
[ERROR] For more information about the errors and possible solutions, please read the following
articles:
[ERROR] [Help 1] http://cwiki.apache.org/confluence/display/MAVEN/MojoExecutionException
[ERROR] 
[ERROR] After correcting the problems, you can resume the build with the command
[ERROR]   mvn <goals> -rf :spring-ws-testsuite
[JENKINS] Archiving <https://builds.apache.org/job/axiom-1.2.x/ws/axiom/aspects/core-aspects/pom.xml>
to org.apache.ws.commons.axiom/core-aspects/1.2.21-SNAPSHOT/core-aspects-1.2.21-SNAPSHOT.pom
[JENKINS] Archiving <https://builds.apache.org/job/axiom-1.2.x/ws/axiom/aspects/core-aspects/target/core-aspects-1.2.21-SNAPSHOT.jar>
to org.apache.ws.commons.axiom/core-aspects/1.2.21-20171210.203131-18/core-aspects-1.2.21-20171210.203131-18.jar
[JENKINS] Archiving <https://builds.apache.org/job/axiom-1.2.x/ws/axiom/aspects/core-aspects/target/core-aspects-1.2.21-SNAPSHOT-sources.jar>
to org.apache.ws.commons.axiom/core-aspects/1.2.21-20171210.203131-18/core-aspects-1.2.21-20171210.203131-18-sources.jar
[JENKINS] Archiving <https://builds.apache.org/job/axiom-1.2.x/ws/axiom/aspects/core-aspects/target/core-aspects-1.2.21-SNAPSHOT-javadoc.jar>
to org.apache.ws.commons.axiom/core-aspects/1.2.21-20171210.203131-18/core-aspects-1.2.21-20171210.203131-18-javadoc.jar
[JENKINS] Archiving <https://builds.apache.org/job/axiom-1.2.x/ws/axiom/components/xml-utils/pom.xml>
to org.apache.ws.commons.axiom/xml-utils/1.2.21-SNAPSHOT/xml-utils-1.2.21-SNAPSHOT.pom
[JENKINS] Archiving <https://builds.apache.org/job/axiom-1.2.x/ws/axiom/components/xml-utils/target/xml-utils-1.2.21-SNAPSHOT.jar>
to org.apache.ws.commons.axiom/xml-utils/1.2.21-20171210.202834-18/xml-utils-1.2.21-20171210.202834-18.jar
[JENKINS] Archiving <https://builds.apache.org/job/axiom-1.2.x/ws/axiom/components/xml-utils/target/xml-utils-1.2.21-SNAPSHOT-sources.jar>
to org.apache.ws.commons.axiom/xml-utils/1.2.21-20171210.202834-18/xml-utils-1.2.21-20171210.202834-18-sources.jar
[JENKINS] Archiving <https://builds.apache.org/job/axiom-1.2.x/ws/axiom/components/xml-utils/target/xml-utils-1.2.21-SNAPSHOT-javadoc.jar>
to org.apache.ws.commons.axiom/xml-utils/1.2.21-20171210.202834-18/xml-utils-1.2.21-20171210.202834-18-javadoc.jar
[JENKINS] Archiving <https://builds.apache.org/job/axiom-1.2.x/ws/axiom/components/xml-utils/target/jacoco.exec>
to org.apache.ws.commons.axiom/xml-utils/1.2.21-20171210.202834-18/xml-utils-1.2.21-20171210.202834-18-jacoco.exec
[JENKINS] Archiving <https://builds.apache.org/job/axiom-1.2.x/ws/axiom/axiom-c14n/pom.xml>
to org.apache.ws.commons.axiom/axiom-c14n/1.2.21-SNAPSHOT/axiom-c14n-1.2.21-SNAPSHOT.pom
[JENKINS] Archiving <https://builds.apache.org/job/axiom-1.2.x/ws/axiom/axiom-c14n/target/axiom-c14n-1.2.21-SNAPSHOT.jar>
to org.apache.ws.commons.axiom/axiom-c14n/1.2.21-20171210.204410-18/axiom-c14n-1.2.21-20171210.204410-18.jar
[JENKINS] Archiving <https://builds.apache.org/job/axiom-1.2.x/ws/axiom/axiom-c14n/target/axiom-c14n-1.2.21-SNAPSHOT-sources.jar>
to org.apache.ws.commons.axiom/axiom-c14n/1.2.21-20171210.204410-18/axiom-c14n-1.2.21-20171210.204410-18-sources.jar
[JENKINS] Archiving <https://builds.apache.org/job/axiom-1.2.x/ws/axiom/axiom-c14n/target/axiom-c14n-1.2.21-SNAPSHOT-javadoc.jar>
to org.apache.ws.commons.axiom/axiom-c14n/1.2.21-20171210.204410-18/axiom-c14n-1.2.21-20171210.204410-18-javadoc.jar
[JENKINS] Archiving <https://builds.apache.org/job/axiom-1.2.x/ws/axiom/axiom-c14n/target/jacoco.exec>
to org.apache.ws.commons.axiom/axiom-c14n/1.2.21-20171210.204410-18/axiom-c14n-1.2.21-20171210.204410-18-jacoco.exec
[JENKINS] Archiving <https://builds.apache.org/job/axiom-1.2.x/ws/axiom/systests/wss4j-tests/pom.xml>
to org.apache.ws.commons.axiom/wss4j-tests/1.2.21-SNAPSHOT/wss4j-tests-1.2.21-SNAPSHOT.pom
[JENKINS] Archiving <https://builds.apache.org/job/axiom-1.2.x/ws/axiom/pom.xml> to
org.apache.ws.commons.axiom/axiom/1.2.21-SNAPSHOT/axiom-1.2.21-SNAPSHOT.pom
[JENKINS] Archiving <https://builds.apache.org/job/axiom-1.2.x/ws/axiom/target/axiom-1.2.21-SNAPSHOT-site.xml>
to org.apache.ws.commons.axiom/axiom/1.2.21-20171210.202315-19/axiom-1.2.21-20171210.202315-19-site.xml
[Fast Archiver] Compressed 64.37 KB of artifacts by 49.7% relative to #58
[JENKINS] Archiving <https://builds.apache.org/job/axiom-1.2.x/ws/axiom/testing/soap-testsuite/pom.xml>
to org.apache.ws.commons.axiom/soap-testsuite/1.2.21-SNAPSHOT/soap-testsuite-1.2.21-SNAPSHOT.pom
[JENKINS] Archiving <https://builds.apache.org/job/axiom-1.2.x/ws/axiom/testing/soap-testsuite/target/soap-testsuite-1.2.21-SNAPSHOT.jar>
to org.apache.ws.commons.axiom/soap-testsuite/1.2.21-20171210.202909-18/soap-testsuite-1.2.21-20171210.202909-18.jar
[JENKINS] Archiving <https://builds.apache.org/job/axiom-1.2.x/ws/axiom/testing/soap-testsuite/target/soap-testsuite-1.2.21-SNAPSHOT-sources.jar>
to org.apache.ws.commons.axiom/soap-testsuite/1.2.21-20171210.202909-18/soap-testsuite-1.2.21-20171210.202909-18-sources.jar
[JENKINS] Archiving <https://builds.apache.org/job/axiom-1.2.x/ws/axiom/testing/soap-testsuite/target/soap-testsuite-1.2.21-SNAPSHOT-javadoc.jar>
to org.apache.ws.commons.axiom/soap-testsuite/1.2.21-20171210.202909-18/soap-testsuite-1.2.21-20171210.202909-18-javadoc.jar
[JENKINS] Archiving <https://builds.apache.org/job/axiom-1.2.x/ws/axiom/testing/soap-testsuite/target/jacoco.exec>
to org.apache.ws.commons.axiom/soap-testsuite/1.2.21-20171210.202909-18/soap-testsuite-1.2.21-20171210.202909-18-jacoco.exec
[Fast Archiver] Compressed 405.79 KB of artifacts by 31.5% relative to #58
[JENKINS] Archiving <https://builds.apache.org/job/axiom-1.2.x/ws/axiom/userguide/pom.xml>
to org.apache.ws.commons.axiom/userguide/1.2.21-SNAPSHOT/userguide-1.2.21-SNAPSHOT.pom
[JENKINS] Archiving <https://builds.apache.org/job/axiom-1.2.x/ws/axiom/devguide/pom.xml>
to org.apache.ws.commons.axiom/devguide/1.2.21-SNAPSHOT/devguide-1.2.21-SNAPSHOT.pom
[JENKINS] Archiving <https://builds.apache.org/job/axiom-1.2.x/ws/axiom/buildutils/jar-resource-bundle/pom.xml>
to org.apache.ws.commons.axiom/jar-resource-bundle/1.2.21-SNAPSHOT/jar-resource-bundle-1.2.21-SNAPSHOT.pom
[JENKINS] Archiving <https://builds.apache.org/job/axiom-1.2.x/ws/axiom/buildutils/jar-resource-bundle/target/jar-resource-bundle-1.2.21-SNAPSHOT.jar>
to org.apache.ws.commons.axiom/jar-resource-bundle/1.2.21-20171210.202342-19/jar-resource-bundle-1.2.21-20171210.202342-19.jar
[JENKINS] Archiving <https://builds.apache.org/job/axiom-1.2.x/ws/axiom/buildutils/jar-resource-bundle/target/jar-resource-bundle-1.2.21-SNAPSHOT-sources.jar>
to org.apache.ws.commons.axiom/jar-resource-bundle/1.2.21-20171210.202342-19/jar-resource-bundle-1.2.21-20171210.202342-19-sources.jar
[JENKINS] Archiving <https://builds.apache.org/job/axiom-1.2.x/ws/axiom/testing/pom.xml>
to org.apache.ws.commons.axiom/testing/1.2.21-SNAPSHOT/testing-1.2.21-SNAPSHOT.pom
[JENKINS] Archiving <https://builds.apache.org/job/axiom-1.2.x/ws/axiom/testing/target/testing-1.2.21-SNAPSHOT-site.xml>
to org.apache.ws.commons.axiom/testing/1.2.21-20171210.202514-18/testing-1.2.21-20171210.202514-18-site.xml
[JENKINS] Archiving <https://builds.apache.org/job/axiom-1.2.x/ws/axiom/buildutils/javadoc-postprocessor-plugin/pom.xml>
to org.apache.ws.commons.axiom/javadoc-postprocessor-plugin/1.2.21-SNAPSHOT/javadoc-postprocessor-plugin-1.2.21-SNAPSHOT.pom
[JENKINS] Archiving <https://builds.apache.org/job/axiom-1.2.x/ws/axiom/buildutils/javadoc-postprocessor-plugin/target/javadoc-postprocessor-plugin-1.2.21-SNAPSHOT.jar>
to org.apache.ws.commons.axiom/javadoc-postprocessor-plugin/1.2.21-20171210.202439-19/javadoc-postprocessor-plugin-1.2.21-20171210.202439-19.jar
[JENKINS] Archiving <https://builds.apache.org/job/axiom-1.2.x/ws/axiom/buildutils/javadoc-postprocessor-plugin/target/javadoc-postprocessor-plugin-1.2.21-SNAPSHOT-sources.jar>
to org.apache.ws.commons.axiom/javadoc-postprocessor-plugin/1.2.21-20171210.202439-19/javadoc-postprocessor-plugin-1.2.21-20171210.202439-19-sources.jar
[JENKINS] Archiving <https://builds.apache.org/job/axiom-1.2.x/ws/axiom/buildutils/javadoc-postprocessor-plugin/target/javadoc-postprocessor-plugin-1.2.21-SNAPSHOT-javadoc.jar>
to org.apache.ws.commons.axiom/javadoc-postprocessor-plugin/1.2.21-20171210.202439-19/javadoc-postprocessor-plugin-1.2.21-20171210.202439-19-javadoc.jar
[JENKINS] Archiving <https://builds.apache.org/job/axiom-1.2.x/ws/axiom/systests/osgi-tests/pom.xml>
to org.apache.ws.commons.axiom/osgi-tests/1.2.21-SNAPSHOT/osgi-tests-1.2.21-SNAPSHOT.pom
[JENKINS] Archiving <https://builds.apache.org/job/axiom-1.2.x/ws/axiom/systests/osgi-tests/target/osgi-tests-1.2.21-SNAPSHOT.jar>
to org.apache.ws.commons.axiom/osgi-tests/1.2.21-SNAPSHOT/osgi-tests-1.2.21-SNAPSHOT.jar
[JENKINS] Archiving <https://builds.apache.org/job/axiom-1.2.x/ws/axiom/systests/osgi-tests/target/osgi-tests-1.2.21-SNAPSHOT-sources.jar>
to org.apache.ws.commons.axiom/osgi-tests/1.2.21-SNAPSHOT/osgi-tests-1.2.21-SNAPSHOT-sources.jar
[JENKINS] Archiving <https://builds.apache.org/job/axiom-1.2.x/ws/axiom/systests/osgi-tests/target/jacoco.exec>
to org.apache.ws.commons.axiom/osgi-tests/1.2.21-SNAPSHOT/osgi-tests-1.2.21-SNAPSHOT-jacoco.exec
[JENKINS] Archiving <https://builds.apache.org/job/axiom-1.2.x/ws/axiom/testing/saaj-testsuite/pom.xml>
to org.apache.ws.commons.axiom/saaj-testsuite/1.2.21-SNAPSHOT/saaj-testsuite-1.2.21-SNAPSHOT.pom
[JENKINS] Archiving <https://builds.apache.org/job/axiom-1.2.x/ws/axiom/systests/cross-om-tests/pom.xml>
to org.apache.ws.commons.axiom/cross-om-tests/1.2.21-SNAPSHOT/cross-om-tests-1.2.21-SNAPSHOT.pom
[JENKINS] Archiving <https://builds.apache.org/job/axiom-1.2.x/ws/axiom/systests/cross-om-tests/target/cross-om-tests-1.2.21-SNAPSHOT.jar>
to org.apache.ws.commons.axiom/cross-om-tests/1.2.21-SNAPSHOT/cross-om-tests-1.2.21-SNAPSHOT.jar
[JENKINS] Archiving <https://builds.apache.org/job/axiom-1.2.x/ws/axiom/systests/cross-om-tests/target/cross-om-tests-1.2.21-SNAPSHOT-sources.jar>
to org.apache.ws.commons.axiom/cross-om-tests/1.2.21-SNAPSHOT/cross-om-tests-1.2.21-SNAPSHOT-sources.jar
[JENKINS] Archiving <https://builds.apache.org/job/axiom-1.2.x/ws/axiom/systests/cross-om-tests/target/jacoco.exec>
to org.apache.ws.commons.axiom/cross-om-tests/1.2.21-SNAPSHOT/cross-om-tests-1.2.21-SNAPSHOT-jacoco.exec
[JENKINS] Archiving <https://builds.apache.org/job/axiom-1.2.x/ws/axiom/testing/spring-ws-testsuite/pom.xml>
to org.apache.ws.commons.axiom/spring-ws-testsuite/1.2.21-SNAPSHOT/spring-ws-testsuite-1.2.21-SNAPSHOT.pom
[JENKINS] Archiving <https://builds.apache.org/job/axiom-1.2.x/ws/axiom/testing/spring-ws-testsuite/target/spring-ws-testsuite-1.2.21-SNAPSHOT-sources.jar>
to org.apache.ws.commons.axiom/spring-ws-testsuite/1.2.21-SNAPSHOT/spring-ws-testsuite-1.2.21-SNAPSHOT-sources.jar
[JENKINS] Archiving <https://builds.apache.org/job/axiom-1.2.x/ws/axiom/aspects/dom-aspects/pom.xml>
to org.apache.ws.commons.axiom/dom-aspects/1.2.21-SNAPSHOT/dom-aspects-1.2.21-SNAPSHOT.pom
[JENKINS] Archiving <https://builds.apache.org/job/axiom-1.2.x/ws/axiom/aspects/dom-aspects/target/dom-aspects-1.2.21-SNAPSHOT.jar>
to org.apache.ws.commons.axiom/dom-aspects/1.2.21-20171210.203750-18/dom-aspects-1.2.21-20171210.203750-18.jar
[JENKINS] Archiving <https://builds.apache.org/job/axiom-1.2.x/ws/axiom/aspects/dom-aspects/target/dom-aspects-1.2.21-SNAPSHOT-sources.jar>
to org.apache.ws.commons.axiom/dom-aspects/1.2.21-20171210.203750-18/dom-aspects-1.2.21-20171210.203750-18-sources.jar
[JENKINS] Archiving <https://builds.apache.org/job/axiom-1.2.x/ws/axiom/aspects/dom-aspects/target/dom-aspects-1.2.21-SNAPSHOT-javadoc.jar>
to org.apache.ws.commons.axiom/dom-aspects/1.2.21-20171210.203750-18/dom-aspects-1.2.21-20171210.203750-18-javadoc.jar
[JENKINS] Archiving <https://builds.apache.org/job/axiom-1.2.x/ws/axiom/aspects/dom-aspects/target/jacoco.exec>
to org.apache.ws.commons.axiom/dom-aspects/1.2.21-20171210.203750-18/dom-aspects-1.2.21-20171210.203750-18-jacoco.exec
[JENKINS] Archiving <https://builds.apache.org/job/axiom-1.2.x/ws/axiom/implementations/axiom-dom/pom.xml>
to org.apache.ws.commons.axiom/axiom-dom/1.2.21-SNAPSHOT/axiom-dom-1.2.21-SNAPSHOT.pom
[JENKINS] Archiving <https://builds.apache.org/job/axiom-1.2.x/ws/axiom/implementations/axiom-dom/target/axiom-dom-1.2.21-SNAPSHOT.jar>
to org.apache.ws.commons.axiom/axiom-dom/1.2.21-20171210.204240-18/axiom-dom-1.2.21-20171210.204240-18.jar
[JENKINS] Archiving <https://builds.apache.org/job/axiom-1.2.x/ws/axiom/implementations/axiom-dom/target/axiom-dom-1.2.21-SNAPSHOT-sources.jar>
to org.apache.ws.commons.axiom/axiom-dom/1.2.21-20171210.204240-18/axiom-dom-1.2.21-20171210.204240-18-sources.jar
[JENKINS] Archiving <https://builds.apache.org/job/axiom-1.2.x/ws/axiom/implementations/axiom-dom/target/axiom-dom-1.2.21-SNAPSHOT-javadoc.jar>
to org.apache.ws.commons.axiom/axiom-dom/1.2.21-20171210.204240-18/axiom-dom-1.2.21-20171210.204240-18-javadoc.jar
[JENKINS] Archiving <https://builds.apache.org/job/axiom-1.2.x/ws/axiom/implementations/axiom-dom/target/jacoco.exec>
to org.apache.ws.commons.axiom/axiom-dom/1.2.21-20171210.204240-18/axiom-dom-1.2.21-20171210.204240-18-jacoco.exec
[JENKINS] Archiving <https://builds.apache.org/job/axiom-1.2.x/ws/axiom/testing/jaxp-testsuite/pom.xml>
to org.apache.ws.commons.axiom/jaxp-testsuite/1.2.21-SNAPSHOT/jaxp-testsuite-1.2.21-SNAPSHOT.pom
[JENKINS] Archiving <https://builds.apache.org/job/axiom-1.2.x/ws/axiom/testing/jaxp-testsuite/target/jaxp-testsuite-1.2.21-SNAPSHOT.jar>
to org.apache.ws.commons.axiom/jaxp-testsuite/1.2.21-20171210.202731-18/jaxp-testsuite-1.2.21-20171210.202731-18.jar
[JENKINS] Archiving <https://builds.apache.org/job/axiom-1.2.x/ws/axiom/testing/jaxp-testsuite/target/jaxp-testsuite-1.2.21-SNAPSHOT-sources.jar>
to org.apache.ws.commons.axiom/jaxp-testsuite/1.2.21-20171210.202731-18/jaxp-testsuite-1.2.21-20171210.202731-18-sources.jar
[JENKINS] Archiving <https://builds.apache.org/job/axiom-1.2.x/ws/axiom/testing/jaxp-testsuite/target/jaxp-testsuite-1.2.21-SNAPSHOT-javadoc.jar>
to org.apache.ws.commons.axiom/jaxp-testsuite/1.2.21-20171210.202731-18/jaxp-testsuite-1.2.21-20171210.202731-18-javadoc.jar
[JENKINS] Archiving <https://builds.apache.org/job/axiom-1.2.x/ws/axiom/aspects/fom-aspects/pom.xml>
to org.apache.ws.commons.axiom/fom-aspects/1.2.21-SNAPSHOT/fom-aspects-1.2.21-SNAPSHOT.pom
[JENKINS] Archiving <https://builds.apache.org/job/axiom-1.2.x/ws/axiom/axiom-api/pom.xml>
to org.apache.ws.commons.axiom/axiom-api/1.2.21-SNAPSHOT/axiom-api-1.2.21-SNAPSHOT.pom
[JENKINS] Archiving <https://builds.apache.org/job/axiom-1.2.x/ws/axiom/axiom-api/target/axiom-api-1.2.21-SNAPSHOT.jar>
to org.apache.ws.commons.axiom/axiom-api/1.2.21-20171210.203052-18/axiom-api-1.2.21-20171210.203052-18.jar
[JENKINS] Archiving <https://builds.apache.org/job/axiom-1.2.x/ws/axiom/axiom-api/target/axiom-api-1.2.21-SNAPSHOT-sources.jar>
to org.apache.ws.commons.axiom/axiom-api/1.2.21-20171210.203052-18/axiom-api-1.2.21-20171210.203052-18-sources.jar
[JENKINS] Archiving <https://builds.apache.org/job/axiom-1.2.x/ws/axiom/axiom-api/target/axiom-api-1.2.21-SNAPSHOT-javadoc.jar>
to org.apache.ws.commons.axiom/axiom-api/1.2.21-20171210.203052-18/axiom-api-1.2.21-20171210.203052-18-javadoc.jar
[JENKINS] Archiving <https://builds.apache.org/job/axiom-1.2.x/ws/axiom/axiom-api/target/axiom-api-1.2.21-SNAPSHOT-tests.jar>
to org.apache.ws.commons.axiom/axiom-api/1.2.21-20171210.203052-18/axiom-api-1.2.21-20171210.203052-18-tests.jar
[JENKINS] Archiving <https://builds.apache.org/job/axiom-1.2.x/ws/axiom/axiom-api/target/jacoco.exec>
to org.apache.ws.commons.axiom/axiom-api/1.2.21-20171210.203052-18/axiom-api-1.2.21-20171210.203052-18-jacoco.exec
[JENKINS] Archiving <https://builds.apache.org/job/axiom-1.2.x/ws/axiom/testing/fom-testsuite/pom.xml>
to org.apache.ws.commons.axiom/fom-testsuite/1.2.21-SNAPSHOT/fom-testsuite-1.2.21-SNAPSHOT.pom
[JENKINS] Archiving <https://builds.apache.org/job/axiom-1.2.x/ws/axiom/testing/dom-testsuite/pom.xml>
to org.apache.ws.commons.axiom/dom-testsuite/1.2.21-SNAPSHOT/dom-testsuite-1.2.21-SNAPSHOT.pom
[JENKINS] Archiving <https://builds.apache.org/job/axiom-1.2.x/ws/axiom/testing/dom-testsuite/target/dom-testsuite-1.2.21-SNAPSHOT.jar>
to org.apache.ws.commons.axiom/dom-testsuite/1.2.21-20171210.203857-18/dom-testsuite-1.2.21-20171210.203857-18.jar
[JENKINS] Archiving <https://builds.apache.org/job/axiom-1.2.x/ws/axiom/testing/dom-testsuite/target/dom-testsuite-1.2.21-SNAPSHOT-sources.jar>
to org.apache.ws.commons.axiom/dom-testsuite/1.2.21-20171210.203857-18/dom-testsuite-1.2.21-20171210.203857-18-sources.jar
[JENKINS] Archiving <https://builds.apache.org/job/axiom-1.2.x/ws/axiom/testing/dom-testsuite/target/dom-testsuite-1.2.21-SNAPSHOT-javadoc.jar>
to org.apache.ws.commons.axiom/dom-testsuite/1.2.21-20171210.203857-18/dom-testsuite-1.2.21-20171210.203857-18-javadoc.jar
[JENKINS] Archiving <https://builds.apache.org/job/axiom-1.2.x/ws/axiom/testing/dom-testsuite/target/jacoco.exec>
to org.apache.ws.commons.axiom/dom-testsuite/1.2.21-20171210.203857-18/dom-testsuite-1.2.21-20171210.203857-18-jacoco.exec
[JENKINS] Archiving <https://builds.apache.org/job/axiom-1.2.x/ws/axiom/implementations/axiom-impl/pom.xml>
to org.apache.ws.commons.axiom/axiom-impl/1.2.21-SNAPSHOT/axiom-impl-1.2.21-SNAPSHOT.pom
[JENKINS] Archiving <https://builds.apache.org/job/axiom-1.2.x/ws/axiom/implementations/axiom-impl/target/axiom-impl-1.2.21-SNAPSHOT.jar>
to org.apache.ws.commons.axiom/axiom-impl/1.2.21-20171210.203721-18/axiom-impl-1.2.21-20171210.203721-18.jar
[JENKINS] Archiving <https://builds.apache.org/job/axiom-1.2.x/ws/axiom/implementations/axiom-impl/target/axiom-impl-1.2.21-SNAPSHOT-sources.jar>
to org.apache.ws.commons.axiom/axiom-impl/1.2.21-20171210.203721-18/axiom-impl-1.2.21-20171210.203721-18-sources.jar
[JENKINS] Archiving <https://builds.apache.org/job/axiom-1.2.x/ws/axiom/implementations/axiom-impl/target/axiom-impl-1.2.21-SNAPSHOT-javadoc.jar>
to org.apache.ws.commons.axiom/axiom-impl/1.2.21-20171210.203721-18/axiom-impl-1.2.21-20171210.203721-18-javadoc.jar
[JENKINS] Archiving <https://builds.apache.org/job/axiom-1.2.x/ws/axiom/implementations/axiom-impl/target/jacoco.exec>
to org.apache.ws.commons.axiom/axiom-impl/1.2.21-20171210.203721-18/axiom-impl-1.2.21-20171210.203721-18-jacoco.exec
[JENKINS] Archiving <https://builds.apache.org/job/axiom-1.2.x/ws/axiom/implementations/fom-impl/pom.xml>
to org.apache.ws.commons.axiom/fom-impl/1.2.21-SNAPSHOT/fom-impl-1.2.21-SNAPSHOT.pom
[JENKINS] Archiving <https://builds.apache.org/job/axiom-1.2.x/ws/axiom/testing/testutils/pom.xml>
to org.apache.ws.commons.axiom/testutils/1.2.21-SNAPSHOT/testutils-1.2.21-SNAPSHOT.pom
[JENKINS] Archiving <https://builds.apache.org/job/axiom-1.2.x/ws/axiom/testing/testutils/target/testutils-1.2.21-SNAPSHOT.jar>
to org.apache.ws.commons.axiom/testutils/1.2.21-20171210.202647-18/testutils-1.2.21-20171210.202647-18.jar
[JENKINS] Archiving <https://builds.apache.org/job/axiom-1.2.x/ws/axiom/testing/testutils/target/testutils-1.2.21-SNAPSHOT-sources.jar>
to org.apache.ws.commons.axiom/testutils/1.2.21-20171210.202647-18/testutils-1.2.21-20171210.202647-18-sources.jar
[JENKINS] Archiving <https://builds.apache.org/job/axiom-1.2.x/ws/axiom/testing/testutils/target/testutils-1.2.21-SNAPSHOT-javadoc.jar>
to org.apache.ws.commons.axiom/testutils/1.2.21-20171210.202647-18/testutils-1.2.21-20171210.202647-18-javadoc.jar
[JENKINS] Archiving <https://builds.apache.org/job/axiom-1.2.x/ws/axiom/testing/testutils/target/jacoco.exec>
to org.apache.ws.commons.axiom/testutils/1.2.21-20171210.202647-18/testutils-1.2.21-20171210.202647-18-jacoco.exec
[JENKINS] Archiving <https://builds.apache.org/job/axiom-1.2.x/ws/axiom/testing/xml-truth/pom.xml>
to org.apache.ws.commons.axiom/xml-truth/1.2.21-SNAPSHOT/xml-truth-1.2.21-SNAPSHOT.pom
[JENKINS] Archiving <https://builds.apache.org/job/axiom-1.2.x/ws/axiom/testing/xml-truth/target/xml-truth-1.2.21-SNAPSHOT.jar>
to org.apache.ws.commons.axiom/xml-truth/1.2.21-20171210.202759-18/xml-truth-1.2.21-20171210.202759-18.jar
[JENKINS] Archiving <https://builds.apache.org/job/axiom-1.2.x/ws/axiom/testing/xml-truth/target/xml-truth-1.2.21-SNAPSHOT-sources.jar>
to org.apache.ws.commons.axiom/xml-truth/1.2.21-20171210.202759-18/xml-truth-1.2.21-20171210.202759-18-sources.jar
[JENKINS] Archiving <https://builds.apache.org/job/axiom-1.2.x/ws/axiom/testing/xml-truth/target/xml-truth-1.2.21-SNAPSHOT-javadoc.jar>
to org.apache.ws.commons.axiom/xml-truth/1.2.21-20171210.202759-18/xml-truth-1.2.21-20171210.202759-18-javadoc.jar
[JENKINS] Archiving <https://builds.apache.org/job/axiom-1.2.x/ws/axiom/testing/xml-truth/target/jacoco.exec>
to org.apache.ws.commons.axiom/xml-truth/1.2.21-20171210.202759-18/xml-truth-1.2.21-20171210.202759-18-jacoco.exec
[JENKINS] Archiving <https://builds.apache.org/job/axiom-1.2.x/ws/axiom/apidocs/pom.xml>
to org.apache.ws.commons.axiom/apidocs/1.2.21-SNAPSHOT/apidocs-1.2.21-SNAPSHOT.pom
[JENKINS] Archiving <https://builds.apache.org/job/axiom-1.2.x/ws/axiom/testing/xml-testsuite/pom.xml>
to org.apache.ws.commons.axiom/xml-testsuite/1.2.21-SNAPSHOT/xml-testsuite-1.2.21-SNAPSHOT.pom
[JENKINS] Archiving <https://builds.apache.org/job/axiom-1.2.x/ws/axiom/testing/xml-testsuite/target/xml-testsuite-1.2.21-SNAPSHOT.jar>
to org.apache.ws.commons.axiom/xml-testsuite/1.2.21-20171210.202711-18/xml-testsuite-1.2.21-20171210.202711-18.jar
[JENKINS] Archiving <https://builds.apache.org/job/axiom-1.2.x/ws/axiom/testing/xml-testsuite/target/xml-testsuite-1.2.21-SNAPSHOT-sources.jar>
to org.apache.ws.commons.axiom/xml-testsuite/1.2.21-20171210.202711-18/xml-testsuite-1.2.21-20171210.202711-18-sources.jar
[JENKINS] Archiving <https://builds.apache.org/job/axiom-1.2.x/ws/axiom/testing/xml-testsuite/target/xml-testsuite-1.2.21-SNAPSHOT-javadoc.jar>
to org.apache.ws.commons.axiom/xml-testsuite/1.2.21-20171210.202711-18/xml-testsuite-1.2.21-20171210.202711-18-javadoc.jar
[JENKINS] Archiving <https://builds.apache.org/job/axiom-1.2.x/ws/axiom/samples/pom.xml>
to org.apache.ws.commons.axiom/samples/1.2.21-SNAPSHOT/samples-1.2.21-SNAPSHOT.pom
[JENKINS] Archiving <https://builds.apache.org/job/axiom-1.2.x/ws/axiom/samples/target/samples-1.2.21-SNAPSHOT.jar>
to org.apache.ws.commons.axiom/samples/1.2.21-SNAPSHOT/samples-1.2.21-SNAPSHOT.jar
[JENKINS] Archiving <https://builds.apache.org/job/axiom-1.2.x/ws/axiom/samples/target/samples-1.2.21-SNAPSHOT-sources.jar>
to org.apache.ws.commons.axiom/samples/1.2.21-SNAPSHOT/samples-1.2.21-SNAPSHOT-sources.jar
[JENKINS] Archiving <https://builds.apache.org/job/axiom-1.2.x/ws/axiom/samples/target/jacoco.exec>
to org.apache.ws.commons.axiom/samples/1.2.21-SNAPSHOT/samples-1.2.21-SNAPSHOT-jacoco.exec
[JENKINS] Archiving <https://builds.apache.org/job/axiom-1.2.x/ws/axiom/buildutils/pom.xml>
to org.apache.ws.commons.axiom/buildutils/1.2.21-SNAPSHOT/buildutils-1.2.21-SNAPSHOT.pom
[JENKINS] Archiving <https://builds.apache.org/job/axiom-1.2.x/ws/axiom/axiom-all/pom.xml>
to org.apache.ws.commons.axiom/axiom-all/1.2.21-SNAPSHOT/axiom-all-1.2.21-SNAPSHOT.pom
[JENKINS] Archiving <https://builds.apache.org/job/axiom-1.2.x/ws/axiom/axiom-all/target/axiom-all-1.2.21-SNAPSHOT.jar>
to org.apache.ws.commons.axiom/axiom-all/1.2.21-SNAPSHOT/axiom-all-1.2.21-SNAPSHOT.jar
[JENKINS] Archiving <https://builds.apache.org/job/axiom-1.2.x/ws/axiom/axiom-all/target/axiom-all-1.2.21-SNAPSHOT-sources.jar>
to org.apache.ws.commons.axiom/axiom-all/1.2.21-SNAPSHOT/axiom-all-1.2.21-SNAPSHOT-sources.jar
[JENKINS] Archiving <https://builds.apache.org/job/axiom-1.2.x/ws/axiom/code-coverage/pom.xml>
to org.apache.ws.commons.axiom/code-coverage/1.2.21-SNAPSHOT/code-coverage-1.2.21-SNAPSHOT.pom
[JENKINS] Archiving <https://builds.apache.org/job/axiom-1.2.x/ws/axiom/implementations/pom.xml>
to org.apache.ws.commons.axiom/implementations/1.2.21-SNAPSHOT/implementations-1.2.21-SNAPSHOT.pom
[JENKINS] Archiving <https://builds.apache.org/job/axiom-1.2.x/ws/axiom/implementations/target/implementations-1.2.21-SNAPSHOT-site.xml>
to org.apache.ws.commons.axiom/implementations/1.2.21-20171210.203415-18/implementations-1.2.21-20171210.203415-18-site.xml
[JENKINS] Archiving <https://builds.apache.org/job/axiom-1.2.x/ws/axiom/systests/pom.xml>
to org.apache.ws.commons.axiom/systests/1.2.21-SNAPSHOT/systests-1.2.21-SNAPSHOT.pom
[JENKINS] Archiving <https://builds.apache.org/job/axiom-1.2.x/ws/axiom/distribution/pom.xml>
to org.apache.ws.commons.axiom/distribution/1.2.21-SNAPSHOT/distribution-1.2.21-SNAPSHOT.pom
[JENKINS] Archiving <https://builds.apache.org/job/axiom-1.2.x/ws/axiom/testing/axiom-truth/pom.xml>
to org.apache.ws.commons.axiom/axiom-truth/1.2.21-SNAPSHOT/axiom-truth-1.2.21-SNAPSHOT.pom
[JENKINS] Archiving <https://builds.apache.org/job/axiom-1.2.x/ws/axiom/testing/axiom-truth/target/axiom-truth-1.2.21-SNAPSHOT.jar>
to org.apache.ws.commons.axiom/axiom-truth/1.2.21-20171210.203251-18/axiom-truth-1.2.21-20171210.203251-18.jar
[JENKINS] Archiving <https://builds.apache.org/job/axiom-1.2.x/ws/axiom/testing/axiom-truth/target/axiom-truth-1.2.21-SNAPSHOT-sources.jar>
to org.apache.ws.commons.axiom/axiom-truth/1.2.21-20171210.203251-18/axiom-truth-1.2.21-20171210.203251-18-sources.jar
[JENKINS] Archiving <https://builds.apache.org/job/axiom-1.2.x/ws/axiom/testing/axiom-truth/target/axiom-truth-1.2.21-SNAPSHOT-javadoc.jar>
to org.apache.ws.commons.axiom/axiom-truth/1.2.21-20171210.203251-18/axiom-truth-1.2.21-20171210.203251-18-javadoc.jar
[JENKINS] Archiving <https://builds.apache.org/job/axiom-1.2.x/ws/axiom/systests/jboss-tests/pom.xml>
to org.apache.ws.commons.axiom/jboss-tests/1.2.21-SNAPSHOT/jboss-tests-1.2.21-SNAPSHOT.pom
[JENKINS] Archiving <https://builds.apache.org/job/axiom-1.2.x/ws/axiom/systests/jboss-tests/target/jboss-tests-1.2.21-SNAPSHOT.jar>
to org.apache.ws.commons.axiom/jboss-tests/1.2.21-SNAPSHOT/jboss-tests-1.2.21-SNAPSHOT.jar
[JENKINS] Archiving <https://builds.apache.org/job/axiom-1.2.x/ws/axiom/systests/jboss-tests/target/jboss-tests-1.2.21-SNAPSHOT-sources.jar>
to org.apache.ws.commons.axiom/jboss-tests/1.2.21-SNAPSHOT/jboss-tests-1.2.21-SNAPSHOT-sources.jar
[JENKINS] Archiving <https://builds.apache.org/job/axiom-1.2.x/ws/axiom/systests/jboss-tests/target/jacoco.exec>
to org.apache.ws.commons.axiom/jboss-tests/1.2.21-SNAPSHOT/jboss-tests-1.2.21-SNAPSHOT-jacoco.exec
[JENKINS] Archiving <https://builds.apache.org/job/axiom-1.2.x/ws/axiom/systests/spring-ws-tests/pom.xml>
to org.apache.ws.commons.axiom/spring-ws-tests/1.2.21-SNAPSHOT/spring-ws-tests-1.2.21-SNAPSHOT.pom
[JENKINS] Archiving <https://builds.apache.org/job/axiom-1.2.x/ws/axiom/aspects/om-aspects/pom.xml>
to org.apache.ws.commons.axiom/om-aspects/1.2.21-SNAPSHOT/om-aspects-1.2.21-SNAPSHOT.pom
[JENKINS] Archiving <https://builds.apache.org/job/axiom-1.2.x/ws/axiom/aspects/om-aspects/target/om-aspects-1.2.21-SNAPSHOT.jar>
to org.apache.ws.commons.axiom/om-aspects/1.2.21-20171210.203227-18/om-aspects-1.2.21-20171210.203227-18.jar
[JENKINS] Archiving <https://builds.apache.org/job/axiom-1.2.x/ws/axiom/aspects/om-aspects/target/om-aspects-1.2.21-SNAPSHOT-sources.jar>
to org.apache.ws.commons.axiom/om-aspects/1.2.21-20171210.203227-18/om-aspects-1.2.21-20171210.203227-18-sources.jar
[JENKINS] Archiving <https://builds.apache.org/job/axiom-1.2.x/ws/axiom/aspects/om-aspects/target/om-aspects-1.2.21-SNAPSHOT-javadoc.jar>
to org.apache.ws.commons.axiom/om-aspects/1.2.21-20171210.203227-18/om-aspects-1.2.21-20171210.203227-18-javadoc.jar
[JENKINS] Archiving <https://builds.apache.org/job/axiom-1.2.x/ws/axiom/aspects/om-aspects/target/jacoco.exec>
to org.apache.ws.commons.axiom/om-aspects/1.2.21-20171210.203227-18/om-aspects-1.2.21-20171210.203227-18-jacoco.exec
[Fast Archiver] Compressed 1.51 MB of artifacts by 26.9% relative to #58
[JENKINS] Archiving <https://builds.apache.org/job/axiom-1.2.x/ws/axiom/testing/jaxen-testsuite/pom.xml>
to org.apache.ws.commons.axiom/jaxen-testsuite/1.2.21-SNAPSHOT/jaxen-testsuite-1.2.21-SNAPSHOT.pom
[JENKINS] Archiving <https://builds.apache.org/job/axiom-1.2.x/ws/axiom/testing/jaxen-testsuite/target/jaxen-testsuite-1.2.21-SNAPSHOT.jar>
to org.apache.ws.commons.axiom/jaxen-testsuite/1.2.21-20171210.203312-18/jaxen-testsuite-1.2.21-20171210.203312-18.jar
[JENKINS] Archiving <https://builds.apache.org/job/axiom-1.2.x/ws/axiom/testing/jaxen-testsuite/target/jaxen-testsuite-1.2.21-SNAPSHOT-sources.jar>
to org.apache.ws.commons.axiom/jaxen-testsuite/1.2.21-20171210.203312-18/jaxen-testsuite-1.2.21-20171210.203312-18-sources.jar
[JENKINS] Archiving <https://builds.apache.org/job/axiom-1.2.x/ws/axiom/testing/jaxen-testsuite/target/jaxen-testsuite-1.2.21-SNAPSHOT-javadoc.jar>
to org.apache.ws.commons.axiom/jaxen-testsuite/1.2.21-20171210.203312-18/jaxen-testsuite-1.2.21-20171210.203312-18-javadoc.jar
[Fast Archiver] Compressed 252.04 KB of artifacts by 25.4% relative to #58
[JENKINS] Archiving <https://builds.apache.org/job/axiom-1.2.x/ws/axiom/systests/eclipse-tests/pom.xml>
to org.apache.ws.commons.axiom/eclipse-tests/1.2.21-SNAPSHOT/eclipse-tests-1.2.21-SNAPSHOT.pom
[JENKINS] Archiving <https://builds.apache.org/job/axiom-1.2.x/ws/axiom/systests/eclipse-tests/target/it/project/target/jacoco.exec>
to org.apache.ws.commons.axiom/eclipse-tests/1.2.21-SNAPSHOT/eclipse-tests-1.2.21-SNAPSHOT-jacoco.exec
[JENKINS] Archiving <https://builds.apache.org/job/axiom-1.2.x/ws/axiom/aspects/shared-aspects/pom.xml>
to org.apache.ws.commons.axiom/shared-aspects/1.2.21-SNAPSHOT/shared-aspects-1.2.21-SNAPSHOT.pom
[JENKINS] Archiving <https://builds.apache.org/job/axiom-1.2.x/ws/axiom/aspects/shared-aspects/target/shared-aspects-1.2.21-SNAPSHOT.jar>
to org.apache.ws.commons.axiom/shared-aspects/1.2.21-20171210.203150-18/shared-aspects-1.2.21-20171210.203150-18.jar
[JENKINS] Archiving <https://builds.apache.org/job/axiom-1.2.x/ws/axiom/aspects/shared-aspects/target/shared-aspects-1.2.21-SNAPSHOT-sources.jar>
to org.apache.ws.commons.axiom/shared-aspects/1.2.21-20171210.203150-18/shared-aspects-1.2.21-20171210.203150-18-sources.jar
[JENKINS] Archiving <https://builds.apache.org/job/axiom-1.2.x/ws/axiom/aspects/shared-aspects/target/shared-aspects-1.2.21-SNAPSHOT-javadoc.jar>
to org.apache.ws.commons.axiom/shared-aspects/1.2.21-20171210.203150-18/shared-aspects-1.2.21-20171210.203150-18-javadoc.jar
[JENKINS] Archiving <https://builds.apache.org/job/axiom-1.2.x/ws/axiom/buildutils/shade-osgi/pom.xml>
to org.apache.ws.commons.axiom/shade-osgi/1.2.21-SNAPSHOT/shade-osgi-1.2.21-SNAPSHOT.pom
[JENKINS] Archiving <https://builds.apache.org/job/axiom-1.2.x/ws/axiom/buildutils/shade-osgi/target/shade-osgi-1.2.21-SNAPSHOT.jar>
to org.apache.ws.commons.axiom/shade-osgi/1.2.21-20171210.202419-19/shade-osgi-1.2.21-20171210.202419-19.jar
[JENKINS] Archiving <https://builds.apache.org/job/axiom-1.2.x/ws/axiom/buildutils/shade-osgi/target/shade-osgi-1.2.21-SNAPSHOT-sources.jar>
to org.apache.ws.commons.axiom/shade-osgi/1.2.21-20171210.202419-19/shade-osgi-1.2.21-20171210.202419-19-sources.jar
[JENKINS] Archiving <https://builds.apache.org/job/axiom-1.2.x/ws/axiom/buildutils/shade-osgi/target/shade-osgi-1.2.21-SNAPSHOT-javadoc.jar>
to org.apache.ws.commons.axiom/shade-osgi/1.2.21-20171210.202419-19/shade-osgi-1.2.21-20171210.202419-19-javadoc.jar
[JENKINS] Archiving <https://builds.apache.org/job/axiom-1.2.x/ws/axiom/buildutils/shade-axiom-xml/pom.xml>
to org.apache.ws.commons.axiom/shade-axiom-xml/1.2.21-SNAPSHOT/shade-axiom-xml-1.2.21-SNAPSHOT.pom
[JENKINS] Archiving <https://builds.apache.org/job/axiom-1.2.x/ws/axiom/buildutils/shade-axiom-xml/target/shade-axiom-xml-1.2.21-SNAPSHOT.jar>
to org.apache.ws.commons.axiom/shade-axiom-xml/1.2.21-20171210.202400-19/shade-axiom-xml-1.2.21-20171210.202400-19.jar
[JENKINS] Archiving <https://builds.apache.org/job/axiom-1.2.x/ws/axiom/buildutils/shade-axiom-xml/target/shade-axiom-xml-1.2.21-SNAPSHOT-sources.jar>
to org.apache.ws.commons.axiom/shade-axiom-xml/1.2.21-20171210.202400-19/shade-axiom-xml-1.2.21-20171210.202400-19-sources.jar
[JENKINS] Archiving <https://builds.apache.org/job/axiom-1.2.x/ws/axiom/buildutils/shade-axiom-xml/target/shade-axiom-xml-1.2.21-SNAPSHOT-javadoc.jar>
to org.apache.ws.commons.axiom/shade-axiom-xml/1.2.21-20171210.202400-19/shade-axiom-xml-1.2.21-20171210.202400-19-javadoc.jar
[JENKINS] Archiving <https://builds.apache.org/job/axiom-1.2.x/ws/axiom/axiom-jaxb/pom.xml>
to org.apache.ws.commons.axiom/axiom-jaxb/1.2.21-SNAPSHOT/axiom-jaxb-1.2.21-SNAPSHOT.pom
[JENKINS] Archiving <https://builds.apache.org/job/axiom-1.2.x/ws/axiom/axiom-jaxb/target/axiom-jaxb-1.2.21-SNAPSHOT.jar>
to org.apache.ws.commons.axiom/axiom-jaxb/1.2.21-20171210.204342-18/axiom-jaxb-1.2.21-20171210.204342-18.jar
[JENKINS] Archiving <https://builds.apache.org/job/axiom-1.2.x/ws/axiom/axiom-jaxb/target/axiom-jaxb-1.2.21-SNAPSHOT-sources.jar>
to org.apache.ws.commons.axiom/axiom-jaxb/1.2.21-20171210.204342-18/axiom-jaxb-1.2.21-20171210.204342-18-sources.jar
[JENKINS] Archiving <https://builds.apache.org/job/axiom-1.2.x/ws/axiom/axiom-jaxb/target/axiom-jaxb-1.2.21-SNAPSHOT-javadoc.jar>
to org.apache.ws.commons.axiom/axiom-jaxb/1.2.21-20171210.204342-18/axiom-jaxb-1.2.21-20171210.204342-18-javadoc.jar
[JENKINS] Archiving <https://builds.apache.org/job/axiom-1.2.x/ws/axiom/axiom-jaxb/target/jacoco.exec>
to org.apache.ws.commons.axiom/axiom-jaxb/1.2.21-20171210.204342-18/axiom-jaxb-1.2.21-20171210.204342-18-jacoco.exec
[JENKINS] Archiving <https://builds.apache.org/job/axiom-1.2.x/ws/axiom/testing/axiom-testsuite/pom.xml>
to org.apache.ws.commons.axiom/axiom-testsuite/1.2.21-SNAPSHOT/axiom-testsuite-1.2.21-SNAPSHOT.pom
[JENKINS] Archiving <https://builds.apache.org/job/axiom-1.2.x/ws/axiom/testing/axiom-testsuite/target/axiom-testsuite-1.2.21-SNAPSHOT.jar>
to org.apache.ws.commons.axiom/axiom-testsuite/1.2.21-20171210.203358-18/axiom-testsuite-1.2.21-20171210.203358-18.jar
[JENKINS] Archiving <https://builds.apache.org/job/axiom-1.2.x/ws/axiom/testing/axiom-testsuite/target/axiom-testsuite-1.2.21-SNAPSHOT-sources.jar>
to org.apache.ws.commons.axiom/axiom-testsuite/1.2.21-20171210.203358-18/axiom-testsuite-1.2.21-20171210.203358-18-sources.jar
[JENKINS] Archiving <https://builds.apache.org/job/axiom-1.2.x/ws/axiom/testing/axiom-testsuite/target/axiom-testsuite-1.2.21-SNAPSHOT-javadoc.jar>
to org.apache.ws.commons.axiom/axiom-testsuite/1.2.21-20171210.203358-18/axiom-testsuite-1.2.21-20171210.203358-18-javadoc.jar
[JENKINS] Archiving <https://builds.apache.org/job/axiom-1.2.x/ws/axiom/testing/multiton/pom.xml>
to org.apache.ws.commons.axiom/multiton/1.2.21-SNAPSHOT/multiton-1.2.21-SNAPSHOT.pom
[JENKINS] Archiving <https://builds.apache.org/job/axiom-1.2.x/ws/axiom/testing/multiton/target/multiton-1.2.21-SNAPSHOT.jar>
to org.apache.ws.commons.axiom/multiton/1.2.21-20171210.202529-18/multiton-1.2.21-20171210.202529-18.jar
[JENKINS] Archiving <https://builds.apache.org/job/axiom-1.2.x/ws/axiom/testing/multiton/target/multiton-1.2.21-SNAPSHOT-sources.jar>
to org.apache.ws.commons.axiom/multiton/1.2.21-20171210.202529-18/multiton-1.2.21-20171210.202529-18-sources.jar
[JENKINS] Archiving <https://builds.apache.org/job/axiom-1.2.x/ws/axiom/testing/multiton/target/multiton-1.2.21-SNAPSHOT-javadoc.jar>
to org.apache.ws.commons.axiom/multiton/1.2.21-20171210.202529-18/multiton-1.2.21-20171210.202529-18-javadoc.jar
[JENKINS] Archiving <https://builds.apache.org/job/axiom-1.2.x/ws/axiom/buildutils/no-package-cycles-enforcer-rule/pom.xml>
to org.apache.ws.commons.axiom/no-package-cycles-enforcer-rule/1.2.21-SNAPSHOT/no-package-cycles-enforcer-rule-1.2.21-SNAPSHOT.pom
[JENKINS] Archiving <https://builds.apache.org/job/axiom-1.2.x/ws/axiom/buildutils/no-package-cycles-enforcer-rule/target/no-package-cycles-enforcer-rule-1.2.21-SNAPSHOT.jar>
to org.apache.ws.commons.axiom/no-package-cycles-enforcer-rule/1.2.21-20171210.202500-18/no-package-cycles-enforcer-rule-1.2.21-20171210.202500-18.jar
[JENKINS] Archiving <https://builds.apache.org/job/axiom-1.2.x/ws/axiom/buildutils/no-package-cycles-enforcer-rule/target/no-package-cycles-enforcer-rule-1.2.21-SNAPSHOT-sources.jar>
to org.apache.ws.commons.axiom/no-package-cycles-enforcer-rule/1.2.21-20171210.202500-18/no-package-cycles-enforcer-rule-1.2.21-20171210.202500-18-sources.jar
[JENKINS] Archiving <https://builds.apache.org/job/axiom-1.2.x/ws/axiom/buildutils/no-package-cycles-enforcer-rule/target/no-package-cycles-enforcer-rule-1.2.21-SNAPSHOT-javadoc.jar>
to org.apache.ws.commons.axiom/no-package-cycles-enforcer-rule/1.2.21-20171210.202500-18/no-package-cycles-enforcer-rule-1.2.21-20171210.202500-18-javadoc.jar
[JENKINS] Archiving <https://builds.apache.org/job/axiom-1.2.x/ws/axiom/axiom-compat/pom.xml>
to org.apache.ws.commons.axiom/axiom-compat/1.2.21-SNAPSHOT/axiom-compat-1.2.21-SNAPSHOT.pom
[JENKINS] Archiving <https://builds.apache.org/job/axiom-1.2.x/ws/axiom/axiom-compat/target/axiom-compat-1.2.21-SNAPSHOT.jar>
to org.apache.ws.commons.axiom/axiom-compat/1.2.21-20171210.204314-18/axiom-compat-1.2.21-20171210.204314-18.jar
[JENKINS] Archiving <https://builds.apache.org/job/axiom-1.2.x/ws/axiom/axiom-compat/target/axiom-compat-1.2.21-SNAPSHOT-sources.jar>
to org.apache.ws.commons.axiom/axiom-compat/1.2.21-20171210.204314-18/axiom-compat-1.2.21-20171210.204314-18-sources.jar
[JENKINS] Archiving <https://builds.apache.org/job/axiom-1.2.x/ws/axiom/axiom-compat/target/axiom-compat-1.2.21-SNAPSHOT-javadoc.jar>
to org.apache.ws.commons.axiom/axiom-compat/1.2.21-20171210.204314-18/axiom-compat-1.2.21-20171210.204314-18-javadoc.jar
[JENKINS] Archiving <https://builds.apache.org/job/axiom-1.2.x/ws/axiom/axiom-compat/target/jacoco.exec>
to org.apache.ws.commons.axiom/axiom-compat/1.2.21-20171210.204314-18/axiom-compat-1.2.21-20171210.204314-18-jacoco.exec
[JENKINS] Archiving <https://builds.apache.org/job/axiom-1.2.x/ws/axiom/systests/old-tests/pom.xml>
to org.apache.ws.commons.axiom/old-tests/1.2.21-SNAPSHOT/old-tests-1.2.21-SNAPSHOT.pom
[JENKINS] Archiving <https://builds.apache.org/job/axiom-1.2.x/ws/axiom/systests/old-tests/target/old-tests-1.2.21-SNAPSHOT.jar>
to org.apache.ws.commons.axiom/old-tests/1.2.21-SNAPSHOT/old-tests-1.2.21-SNAPSHOT.jar
[JENKINS] Archiving <https://builds.apache.org/job/axiom-1.2.x/ws/axiom/systests/old-tests/target/old-tests-1.2.21-SNAPSHOT-sources.jar>
to org.apache.ws.commons.axiom/old-tests/1.2.21-SNAPSHOT/old-tests-1.2.21-SNAPSHOT-sources.jar
[JENKINS] Archiving <https://builds.apache.org/job/axiom-1.2.x/ws/axiom/systests/old-tests/target/jacoco.exec>
to org.apache.ws.commons.axiom/old-tests/1.2.21-SNAPSHOT/old-tests-1.2.21-SNAPSHOT-jacoco.exec
[JENKINS] Archiving <https://builds.apache.org/job/axiom-1.2.x/ws/axiom/components/pom.xml>
to org.apache.ws.commons.axiom/components/1.2.21-SNAPSHOT/components-1.2.21-SNAPSHOT.pom
[JENKINS] Archiving <https://builds.apache.org/job/axiom-1.2.x/ws/axiom/aspects/pom.xml>
to org.apache.ws.commons.axiom/aspects/1.2.21-SNAPSHOT/aspects-1.2.21-SNAPSHOT.pom
Sending e-mails to: dev@ws.apache.org
channel stopped


---------------------------------------------------------------------
To unsubscribe, e-mail: dev-unsubscribe@ws.apache.org
For additional commands, e-mail: dev-help@ws.apache.org


Mime
View raw message