ws-dev mailing list archives

Site index · List index
Message view « Date » · « Thread »
Top « Date » · « Thread »
From Apache Jenkins Server <jenk...@builds.apache.org>
Subject Build failed in Jenkins: wss4j-trunk #1094
Date Fri, 05 Jan 2018 12:51:16 GMT
See <https://builds.apache.org/job/wss4j-trunk/1094/display/redirect?page=changes>

Changes:

[coheigea] WSS-620 - The SecurityTokenRefSTRParser should derive the key length from the DerivedKeyToken
"Length" parameter

------------------------------------------
[...truncated 290.89 KB...]
[INFO] Running org.apache.wss4j.stax.test.HeaderOrderingTest
[INFO] Tests run: 12, Failures: 0, Errors: 0, Skipped: 0, Time elapsed: 0.485 s - in org.apache.wss4j.stax.test.HeaderOrderingTest
[INFO] Running org.apache.wss4j.stax.test.InboundWSSecurityContextImplTest
[INFO] Tests run: 3, Failures: 0, Errors: 0, Skipped: 0, Time elapsed: 0.001 s - in org.apache.wss4j.stax.test.InboundWSSecurityContextImplTest
[INFO] Running org.apache.wss4j.stax.test.SignatureCRLTest
[WARNING] Tests run: 1, Failures: 0, Errors: 0, Skipped: 1, Time elapsed: 0 s - in org.apache.wss4j.stax.test.SignatureCRLTest
[INFO] Running org.apache.wss4j.stax.test.AttachmentTest
[INFO] Tests run: 16, Failures: 0, Errors: 0, Skipped: 0, Time elapsed: 0.79 s - in org.apache.wss4j.stax.test.AttachmentTest
[INFO] Running org.apache.wss4j.stax.test.VulnerabliltyVectorsTest
testAllowMD5Algorithm skipped
testAllowMD5Algorithm skipped
testAllowMD5Algorithm skipped
testMaximumAllowedTransformsPerReference skipped
[INFO] Tests run: 12, Failures: 0, Errors: 0, Skipped: 0, Time elapsed: 0.589 s - in org.apache.wss4j.stax.test.VulnerabliltyVectorsTest
[INFO] Running org.apache.wss4j.stax.test.MultipleActionTest
[WARNING] Tests run: 3, Failures: 0, Errors: 0, Skipped: 2, Time elapsed: 0 s - in org.apache.wss4j.stax.test.MultipleActionTest
[INFO] Running org.apache.wss4j.stax.test.SignatureIssuerCertConstaintsTest
[INFO] Tests run: 2, Failures: 0, Errors: 0, Skipped: 0, Time elapsed: 0.119 s - in org.apache.wss4j.stax.test.SignatureIssuerCertConstaintsTest
[INFO] Running org.apache.wss4j.stax.test.SecurityContextTokenTest
[INFO] Tests run: 24, Failures: 0, Errors: 0, Skipped: 0, Time elapsed: 0.556 s - in org.apache.wss4j.stax.test.SecurityContextTokenTest
[INFO] Running org.apache.wss4j.stax.test.UsernameTokenTest
[INFO] Tests run: 17, Failures: 0, Errors: 0, Skipped: 0, Time elapsed: 0.373 s - in org.apache.wss4j.stax.test.UsernameTokenTest
[INFO] Running org.apache.wss4j.stax.test.PasswordEncryptorTest
[INFO] Tests run: 2, Failures: 0, Errors: 0, Skipped: 0, Time elapsed: 0.075 s - in org.apache.wss4j.stax.test.PasswordEncryptorTest
[INFO] 
[INFO] Results:
[INFO] 
[WARNING] Tests run: 375, Failures: 0, Errors: 0, Skipped: 8
[INFO] 
[JENKINS] Recording test results
[INFO] 
[INFO] --- maven-jar-plugin:3.0.2:jar (default-jar) @ wss4j-ws-security-stax ---
[INFO] Building jar: <https://builds.apache.org/job/wss4j-trunk/ws/wss4j/ws-security-stax/target/wss4j-ws-security-stax-2.2.1-SNAPSHOT.jar>
[INFO] 
[INFO] --- maven-site-plugin:3.6:attach-descriptor (attach-descriptor) @ wss4j-ws-security-stax
---
[INFO] Skipping because packaging 'jar' is not pom.
[INFO] 
[INFO] >>> maven-source-plugin:3.0.1:jar (default) > generate-sources @ wss4j-ws-security-stax
>>>
[INFO] 
[INFO] >>> maven-pmd-plugin:3.7:check (validate) > :pmd @ wss4j-ws-security-stax
>>>
[INFO] 
[INFO] --- maven-pmd-plugin:3.7:pmd (pmd) @ wss4j-ws-security-stax ---
[INFO] 
[INFO] <<< maven-pmd-plugin:3.7:check (validate) < :pmd @ wss4j-ws-security-stax
<<<
[INFO] 
[INFO] 
[INFO] --- maven-pmd-plugin:3.7:check (validate) @ wss4j-ws-security-stax ---
[INFO] 
[INFO] 
[INFO] --- maven-checkstyle-plugin:2.17:check (validate) @ wss4j-ws-security-stax ---
[INFO] 
[INFO] --- maven-bundle-plugin:2.5.4:cleanVersions (versions) @ wss4j-ws-security-stax ---
[WARNING] Failed to getClass for org.apache.maven.plugins.source.SourceJarMojo
[INFO] 
[INFO] <<< maven-source-plugin:3.0.1:jar (default) < generate-sources @ wss4j-ws-security-stax
<<<
[INFO] 
[INFO] 
[INFO] --- maven-source-plugin:3.0.1:jar (default) @ wss4j-ws-security-stax ---
[INFO] Building jar: <https://builds.apache.org/job/wss4j-trunk/ws/wss4j/ws-security-stax/target/wss4j-ws-security-stax-2.2.1-SNAPSHOT-sources.jar>
[INFO] 
[INFO] --- maven-jar-plugin:3.0.2:test-jar (default) @ wss4j-ws-security-stax ---
[INFO] Building jar: <https://builds.apache.org/job/wss4j-trunk/ws/wss4j/ws-security-stax/target/wss4j-ws-security-stax-2.2.1-SNAPSHOT-tests.jar>
[INFO] 
[INFO] --- maven-install-plugin:2.5.2:install (default-install) @ wss4j-ws-security-stax ---
[INFO] Installing <https://builds.apache.org/job/wss4j-trunk/ws/wss4j/ws-security-stax/target/wss4j-ws-security-stax-2.2.1-SNAPSHOT.jar>
to /home/jenkins/jenkins-slave/maven-repositories/1/org/apache/wss4j/wss4j-ws-security-stax/2.2.1-SNAPSHOT/wss4j-ws-security-stax-2.2.1-SNAPSHOT.jar
[INFO] Installing <https://builds.apache.org/job/wss4j-trunk/ws/wss4j/ws-security-stax/pom.xml>
to /home/jenkins/jenkins-slave/maven-repositories/1/org/apache/wss4j/wss4j-ws-security-stax/2.2.1-SNAPSHOT/wss4j-ws-security-stax-2.2.1-SNAPSHOT.pom
[INFO] Installing <https://builds.apache.org/job/wss4j-trunk/ws/wss4j/ws-security-stax/target/wss4j-ws-security-stax-2.2.1-SNAPSHOT-sources.jar>
to /home/jenkins/jenkins-slave/maven-repositories/1/org/apache/wss4j/wss4j-ws-security-stax/2.2.1-SNAPSHOT/wss4j-ws-security-stax-2.2.1-SNAPSHOT-sources.jar
[INFO] Installing <https://builds.apache.org/job/wss4j-trunk/ws/wss4j/ws-security-stax/target/wss4j-ws-security-stax-2.2.1-SNAPSHOT-tests.jar>
to /home/jenkins/jenkins-slave/maven-repositories/1/org/apache/wss4j/wss4j-ws-security-stax/2.2.1-SNAPSHOT/wss4j-ws-security-stax-2.2.1-SNAPSHOT-tests.jar
[INFO] 
[INFO] >>> maven-pmd-plugin:3.7:check (validate) > :pmd @ wss4j-ws-security-stax
>>>
[INFO] 
[INFO] --- maven-pmd-plugin:3.7:pmd (pmd) @ wss4j-ws-security-stax ---
[INFO] 
[INFO] <<< maven-pmd-plugin:3.7:check (validate) < :pmd @ wss4j-ws-security-stax
<<<
[INFO] 
[INFO] 
[INFO] --- maven-pmd-plugin:3.7:check (validate) @ wss4j-ws-security-stax ---
[INFO] 
[INFO] 
[INFO] --- maven-checkstyle-plugin:2.17:check (validate) @ wss4j-ws-security-stax ---
[INFO] 
[INFO] --- maven-bundle-plugin:2.5.4:cleanVersions (versions) @ wss4j-ws-security-stax ---
[INFO] 
[INFO] --- maven-remote-resources-plugin:1.5:process (process-resource-bundles) @ wss4j-ws-security-stax
---
[INFO] 
[INFO] --- maven-resources-plugin:2.7:resources (default-resources) @ wss4j-ws-security-stax
---
[INFO] Using 'UTF-8' encoding to copy filtered resources.
[INFO] Copying 0 resource
[INFO] Copying 17 resources
[INFO] skip non existing resourceDirectory <https://builds.apache.org/job/wss4j-trunk/ws/wss4j/ws-security-stax/src/main/resources-filtered>
[INFO] skip non existing resourceDirectory <https://builds.apache.org/job/wss4j-trunk/ws/wss4j/ws-security-stax/target/generated/src/main/resources>
[INFO] Copying 3 resources
[INFO] Copying 3 resources
[INFO] 
[INFO] --- maven-compiler-plugin:3.6.2:compile (default-compile) @ wss4j-ws-security-stax
---
[INFO] Nothing to compile - all classes are up to date
[INFO] 
[INFO] >>> maven-bundle-plugin:2.5.4:manifest (bundle-manifest) > process-classes
@ wss4j-ws-security-stax >>>
[INFO] 
[INFO] >>> maven-pmd-plugin:3.7:check (validate) > :pmd @ wss4j-ws-security-stax
>>>
[INFO] 
[INFO] --- maven-pmd-plugin:3.7:pmd (pmd) @ wss4j-ws-security-stax ---
[INFO] 
[INFO] <<< maven-pmd-plugin:3.7:check (validate) < :pmd @ wss4j-ws-security-stax
<<<
[INFO] 
[INFO] 
[INFO] --- maven-pmd-plugin:3.7:check (validate) @ wss4j-ws-security-stax ---
[INFO] 
[INFO] 
[INFO] --- maven-checkstyle-plugin:2.17:check (validate) @ wss4j-ws-security-stax ---
[INFO] 
[INFO] --- maven-bundle-plugin:2.5.4:cleanVersions (versions) @ wss4j-ws-security-stax ---
[INFO] 
[INFO] --- maven-remote-resources-plugin:1.5:process (process-resource-bundles) @ wss4j-ws-security-stax
---
[INFO] 
[INFO] --- maven-resources-plugin:2.7:resources (default-resources) @ wss4j-ws-security-stax
---
[INFO] Using 'UTF-8' encoding to copy filtered resources.
[INFO] Copying 0 resource
[INFO] Copying 17 resources
[INFO] skip non existing resourceDirectory <https://builds.apache.org/job/wss4j-trunk/ws/wss4j/ws-security-stax/src/main/resources-filtered>
[INFO] skip non existing resourceDirectory <https://builds.apache.org/job/wss4j-trunk/ws/wss4j/ws-security-stax/target/generated/src/main/resources>
[INFO] Copying 3 resources
[INFO] Copying 3 resources
[INFO] Copying 3 resources
[INFO] 
[INFO] --- maven-compiler-plugin:3.6.2:compile (default-compile) @ wss4j-ws-security-stax
---
[INFO] Nothing to compile - all classes are up to date
[WARNING] Failed to getClass for org.apache.felix.bundleplugin.ManifestPlugin
[INFO] 
[INFO] <<< maven-bundle-plugin:2.5.4:manifest (bundle-manifest) < process-classes
@ wss4j-ws-security-stax <<<
[INFO] 
[INFO] 
[INFO] --- maven-bundle-plugin:2.5.4:manifest (bundle-manifest) @ wss4j-ws-security-stax ---
[INFO] 
[INFO] --- maven-resources-plugin:2.7:testResources (default-testResources) @ wss4j-ws-security-stax
---
[INFO] Using 'UTF-8' encoding to copy filtered resources.
[INFO] Copying 0 resource
[INFO] Copying 19 resources
[INFO] skip non existing resourceDirectory <https://builds.apache.org/job/wss4j-trunk/ws/wss4j/ws-security-stax/target/generated/src/test/resources>
[INFO] Copying 3 resources
[INFO] Copying 3 resources
[INFO] 
[INFO] --- maven-compiler-plugin:3.6.2:testCompile (default-testCompile) @ wss4j-ws-security-stax
---
[INFO] Nothing to compile - all classes are up to date
[INFO] 
[INFO] --- maven-surefire-plugin:2.20.1:test (default-test) @ wss4j-ws-security-stax ---
[INFO] Skipping execution of surefire because it has already been run for this configuration
[JENKINS] Recording test results
[INFO] 
[INFO] --- maven-jar-plugin:3.0.2:jar (default-jar) @ wss4j-ws-security-stax ---
[INFO] Building jar: <https://builds.apache.org/job/wss4j-trunk/ws/wss4j/ws-security-stax/target/wss4j-ws-security-stax-2.2.1-SNAPSHOT.jar>
[INFO] 
[INFO] --- maven-site-plugin:3.6:attach-descriptor (attach-descriptor) @ wss4j-ws-security-stax
---
[INFO] Skipping because packaging 'jar' is not pom.
[INFO] 
[INFO] >>> maven-source-plugin:3.0.1:jar (default) > generate-sources @ wss4j-ws-security-stax
>>>
[INFO] 
[INFO] >>> maven-pmd-plugin:3.7:check (validate) > :pmd @ wss4j-ws-security-stax
>>>
[INFO] 
[INFO] --- maven-pmd-plugin:3.7:pmd (pmd) @ wss4j-ws-security-stax ---
[INFO] 
[INFO] <<< maven-pmd-plugin:3.7:check (validate) < :pmd @ wss4j-ws-security-stax
<<<
[INFO] 
[INFO] 
[INFO] --- maven-pmd-plugin:3.7:check (validate) @ wss4j-ws-security-stax ---
[INFO] 
[INFO] 
[INFO] --- maven-checkstyle-plugin:2.17:check (validate) @ wss4j-ws-security-stax ---
[INFO] 
[INFO] --- maven-bundle-plugin:2.5.4:cleanVersions (versions) @ wss4j-ws-security-stax ---
[WARNING] Failed to getClass for org.apache.maven.plugins.source.SourceJarMojo
[INFO] 
[INFO] <<< maven-source-plugin:3.0.1:jar (default) < generate-sources @ wss4j-ws-security-stax
<<<
[INFO] 
[INFO] 
[INFO] --- maven-source-plugin:3.0.1:jar (default) @ wss4j-ws-security-stax ---
[INFO] Building jar: <https://builds.apache.org/job/wss4j-trunk/ws/wss4j/ws-security-stax/target/wss4j-ws-security-stax-2.2.1-SNAPSHOT-sources.jar>
[INFO] 
[INFO] --- maven-jar-plugin:3.0.2:test-jar (default) @ wss4j-ws-security-stax ---
[INFO] Building jar: <https://builds.apache.org/job/wss4j-trunk/ws/wss4j/ws-security-stax/target/wss4j-ws-security-stax-2.2.1-SNAPSHOT-tests.jar>
[INFO] 
[INFO] --- maven-install-plugin:2.5.2:install (default-install) @ wss4j-ws-security-stax ---
[INFO] Installing <https://builds.apache.org/job/wss4j-trunk/ws/wss4j/ws-security-stax/target/wss4j-ws-security-stax-2.2.1-SNAPSHOT.jar>
to /home/jenkins/jenkins-slave/maven-repositories/1/org/apache/wss4j/wss4j-ws-security-stax/2.2.1-SNAPSHOT/wss4j-ws-security-stax-2.2.1-SNAPSHOT.jar
[INFO] Installing <https://builds.apache.org/job/wss4j-trunk/ws/wss4j/ws-security-stax/pom.xml>
to /home/jenkins/jenkins-slave/maven-repositories/1/org/apache/wss4j/wss4j-ws-security-stax/2.2.1-SNAPSHOT/wss4j-ws-security-stax-2.2.1-SNAPSHOT.pom
[INFO] Installing <https://builds.apache.org/job/wss4j-trunk/ws/wss4j/ws-security-stax/target/wss4j-ws-security-stax-2.2.1-SNAPSHOT-sources.jar>
to /home/jenkins/jenkins-slave/maven-repositories/1/org/apache/wss4j/wss4j-ws-security-stax/2.2.1-SNAPSHOT/wss4j-ws-security-stax-2.2.1-SNAPSHOT-sources.jar
[INFO] Installing <https://builds.apache.org/job/wss4j-trunk/ws/wss4j/ws-security-stax/target/wss4j-ws-security-stax-2.2.1-SNAPSHOT-tests.jar>
to /home/jenkins/jenkins-slave/maven-repositories/1/org/apache/wss4j/wss4j-ws-security-stax/2.2.1-SNAPSHOT/wss4j-ws-security-stax-2.2.1-SNAPSHOT-tests.jar
[INFO] Installing <https://builds.apache.org/job/wss4j-trunk/ws/wss4j/ws-security-stax/target/wss4j-ws-security-stax-2.2.1-SNAPSHOT-sources.jar>
to /home/jenkins/jenkins-slave/maven-repositories/1/org/apache/wss4j/wss4j-ws-security-stax/2.2.1-SNAPSHOT/wss4j-ws-security-stax-2.2.1-SNAPSHOT-sources.jar
[INFO] Installing <https://builds.apache.org/job/wss4j-trunk/ws/wss4j/ws-security-stax/target/wss4j-ws-security-stax-2.2.1-SNAPSHOT-tests.jar>
to /home/jenkins/jenkins-slave/maven-repositories/1/org/apache/wss4j/wss4j-ws-security-stax/2.2.1-SNAPSHOT/wss4j-ws-security-stax-2.2.1-SNAPSHOT-tests.jar
[INFO] 
[INFO] --- maven-deploy-plugin:2.8.2:deploy (default-deploy) @ wss4j-ws-security-stax ---
[INFO] Downloading from apache.snapshots.https: https://repository.apache.org/content/repositories/snapshots/org/apache/wss4j/wss4j-ws-security-stax/2.2.1-SNAPSHOT/maven-metadata.xml
[WARNING] Could not transfer metadata org.apache.wss4j:wss4j-ws-security-stax:2.2.1-SNAPSHOT/maven-metadata.xml
from/to apache.snapshots.https (https://repository.apache.org/content/repositories/snapshots):
repository.apache.org: unknown error
[INFO] ------------------------------------------------------------------------
[INFO] Reactor Summary:
[INFO] 
[INFO] Apache WSS4J ....................................... SUCCESS [ 31.862 s]
[INFO] Apache WSS4J parent ................................ SUCCESS [ 15.791 s]
[INFO] Apache WSS4J WS-Security Bindings .................. SUCCESS [ 35.813 s]
[INFO] Apache WSS4J WS-SecurityPolicy model ............... SUCCESS [01:41 min]
[INFO] Apache WSS4J WS-Security Common .................... SUCCESS [ 47.828 s]
[INFO] Apache WSS4J DOM WS-Security ....................... SUCCESS [01:10 min]
[INFO] Apache WSS4J Streaming WS-Security ................. FAILURE [01:35 min]
[INFO] Apache WSS4J Web WS-Security ....................... SKIPPED
[INFO] Apache WSS4J WS-Security Integration ............... SKIPPED
[INFO] Apache WSS4J Streaming WS-SecurityPolicy ........... SKIPPED
[INFO] ------------------------------------------------------------------------
[INFO] BUILD FAILURE
[INFO] ------------------------------------------------------------------------
[INFO] Total time: 07:12 min
[INFO] Finished at: 2018-01-05T12:50:48Z
[INFO] Final Memory: 185M/1111M
[INFO] ------------------------------------------------------------------------
[WARNING] The requested profile "deploy" could not be activated because it does not exist.
[ERROR] Failed to execute goal org.apache.maven.plugins:maven-deploy-plugin:2.8.2:deploy (default-deploy)
on project wss4j-ws-security-stax: Failed to retrieve remote metadata org.apache.wss4j:wss4j-ws-security-stax:2.2.1-SNAPSHOT/maven-metadata.xml:
Could not transfer metadata org.apache.wss4j:wss4j-ws-security-stax:2.2.1-SNAPSHOT/maven-metadata.xml
from/to apache.snapshots.https (https://repository.apache.org/content/repositories/snapshots):
repository.apache.org: unknown error: Unknown host repository.apache.org: unknown error ->
[Help 1]
[ERROR] 
[ERROR] To see the full stack trace of the errors, re-run Maven with the -e switch.
[ERROR] Re-run Maven using the -X switch to enable full debug logging.
[ERROR] 
[ERROR] For more information about the errors and possible solutions, please read the following
articles:
[ERROR] [Help 1] http://cwiki.apache.org/confluence/display/MAVEN/MojoExecutionException
[ERROR] 
[ERROR] After correcting the problems, you can resume the build with the command
[ERROR]   mvn <goals> -rf :wss4j-ws-security-stax
[JENKINS] Archiving <https://builds.apache.org/job/wss4j-trunk/ws/wss4j/bindings/pom.xml>
to org.apache.wss4j/wss4j-bindings/2.2.1-SNAPSHOT/wss4j-bindings-2.2.1-SNAPSHOT.pom
[JENKINS] Archiving <https://builds.apache.org/job/wss4j-trunk/ws/wss4j/bindings/target/wss4j-bindings-2.2.1-SNAPSHOT.jar>
to org.apache.wss4j/wss4j-bindings/2.2.1-20180105.124459-17/wss4j-bindings-2.2.1-20180105.124459-17.jar
[JENKINS] Archiving <https://builds.apache.org/job/wss4j-trunk/ws/wss4j/bindings/target/wss4j-bindings-2.2.1-SNAPSHOT-sources.jar>
to org.apache.wss4j/wss4j-bindings/2.2.1-20180105.124459-17/wss4j-bindings-2.2.1-20180105.124459-17-sources.jar
[JENKINS] Archiving <https://builds.apache.org/job/wss4j-trunk/ws/wss4j/ws-security-policy-stax/pom.xml>
to org.apache.wss4j/wss4j-ws-security-policy-stax/2.2.1-SNAPSHOT/wss4j-ws-security-policy-stax-2.2.1-SNAPSHOT.pom
[JENKINS] Archiving <https://builds.apache.org/job/wss4j-trunk/ws/wss4j/ws-security-common/pom.xml>
to org.apache.wss4j/wss4j-ws-security-common/2.2.1-SNAPSHOT/wss4j-ws-security-common-2.2.1-SNAPSHOT.pom
[JENKINS] Archiving <https://builds.apache.org/job/wss4j-trunk/ws/wss4j/ws-security-common/target/wss4j-ws-security-common-2.2.1-SNAPSHOT.jar>
to org.apache.wss4j/wss4j-ws-security-common/2.2.1-20180105.124728-17/wss4j-ws-security-common-2.2.1-20180105.124728-17.jar
[JENKINS] Archiving <https://builds.apache.org/job/wss4j-trunk/ws/wss4j/ws-security-common/target/wss4j-ws-security-common-2.2.1-SNAPSHOT-sources.jar>
to org.apache.wss4j/wss4j-ws-security-common/2.2.1-20180105.124728-17/wss4j-ws-security-common-2.2.1-20180105.124728-17-sources.jar
[JENKINS] Archiving <https://builds.apache.org/job/wss4j-trunk/ws/wss4j/ws-security-common/target/wss4j-ws-security-common-2.2.1-SNAPSHOT-tests.jar>
to org.apache.wss4j/wss4j-ws-security-common/2.2.1-20180105.124728-17/wss4j-ws-security-common-2.2.1-20180105.124728-17-tests.jar
[JENKINS] Archiving <https://builds.apache.org/job/wss4j-trunk/ws/wss4j/ws-security-dom/pom.xml>
to org.apache.wss4j/wss4j-ws-security-dom/2.2.1-SNAPSHOT/wss4j-ws-security-dom-2.2.1-SNAPSHOT.pom
[JENKINS] Archiving <https://builds.apache.org/job/wss4j-trunk/ws/wss4j/ws-security-dom/target/wss4j-ws-security-dom-2.2.1-SNAPSHOT.jar>
to org.apache.wss4j/wss4j-ws-security-dom/2.2.1-20180105.124840-17/wss4j-ws-security-dom-2.2.1-20180105.124840-17.jar
[JENKINS] Archiving <https://builds.apache.org/job/wss4j-trunk/ws/wss4j/ws-security-dom/target/wss4j-ws-security-dom-2.2.1-SNAPSHOT-sources.jar>
to org.apache.wss4j/wss4j-ws-security-dom/2.2.1-20180105.124840-17/wss4j-ws-security-dom-2.2.1-20180105.124840-17-sources.jar
[JENKINS] Archiving <https://builds.apache.org/job/wss4j-trunk/ws/wss4j/ws-security-dom/target/wss4j-ws-security-dom-2.2.1-SNAPSHOT-tests.jar>
to org.apache.wss4j/wss4j-ws-security-dom/2.2.1-20180105.124840-17/wss4j-ws-security-dom-2.2.1-20180105.124840-17-tests.jar
[JENKINS] Archiving <https://builds.apache.org/job/wss4j-trunk/ws/wss4j/policy/pom.xml>
to org.apache.wss4j/wss4j-policy/2.2.1-SNAPSHOT/wss4j-policy-2.2.1-SNAPSHOT.pom
[JENKINS] Archiving <https://builds.apache.org/job/wss4j-trunk/ws/wss4j/policy/target/wss4j-policy-2.2.1-SNAPSHOT.jar>
to org.apache.wss4j/wss4j-policy/2.2.1-20180105.124642-17/wss4j-policy-2.2.1-20180105.124642-17.jar
[JENKINS] Archiving <https://builds.apache.org/job/wss4j-trunk/ws/wss4j/policy/target/wss4j-policy-2.2.1-SNAPSHOT-sources.jar>
to org.apache.wss4j/wss4j-policy/2.2.1-20180105.124642-17/wss4j-policy-2.2.1-20180105.124642-17-sources.jar
[JENKINS] Archiving <https://builds.apache.org/job/wss4j-trunk/ws/wss4j/integration/pom.xml>
to org.apache.wss4j/wss4j-integration/2.2.1-SNAPSHOT/wss4j-integration-2.2.1-SNAPSHOT.pom
[JENKINS] Archiving <https://builds.apache.org/job/wss4j-trunk/ws/wss4j/ws-security-stax/pom.xml>
to org.apache.wss4j/wss4j-ws-security-stax/2.2.1-SNAPSHOT/wss4j-ws-security-stax-2.2.1-SNAPSHOT.pom
[JENKINS] Archiving <https://builds.apache.org/job/wss4j-trunk/ws/wss4j/ws-security-stax/target/wss4j-ws-security-stax-2.2.1-SNAPSHOT.jar>
to org.apache.wss4j/wss4j-ws-security-stax/2.2.1-SNAPSHOT/wss4j-ws-security-stax-2.2.1-SNAPSHOT.jar
[JENKINS] Archiving <https://builds.apache.org/job/wss4j-trunk/ws/wss4j/ws-security-stax/target/wss4j-ws-security-stax-2.2.1-SNAPSHOT-sources.jar>
to org.apache.wss4j/wss4j-ws-security-stax/2.2.1-SNAPSHOT/wss4j-ws-security-stax-2.2.1-SNAPSHOT-sources.jar
[JENKINS] Archiving <https://builds.apache.org/job/wss4j-trunk/ws/wss4j/ws-security-stax/target/wss4j-ws-security-stax-2.2.1-SNAPSHOT-tests.jar>
to org.apache.wss4j/wss4j-ws-security-stax/2.2.1-SNAPSHOT/wss4j-ws-security-stax-2.2.1-SNAPSHOT-tests.jar
[JENKINS] Archiving <https://builds.apache.org/job/wss4j-trunk/ws/wss4j/parent/pom.xml>
to org.apache.wss4j/wss4j-parent/2.2.1-SNAPSHOT/wss4j-parent-2.2.1-SNAPSHOT.pom
[JENKINS] Archiving <https://builds.apache.org/job/wss4j-trunk/ws/wss4j/pom.xml> to
org.apache.wss4j/wss4j/2.2.1-SNAPSHOT/wss4j-2.2.1-SNAPSHOT.pom
[JENKINS] Archiving <https://builds.apache.org/job/wss4j-trunk/ws/wss4j/target/wss4j-2.2.1-SNAPSHOT-site.xml>
to org.apache.wss4j/wss4j/2.2.1-20180105.124402-17/wss4j-2.2.1-20180105.124402-17-site.xml
[JENKINS] Archiving <https://builds.apache.org/job/wss4j-trunk/ws/wss4j/ws-security-web/pom.xml>
to org.apache.wss4j/wss4j-ws-security-web/2.2.1-SNAPSHOT/wss4j-ws-security-web-2.2.1-SNAPSHOT.pom
Sending e-mails to: dev@ws.apache.org
channel stopped

---------------------------------------------------------------------
To unsubscribe, e-mail: dev-unsubscribe@ws.apache.org
For additional commands, e-mail: dev-help@ws.apache.org


Mime
View raw message