ws-dev mailing list archives

Site index · List index
Message view « Date » · « Thread »
Top « Date » · « Thread »
From Apache Jenkins Server <jenk...@builds.apache.org>
Subject Build failed in Jenkins: axiom-trunk #2928
Date Thu, 04 Jan 2018 23:14:57 GMT
See <https://builds.apache.org/job/axiom-trunk/2928/display/redirect?page=changes>

Changes:

[veithen] Move more classes from org.apache.axiom.om.util to axiom-compat.

------------------------------------------
[...truncated 2.15 MB...]
[INFO] Building zip: <https://builds.apache.org/job/axiom-trunk/ws/axiom/distribution/target/axiom-1.3.0-SNAPSHOT-bin.zip>
[INFO] Building zip: <https://builds.apache.org/job/axiom-trunk/ws/axiom/distribution/target/axiom-1.3.0-SNAPSHOT-src.zip>
[INFO] ------------------------------------------------------------------------
[INFO] Reactor Summary:
[INFO] 
[INFO] Axiom .............................................. SUCCESS [ 17.705 s]
[INFO] Build utilities .................................... SUCCESS [  6.890 s]
[INFO] buildutils-maven-plugin ............................ SUCCESS [ 21.358 s]
[INFO] JAR Resource Bundle ................................ SUCCESS [ 10.608 s]
[INFO] Resource Transformer for META-INF/axiom.xml files .. SUCCESS [ 14.392 s]
[INFO] components ......................................... SUCCESS [  6.957 s]
[INFO] base64-utils ....................................... SUCCESS [ 13.668 s]
[INFO] Testing ............................................ SUCCESS [  8.220 s]
[INFO] Multiton pattern implementation .................... SUCCESS [ 13.233 s]
[INFO] Axiom Test Utilities ............................... SUCCESS [01:09 min]
[INFO] XML Test Suite ..................................... SUCCESS [ 14.671 s]
[INFO] jaxp-testsuite ..................................... SUCCESS [ 19.028 s]
[INFO] Google Truth extension for XML ..................... SUCCESS [ 20.333 s]
[INFO] xml-utils .......................................... SUCCESS [ 16.603 s]
[INFO] SOAP Test Suite .................................... SUCCESS [ 17.874 s]
[INFO] Axiom API .......................................... SUCCESS [01:26 min]
[INFO] core-streams ....................................... SUCCESS [ 22.573 s]
[INFO] Aspects ............................................ SUCCESS [  7.701 s]
[INFO] Core Aspects ....................................... SUCCESS [ 17.338 s]
[INFO] Shared Aspects ..................................... SUCCESS [ 13.250 s]
[INFO] OM Aspects ......................................... SUCCESS [ 28.163 s]
[INFO] Google Truth extension for Axiom ................... SUCCESS [ 13.666 s]
[INFO] Jaxen Test Suite ................................... SUCCESS [ 14.414 s]
[INFO] Axiom Implementation Test Suite .................... SUCCESS [ 54.196 s]
[INFO] Implementations .................................... SUCCESS [  9.052 s]
[INFO] LLOM ............................................... SUCCESS [01:19 min]
[INFO] DOM Aspects ........................................ SUCCESS [ 19.524 s]
[INFO] DOM Test Suite ..................................... SUCCESS [ 50.847 s]
[INFO] DOOM ............................................... SUCCESS [01:28 min]
[INFO] Axiom Compatibility Classes ........................ SUCCESS [ 23.545 s]
[INFO] Axiom Uber-JAR ..................................... SUCCESS [  6.123 s]
[INFO] Samples ............................................ SUCCESS [ 10.814 s]
[INFO] System Tests ....................................... SUCCESS [  4.099 s]
[INFO] compat-tests ....................................... SUCCESS [  7.066 s]
[INFO] Cross OM Tests ..................................... SUCCESS [  8.285 s]
[INFO] Eclipse Tests ...................................... SUCCESS [ 28.778 s]
[INFO] Wildfly Tests ...................................... SUCCESS [ 25.761 s]
[INFO] Axiom Test Suite (old) ............................. SUCCESS [  8.466 s]
[INFO] Axiom OSGi Tests ................................... SUCCESS [ 12.547 s]
[INFO] Spring-WS Test Suite ............................... SUCCESS [ 38.833 s]
[INFO] Spring WS Tests .................................... SUCCESS [ 34.107 s]
[INFO] WSS4J Tests ........................................ SUCCESS [ 10.866 s]
[INFO] Developer Guide .................................... SUCCESS [  9.600 s]
[INFO] User Guide ......................................... SUCCESS [  6.847 s]
[INFO] Javadoc ............................................ SUCCESS [  9.488 s]
[INFO] Distribution ....................................... FAILURE [  6.773 s]
[INFO] Code Coverage Report ............................... SKIPPED
[INFO] SAAJ Test Suite .................................... SKIPPED
[INFO] ------------------------------------------------------------------------
[INFO] BUILD FAILURE
[INFO] ------------------------------------------------------------------------
[INFO] Total time: 19:55 min
[INFO] Finished at: 2018-01-04T23:13:55+00:00
[INFO] Final Memory: 225M/470M
[INFO] ------------------------------------------------------------------------
[ERROR] Failed to execute goal org.apache.maven.plugins:maven-assembly-plugin:2.6:single (bin)
on project distribution: Failed to create assembly: Error creating assembly archive src: Problem
creating zip: Execution exception: No space left on device -> [Help 1]
[ERROR] 
[ERROR] To see the full stack trace of the errors, re-run Maven with the -e switch.
[ERROR] Re-run Maven using the -X switch to enable full debug logging.
[ERROR] 
[ERROR] For more information about the errors and possible solutions, please read the following
articles:
[ERROR] [Help 1] http://cwiki.apache.org/confluence/display/MAVEN/MojoExecutionException
[ERROR] 
[ERROR] After correcting the problems, you can resume the build with the command
[ERROR]   mvn <goals> -rf :distribution
[JENKINS] Archiving <https://builds.apache.org/job/axiom-trunk/ws/axiom/aspects/core-aspects/pom.xml>
to org.apache.ws.commons.axiom/core-aspects/1.3.0-SNAPSHOT/core-aspects-1.3.0-SNAPSHOT.pom
[JENKINS] Archiving <https://builds.apache.org/job/axiom-trunk/ws/axiom/aspects/core-aspects/target/core-aspects-1.3.0-SNAPSHOT.jar>
to org.apache.ws.commons.axiom/core-aspects/1.3.0-20180104.230120-466/core-aspects-1.3.0-20180104.230120-466.jar
[JENKINS] Archiving <https://builds.apache.org/job/axiom-trunk/ws/axiom/aspects/core-aspects/target/core-aspects-1.3.0-SNAPSHOT-sources.jar>
to org.apache.ws.commons.axiom/core-aspects/1.3.0-20180104.230120-466/core-aspects-1.3.0-20180104.230120-466-sources.jar
[JENKINS] Archiving <https://builds.apache.org/job/axiom-trunk/ws/axiom/aspects/core-aspects/target/core-aspects-1.3.0-SNAPSHOT-javadoc.jar>
to org.apache.ws.commons.axiom/core-aspects/1.3.0-20180104.230120-466/core-aspects-1.3.0-20180104.230120-466-javadoc.jar
[JENKINS] Archiving <https://builds.apache.org/job/axiom-trunk/ws/axiom/components/xml-utils/pom.xml>
to org.apache.ws.commons.axiom/xml-utils/1.3.0-SNAPSHOT/xml-utils-1.3.0-SNAPSHOT.pom
[JENKINS] Archiving <https://builds.apache.org/job/axiom-trunk/ws/axiom/components/xml-utils/target/xml-utils-1.3.0-SNAPSHOT.jar>
to org.apache.ws.commons.axiom/xml-utils/1.3.0-20180104.225836-466/xml-utils-1.3.0-20180104.225836-466.jar
[JENKINS] Archiving <https://builds.apache.org/job/axiom-trunk/ws/axiom/components/xml-utils/target/xml-utils-1.3.0-SNAPSHOT-sources.jar>
to org.apache.ws.commons.axiom/xml-utils/1.3.0-20180104.225836-466/xml-utils-1.3.0-20180104.225836-466-sources.jar
[JENKINS] Archiving <https://builds.apache.org/job/axiom-trunk/ws/axiom/components/xml-utils/target/xml-utils-1.3.0-SNAPSHOT-javadoc.jar>
to org.apache.ws.commons.axiom/xml-utils/1.3.0-20180104.225836-466/xml-utils-1.3.0-20180104.225836-466-javadoc.jar
[JENKINS] Archiving <https://builds.apache.org/job/axiom-trunk/ws/axiom/components/xml-utils/target/jacoco.exec>
to org.apache.ws.commons.axiom/xml-utils/1.3.0-20180104.225836-466/xml-utils-1.3.0-20180104.225836-466-jacoco.exec
[JENKINS] Archiving <https://builds.apache.org/job/axiom-trunk/ws/axiom/systests/wss4j-tests/pom.xml>
to org.apache.ws.commons.axiom/wss4j-tests/1.3.0-SNAPSHOT/wss4j-tests-1.3.0-SNAPSHOT.pom
[JENKINS] Archiving <https://builds.apache.org/job/axiom-trunk/ws/axiom/systests/wss4j-tests/target/wss4j-tests-1.3.0-SNAPSHOT.jar>
to org.apache.ws.commons.axiom/wss4j-tests/1.3.0-SNAPSHOT/wss4j-tests-1.3.0-SNAPSHOT.jar
[JENKINS] Archiving <https://builds.apache.org/job/axiom-trunk/ws/axiom/systests/wss4j-tests/target/wss4j-tests-1.3.0-SNAPSHOT-sources.jar>
to org.apache.ws.commons.axiom/wss4j-tests/1.3.0-SNAPSHOT/wss4j-tests-1.3.0-SNAPSHOT-sources.jar
[JENKINS] Archiving <https://builds.apache.org/job/axiom-trunk/ws/axiom/systests/wss4j-tests/target/jacoco.exec>
to org.apache.ws.commons.axiom/wss4j-tests/1.3.0-SNAPSHOT/wss4j-tests-1.3.0-SNAPSHOT-jacoco.exec
[JENKINS] Archiving <https://builds.apache.org/job/axiom-trunk/ws/axiom/code-coverage/pom.xml>
to org.apache.ws.commons.axiom/code-coverage/1.3.0-SNAPSHOT/code-coverage-1.3.0-SNAPSHOT.pom
[JENKINS] Archiving <https://builds.apache.org/job/axiom-trunk/ws/axiom/pom.xml> to
org.apache.ws.commons.axiom/axiom/1.3.0-SNAPSHOT/axiom-1.3.0-SNAPSHOT.pom
[JENKINS] Archiving <https://builds.apache.org/job/axiom-trunk/ws/axiom/target/axiom-1.3.0-SNAPSHOT-site.xml>
to org.apache.ws.commons.axiom/axiom/1.3.0-20180104.225416-473/axiom-1.3.0-20180104.225416-473-site.xml
[Fast Archiver] Compressed 64.05 KB of artifacts by 50.0% relative to #2927
[JENKINS] Archiving <https://builds.apache.org/job/axiom-trunk/ws/axiom/testing/soap-testsuite/pom.xml>
to org.apache.ws.commons.axiom/soap-testsuite/1.3.0-SNAPSHOT/soap-testsuite-1.3.0-SNAPSHOT.pom
[JENKINS] Archiving <https://builds.apache.org/job/axiom-trunk/ws/axiom/testing/soap-testsuite/target/soap-testsuite-1.3.0-SNAPSHOT.jar>
to org.apache.ws.commons.axiom/soap-testsuite/1.3.0-20180104.225856-466/soap-testsuite-1.3.0-20180104.225856-466.jar
[JENKINS] Archiving <https://builds.apache.org/job/axiom-trunk/ws/axiom/testing/soap-testsuite/target/soap-testsuite-1.3.0-SNAPSHOT-sources.jar>
to org.apache.ws.commons.axiom/soap-testsuite/1.3.0-20180104.225856-466/soap-testsuite-1.3.0-20180104.225856-466-sources.jar
[JENKINS] Archiving <https://builds.apache.org/job/axiom-trunk/ws/axiom/testing/soap-testsuite/target/soap-testsuite-1.3.0-SNAPSHOT-javadoc.jar>
to org.apache.ws.commons.axiom/soap-testsuite/1.3.0-20180104.225856-466/soap-testsuite-1.3.0-20180104.225856-466-javadoc.jar
[JENKINS] Archiving <https://builds.apache.org/job/axiom-trunk/ws/axiom/testing/soap-testsuite/target/jacoco.exec>
to org.apache.ws.commons.axiom/soap-testsuite/1.3.0-20180104.225856-466/soap-testsuite-1.3.0-20180104.225856-466-jacoco.exec
[Fast Archiver] Compressed 408.40 KB of artifacts by 31.3% relative to #2927
[JENKINS] Archiving <https://builds.apache.org/job/axiom-trunk/ws/axiom/implementations/pom.xml>
to org.apache.ws.commons.axiom/implementations/1.3.0-SNAPSHOT/implementations-1.3.0-SNAPSHOT.pom
[JENKINS] Archiving <https://builds.apache.org/job/axiom-trunk/ws/axiom/implementations/target/implementations-1.3.0-SNAPSHOT-site.xml>
to org.apache.ws.commons.axiom/implementations/1.3.0-20180104.230349-464/implementations-1.3.0-20180104.230349-464-site.xml
[JENKINS] Archiving <https://builds.apache.org/job/axiom-trunk/ws/axiom/systests/pom.xml>
to org.apache.ws.commons.axiom/systests/1.3.0-SNAPSHOT/systests-1.3.0-SNAPSHOT.pom
[JENKINS] Archiving <https://builds.apache.org/job/axiom-trunk/ws/axiom/userguide/pom.xml>
to org.apache.ws.commons.axiom/userguide/1.3.0-SNAPSHOT/userguide-1.3.0-SNAPSHOT.pom
[JENKINS] Archiving <https://builds.apache.org/job/axiom-trunk/ws/axiom/userguide/target/docbkx/pdf/userguide.pdf>
to org.apache.ws.commons.axiom/userguide/1.3.0-SNAPSHOT/userguide-1.3.0-SNAPSHOT.pdf
[Fast Archiver] Compressed 344.78 KB of artifacts by 74.2% relative to #2927
[JENKINS] Archiving <https://builds.apache.org/job/axiom-trunk/ws/axiom/devguide/pom.xml>
to org.apache.ws.commons.axiom/devguide/1.3.0-SNAPSHOT/devguide-1.3.0-SNAPSHOT.pom
[JENKINS] Archiving <https://builds.apache.org/job/axiom-trunk/ws/axiom/devguide/target/docbkx/pdf/devguide.pdf>
to org.apache.ws.commons.axiom/devguide/1.3.0-SNAPSHOT/devguide-1.3.0-SNAPSHOT.pdf
[Fast Archiver] Compressed 91.54 KB of artifacts by 35.0% relative to #2927
[JENKINS] Archiving <https://builds.apache.org/job/axiom-trunk/ws/axiom/distribution/pom.xml>
to org.apache.ws.commons.axiom/distribution/1.3.0-SNAPSHOT/distribution-1.3.0-SNAPSHOT.pom
[JENKINS] Archiving <https://builds.apache.org/job/axiom-trunk/ws/axiom/distribution/target/axiom-1.3.0-SNAPSHOT-bin.zip>
to org.apache.ws.commons.axiom/distribution/1.3.0-SNAPSHOT/distribution-1.3.0-SNAPSHOT-bin.zip
[Fast Archiver] Compressed 5.51 MB of artifacts by 14.2% relative to #2927
[JENKINS] Archiving <https://builds.apache.org/job/axiom-trunk/ws/axiom/testing/axiom-truth/pom.xml>
to org.apache.ws.commons.axiom/axiom-truth/1.3.0-SNAPSHOT/axiom-truth-1.3.0-SNAPSHOT.pom
[JENKINS] Archiving <https://builds.apache.org/job/axiom-trunk/ws/axiom/testing/axiom-truth/target/axiom-truth-1.3.0-SNAPSHOT.jar>
to org.apache.ws.commons.axiom/axiom-truth/1.3.0-20180104.230223-465/axiom-truth-1.3.0-20180104.230223-465.jar
[JENKINS] Archiving <https://builds.apache.org/job/axiom-trunk/ws/axiom/testing/axiom-truth/target/axiom-truth-1.3.0-SNAPSHOT-sources.jar>
to org.apache.ws.commons.axiom/axiom-truth/1.3.0-20180104.230223-465/axiom-truth-1.3.0-20180104.230223-465-sources.jar
[JENKINS] Archiving <https://builds.apache.org/job/axiom-trunk/ws/axiom/testing/axiom-truth/target/axiom-truth-1.3.0-SNAPSHOT-javadoc.jar>
to org.apache.ws.commons.axiom/axiom-truth/1.3.0-20180104.230223-465/axiom-truth-1.3.0-20180104.230223-465-javadoc.jar
[JENKINS] Archiving <https://builds.apache.org/job/axiom-trunk/ws/axiom/buildutils/jar-resource-bundle/pom.xml>
to org.apache.ws.commons.axiom/jar-resource-bundle/1.3.0-SNAPSHOT/jar-resource-bundle-1.3.0-SNAPSHOT.pom
[JENKINS] Archiving <https://builds.apache.org/job/axiom-trunk/ws/axiom/buildutils/jar-resource-bundle/target/jar-resource-bundle-1.3.0-SNAPSHOT.jar>
to org.apache.ws.commons.axiom/jar-resource-bundle/1.3.0-20180104.225501-472/jar-resource-bundle-1.3.0-20180104.225501-472.jar
[JENKINS] Archiving <https://builds.apache.org/job/axiom-trunk/ws/axiom/buildutils/jar-resource-bundle/target/jar-resource-bundle-1.3.0-SNAPSHOT-sources.jar>
to org.apache.ws.commons.axiom/jar-resource-bundle/1.3.0-20180104.225501-472/jar-resource-bundle-1.3.0-20180104.225501-472-sources.jar
[JENKINS] Archiving <https://builds.apache.org/job/axiom-trunk/ws/axiom/buildutils/buildutils-maven-plugin/pom.xml>
to org.apache.ws.commons.axiom/buildutils-maven-plugin/1.3.0-SNAPSHOT/buildutils-maven-plugin-1.3.0-SNAPSHOT.pom
[JENKINS] Archiving <https://builds.apache.org/job/axiom-trunk/ws/axiom/buildutils/buildutils-maven-plugin/target/buildutils-maven-plugin-1.3.0-SNAPSHOT.jar>
to org.apache.ws.commons.axiom/buildutils-maven-plugin/1.3.0-20180104.225446-38/buildutils-maven-plugin-1.3.0-20180104.225446-38.jar
[JENKINS] Archiving <https://builds.apache.org/job/axiom-trunk/ws/axiom/buildutils/buildutils-maven-plugin/target/buildutils-maven-plugin-1.3.0-SNAPSHOT-sources.jar>
to org.apache.ws.commons.axiom/buildutils-maven-plugin/1.3.0-20180104.225446-38/buildutils-maven-plugin-1.3.0-20180104.225446-38-sources.jar
[JENKINS] Archiving <https://builds.apache.org/job/axiom-trunk/ws/axiom/buildutils/buildutils-maven-plugin/target/buildutils-maven-plugin-1.3.0-SNAPSHOT-javadoc.jar>
to org.apache.ws.commons.axiom/buildutils-maven-plugin/1.3.0-20180104.225446-38/buildutils-maven-plugin-1.3.0-20180104.225446-38-javadoc.jar
[JENKINS] Archiving <https://builds.apache.org/job/axiom-trunk/ws/axiom/testing/pom.xml>
to org.apache.ws.commons.axiom/testing/1.3.0-SNAPSHOT/testing-1.3.0-SNAPSHOT.pom
[JENKINS] Archiving <https://builds.apache.org/job/axiom-trunk/ws/axiom/testing/target/testing-1.3.0-SNAPSHOT-site.xml>
to org.apache.ws.commons.axiom/testing/1.3.0-20180104.225553-469/testing-1.3.0-20180104.225553-469-site.xml
[JENKINS] Archiving <https://builds.apache.org/job/axiom-trunk/ws/axiom/systests/osgi-tests/pom.xml>
to org.apache.ws.commons.axiom/osgi-tests/1.3.0-SNAPSHOT/osgi-tests-1.3.0-SNAPSHOT.pom
[JENKINS] Archiving <https://builds.apache.org/job/axiom-trunk/ws/axiom/systests/osgi-tests/target/osgi-tests-1.3.0-SNAPSHOT.jar>
to org.apache.ws.commons.axiom/osgi-tests/1.3.0-SNAPSHOT/osgi-tests-1.3.0-SNAPSHOT.jar
[JENKINS] Archiving <https://builds.apache.org/job/axiom-trunk/ws/axiom/systests/osgi-tests/target/osgi-tests-1.3.0-SNAPSHOT-sources.jar>
to org.apache.ws.commons.axiom/osgi-tests/1.3.0-SNAPSHOT/osgi-tests-1.3.0-SNAPSHOT-sources.jar
[JENKINS] Archiving <https://builds.apache.org/job/axiom-trunk/ws/axiom/systests/osgi-tests/target/jacoco.exec>
to org.apache.ws.commons.axiom/osgi-tests/1.3.0-SNAPSHOT/osgi-tests-1.3.0-SNAPSHOT-jacoco.exec
[JENKINS] Archiving <https://builds.apache.org/job/axiom-trunk/ws/axiom/testing/saaj-testsuite/pom.xml>
to org.apache.ws.commons.axiom/saaj-testsuite/1.3.0-SNAPSHOT/saaj-testsuite-1.3.0-SNAPSHOT.pom
[JENKINS] Archiving <https://builds.apache.org/job/axiom-trunk/ws/axiom/systests/spring-ws-tests/pom.xml>
to org.apache.ws.commons.axiom/spring-ws-tests/1.3.0-SNAPSHOT/spring-ws-tests-1.3.0-SNAPSHOT.pom
[JENKINS] Archiving <https://builds.apache.org/job/axiom-trunk/ws/axiom/systests/spring-ws-tests/target/spring-ws-tests-1.3.0-SNAPSHOT.jar>
to org.apache.ws.commons.axiom/spring-ws-tests/1.3.0-SNAPSHOT/spring-ws-tests-1.3.0-SNAPSHOT.jar
[JENKINS] Archiving <https://builds.apache.org/job/axiom-trunk/ws/axiom/systests/spring-ws-tests/target/spring-ws-tests-1.3.0-SNAPSHOT-sources.jar>
to org.apache.ws.commons.axiom/spring-ws-tests/1.3.0-SNAPSHOT/spring-ws-tests-1.3.0-SNAPSHOT-sources.jar
[JENKINS] Archiving <https://builds.apache.org/job/axiom-trunk/ws/axiom/systests/spring-ws-tests/target/jacoco.exec>
to org.apache.ws.commons.axiom/spring-ws-tests/1.3.0-SNAPSHOT/spring-ws-tests-1.3.0-SNAPSHOT-jacoco.exec
[JENKINS] Archiving <https://builds.apache.org/job/axiom-trunk/ws/axiom/systests/cross-om-tests/pom.xml>
to org.apache.ws.commons.axiom/cross-om-tests/1.3.0-SNAPSHOT/cross-om-tests-1.3.0-SNAPSHOT.pom
[JENKINS] Archiving <https://builds.apache.org/job/axiom-trunk/ws/axiom/systests/cross-om-tests/target/cross-om-tests-1.3.0-SNAPSHOT.jar>
to org.apache.ws.commons.axiom/cross-om-tests/1.3.0-SNAPSHOT/cross-om-tests-1.3.0-SNAPSHOT.jar
[JENKINS] Archiving <https://builds.apache.org/job/axiom-trunk/ws/axiom/systests/cross-om-tests/target/cross-om-tests-1.3.0-SNAPSHOT-sources.jar>
to org.apache.ws.commons.axiom/cross-om-tests/1.3.0-SNAPSHOT/cross-om-tests-1.3.0-SNAPSHOT-sources.jar
[JENKINS] Archiving <https://builds.apache.org/job/axiom-trunk/ws/axiom/systests/cross-om-tests/target/jacoco.exec>
to org.apache.ws.commons.axiom/cross-om-tests/1.3.0-SNAPSHOT/cross-om-tests-1.3.0-SNAPSHOT-jacoco.exec
[JENKINS] Archiving <https://builds.apache.org/job/axiom-trunk/ws/axiom/testing/spring-ws-testsuite/pom.xml>
to org.apache.ws.commons.axiom/spring-ws-testsuite/1.3.0-SNAPSHOT/spring-ws-testsuite-1.3.0-SNAPSHOT.pom
[JENKINS] Archiving <https://builds.apache.org/job/axiom-trunk/ws/axiom/testing/spring-ws-testsuite/target/spring-ws-testsuite-1.3.0-SNAPSHOT.jar>
to org.apache.ws.commons.axiom/spring-ws-testsuite/1.3.0-20180104.231108-453/spring-ws-testsuite-1.3.0-20180104.231108-453.jar
[JENKINS] Archiving <https://builds.apache.org/job/axiom-trunk/ws/axiom/testing/spring-ws-testsuite/target/spring-ws-testsuite-1.3.0-SNAPSHOT-sources.jar>
to org.apache.ws.commons.axiom/spring-ws-testsuite/1.3.0-20180104.231108-453/spring-ws-testsuite-1.3.0-20180104.231108-453-sources.jar
[JENKINS] Archiving <https://builds.apache.org/job/axiom-trunk/ws/axiom/testing/spring-ws-testsuite/target/spring-ws-testsuite-1.3.0-SNAPSHOT-javadoc.jar>
to org.apache.ws.commons.axiom/spring-ws-testsuite/1.3.0-20180104.231108-453/spring-ws-testsuite-1.3.0-20180104.231108-453-javadoc.jar
[JENKINS] Archiving <https://builds.apache.org/job/axiom-trunk/ws/axiom/testing/spring-ws-testsuite/target/jacoco.exec>
to org.apache.ws.commons.axiom/spring-ws-testsuite/1.3.0-20180104.231108-453/spring-ws-testsuite-1.3.0-20180104.231108-453-jacoco.exec
[JENKINS] Archiving <https://builds.apache.org/job/axiom-trunk/ws/axiom/aspects/dom-aspects/pom.xml>
to org.apache.ws.commons.axiom/dom-aspects/1.3.0-SNAPSHOT/dom-aspects-1.3.0-SNAPSHOT.pom
[JENKINS] Archiving <https://builds.apache.org/job/axiom-trunk/ws/axiom/aspects/dom-aspects/target/dom-aspects-1.3.0-SNAPSHOT.jar>
to org.apache.ws.commons.axiom/dom-aspects/1.3.0-20180104.230527-463/dom-aspects-1.3.0-20180104.230527-463.jar
[JENKINS] Archiving <https://builds.apache.org/job/axiom-trunk/ws/axiom/aspects/dom-aspects/target/dom-aspects-1.3.0-SNAPSHOT-sources.jar>
to org.apache.ws.commons.axiom/dom-aspects/1.3.0-20180104.230527-463/dom-aspects-1.3.0-20180104.230527-463-sources.jar
[JENKINS] Archiving <https://builds.apache.org/job/axiom-trunk/ws/axiom/aspects/dom-aspects/target/dom-aspects-1.3.0-SNAPSHOT-javadoc.jar>
to org.apache.ws.commons.axiom/dom-aspects/1.3.0-20180104.230527-463/dom-aspects-1.3.0-20180104.230527-463-javadoc.jar
[JENKINS] Archiving <https://builds.apache.org/job/axiom-trunk/ws/axiom/aspects/dom-aspects/target/jacoco.exec>
to org.apache.ws.commons.axiom/dom-aspects/1.3.0-20180104.230527-463/dom-aspects-1.3.0-20180104.230527-463-jacoco.exec
[JENKINS] Archiving <https://builds.apache.org/job/axiom-trunk/ws/axiom/aspects/om-aspects/pom.xml>
to org.apache.ws.commons.axiom/om-aspects/1.3.0-SNAPSHOT/om-aspects-1.3.0-SNAPSHOT.pom
[JENKINS] Archiving <https://builds.apache.org/job/axiom-trunk/ws/axiom/aspects/om-aspects/target/om-aspects-1.3.0-SNAPSHOT.jar>
to org.apache.ws.commons.axiom/om-aspects/1.3.0-20180104.230204-465/om-aspects-1.3.0-20180104.230204-465.jar
[JENKINS] Archiving <https://builds.apache.org/job/axiom-trunk/ws/axiom/aspects/om-aspects/target/om-aspects-1.3.0-SNAPSHOT-sources.jar>
to org.apache.ws.commons.axiom/om-aspects/1.3.0-20180104.230204-465/om-aspects-1.3.0-20180104.230204-465-sources.jar
[JENKINS] Archiving <https://builds.apache.org/job/axiom-trunk/ws/axiom/aspects/om-aspects/target/om-aspects-1.3.0-SNAPSHOT-javadoc.jar>
to org.apache.ws.commons.axiom/om-aspects/1.3.0-20180104.230204-465/om-aspects-1.3.0-20180104.230204-465-javadoc.jar
[JENKINS] Archiving <https://builds.apache.org/job/axiom-trunk/ws/axiom/aspects/om-aspects/target/jacoco.exec>
to org.apache.ws.commons.axiom/om-aspects/1.3.0-20180104.230204-465/om-aspects-1.3.0-20180104.230204-465-jacoco.exec
[Fast Archiver] Compressed 1.49 MB of artifacts by 20.9% relative to #2927
[JENKINS] Archiving <https://builds.apache.org/job/axiom-trunk/ws/axiom/implementations/axiom-dom/pom.xml>
to org.apache.ws.commons.axiom/axiom-dom/1.3.0-SNAPSHOT/axiom-dom-1.3.0-SNAPSHOT.pom
[JENKINS] Archiving <https://builds.apache.org/job/axiom-trunk/ws/axiom/implementations/axiom-dom/target/axiom-dom-1.3.0-SNAPSHOT.jar>
to org.apache.ws.commons.axiom/axiom-dom/1.3.0-20180104.230751-461/axiom-dom-1.3.0-20180104.230751-461.jar
[JENKINS] Archiving <https://builds.apache.org/job/axiom-trunk/ws/axiom/implementations/axiom-dom/target/axiom-dom-1.3.0-SNAPSHOT-sources.jar>
to org.apache.ws.commons.axiom/axiom-dom/1.3.0-20180104.230751-461/axiom-dom-1.3.0-20180104.230751-461-sources.jar
[JENKINS] Archiving <https://builds.apache.org/job/axiom-trunk/ws/axiom/implementations/axiom-dom/target/axiom-dom-1.3.0-SNAPSHOT-javadoc.jar>
to org.apache.ws.commons.axiom/axiom-dom/1.3.0-20180104.230751-461/axiom-dom-1.3.0-20180104.230751-461-javadoc.jar
[JENKINS] Archiving <https://builds.apache.org/job/axiom-trunk/ws/axiom/implementations/axiom-dom/target/jacoco.exec>
to org.apache.ws.commons.axiom/axiom-dom/1.3.0-20180104.230751-461/axiom-dom-1.3.0-20180104.230751-461-jacoco.exec
[JENKINS] Archiving <https://builds.apache.org/job/axiom-trunk/ws/axiom/components/base64-utils/pom.xml>
to org.apache.ws.commons.axiom/base64-utils/1.3.0-SNAPSHOT/base64-utils-1.3.0-SNAPSHOT.pom
[JENKINS] Archiving <https://builds.apache.org/job/axiom-trunk/ws/axiom/components/base64-utils/target/base64-utils-1.3.0-SNAPSHOT.jar>
to org.apache.ws.commons.axiom/base64-utils/1.3.0-20180104.225540-71/base64-utils-1.3.0-20180104.225540-71.jar
[JENKINS] Archiving <https://builds.apache.org/job/axiom-trunk/ws/axiom/components/base64-utils/target/base64-utils-1.3.0-SNAPSHOT-sources.jar>
to org.apache.ws.commons.axiom/base64-utils/1.3.0-20180104.225540-71/base64-utils-1.3.0-20180104.225540-71-sources.jar
[JENKINS] Archiving <https://builds.apache.org/job/axiom-trunk/ws/axiom/components/base64-utils/target/base64-utils-1.3.0-SNAPSHOT-javadoc.jar>
to org.apache.ws.commons.axiom/base64-utils/1.3.0-20180104.225540-71/base64-utils-1.3.0-20180104.225540-71-javadoc.jar
[JENKINS] Archiving <https://builds.apache.org/job/axiom-trunk/ws/axiom/testing/jaxp-testsuite/pom.xml>
to org.apache.ws.commons.axiom/jaxp-testsuite/1.3.0-SNAPSHOT/jaxp-testsuite-1.3.0-SNAPSHOT.pom
[JENKINS] Archiving <https://builds.apache.org/job/axiom-trunk/ws/axiom/testing/jaxp-testsuite/target/jaxp-testsuite-1.3.0-SNAPSHOT.jar>
to org.apache.ws.commons.axiom/jaxp-testsuite/1.3.0-20180104.225754-466/jaxp-testsuite-1.3.0-20180104.225754-466.jar
[JENKINS] Archiving <https://builds.apache.org/job/axiom-trunk/ws/axiom/testing/jaxp-testsuite/target/jaxp-testsuite-1.3.0-SNAPSHOT-sources.jar>
to org.apache.ws.commons.axiom/jaxp-testsuite/1.3.0-20180104.225754-466/jaxp-testsuite-1.3.0-20180104.225754-466-sources.jar
[JENKINS] Archiving <https://builds.apache.org/job/axiom-trunk/ws/axiom/testing/jaxp-testsuite/target/jaxp-testsuite-1.3.0-SNAPSHOT-javadoc.jar>
to org.apache.ws.commons.axiom/jaxp-testsuite/1.3.0-20180104.225754-466/jaxp-testsuite-1.3.0-20180104.225754-466-javadoc.jar
[JENKINS] Archiving <https://builds.apache.org/job/axiom-trunk/ws/axiom/testing/jaxp-testsuite/target/jacoco.exec>
to org.apache.ws.commons.axiom/jaxp-testsuite/1.3.0-20180104.225754-466/jaxp-testsuite-1.3.0-20180104.225754-466-jacoco.exec
[JENKINS] Archiving <https://builds.apache.org/job/axiom-trunk/ws/axiom/testing/jaxen-testsuite/pom.xml>
to org.apache.ws.commons.axiom/jaxen-testsuite/1.3.0-SNAPSHOT/jaxen-testsuite-1.3.0-SNAPSHOT.pom
[JENKINS] Archiving <https://builds.apache.org/job/axiom-trunk/ws/axiom/testing/jaxen-testsuite/target/jaxen-testsuite-1.3.0-SNAPSHOT.jar>
to org.apache.ws.commons.axiom/jaxen-testsuite/1.3.0-20180104.230239-464/jaxen-testsuite-1.3.0-20180104.230239-464.jar
[JENKINS] Archiving <https://builds.apache.org/job/axiom-trunk/ws/axiom/testing/jaxen-testsuite/target/jaxen-testsuite-1.3.0-SNAPSHOT-sources.jar>
to org.apache.ws.commons.axiom/jaxen-testsuite/1.3.0-20180104.230239-464/jaxen-testsuite-1.3.0-20180104.230239-464-sources.jar
[JENKINS] Archiving <https://builds.apache.org/job/axiom-trunk/ws/axiom/testing/jaxen-testsuite/target/jaxen-testsuite-1.3.0-SNAPSHOT-javadoc.jar>
to org.apache.ws.commons.axiom/jaxen-testsuite/1.3.0-20180104.230239-464/jaxen-testsuite-1.3.0-20180104.230239-464-javadoc.jar
[Fast Archiver] Compressed 251.97 KB of artifacts by 25.4% relative to #2927
[JENKINS] Archiving <https://builds.apache.org/job/axiom-trunk/ws/axiom/systests/eclipse-tests/pom.xml>
to org.apache.ws.commons.axiom/eclipse-tests/1.3.0-SNAPSHOT/eclipse-tests-1.3.0-SNAPSHOT.pom
[JENKINS] Archiving <https://builds.apache.org/job/axiom-trunk/ws/axiom/systests/eclipse-tests/target/it/project/target/jacoco.exec>
to org.apache.ws.commons.axiom/eclipse-tests/1.3.0-SNAPSHOT/eclipse-tests-1.3.0-SNAPSHOT-jacoco.exec
[JENKINS] Archiving <https://builds.apache.org/job/axiom-trunk/ws/axiom/aspects/shared-aspects/pom.xml>
to org.apache.ws.commons.axiom/shared-aspects/1.3.0-SNAPSHOT/shared-aspects-1.3.0-SNAPSHOT.pom
[JENKINS] Archiving <https://builds.apache.org/job/axiom-trunk/ws/axiom/aspects/shared-aspects/target/shared-aspects-1.3.0-SNAPSHOT.jar>
to org.apache.ws.commons.axiom/shared-aspects/1.3.0-20180104.230136-466/shared-aspects-1.3.0-20180104.230136-466.jar
[JENKINS] Archiving <https://builds.apache.org/job/axiom-trunk/ws/axiom/aspects/shared-aspects/target/shared-aspects-1.3.0-SNAPSHOT-sources.jar>
to org.apache.ws.commons.axiom/shared-aspects/1.3.0-20180104.230136-466/shared-aspects-1.3.0-20180104.230136-466-sources.jar
[JENKINS] Archiving <https://builds.apache.org/job/axiom-trunk/ws/axiom/aspects/shared-aspects/target/shared-aspects-1.3.0-SNAPSHOT-javadoc.jar>
to org.apache.ws.commons.axiom/shared-aspects/1.3.0-20180104.230136-466/shared-aspects-1.3.0-20180104.230136-466-javadoc.jar
[JENKINS] Archiving <https://builds.apache.org/job/axiom-trunk/ws/axiom/axiom-api/pom.xml>
to org.apache.ws.commons.axiom/axiom-api/1.3.0-SNAPSHOT/axiom-api-1.3.0-SNAPSHOT.pom
[JENKINS] Archiving <https://builds.apache.org/job/axiom-trunk/ws/axiom/axiom-api/target/axiom-api-1.3.0-SNAPSHOT.jar>
to org.apache.ws.commons.axiom/axiom-api/1.3.0-20180104.230024-466/axiom-api-1.3.0-20180104.230024-466.jar
[JENKINS] Archiving <https://builds.apache.org/job/axiom-trunk/ws/axiom/axiom-api/target/axiom-api-1.3.0-SNAPSHOT-sources.jar>
to org.apache.ws.commons.axiom/axiom-api/1.3.0-20180104.230024-466/axiom-api-1.3.0-20180104.230024-466-sources.jar
[JENKINS] Archiving <https://builds.apache.org/job/axiom-trunk/ws/axiom/axiom-api/target/axiom-api-1.3.0-SNAPSHOT-javadoc.jar>
to org.apache.ws.commons.axiom/axiom-api/1.3.0-20180104.230024-466/axiom-api-1.3.0-20180104.230024-466-javadoc.jar
[JENKINS] Archiving <https://builds.apache.org/job/axiom-trunk/ws/axiom/axiom-api/target/jacoco.exec>
to org.apache.ws.commons.axiom/axiom-api/1.3.0-20180104.230024-466/axiom-api-1.3.0-20180104.230024-466-jacoco.exec
[JENKINS] Archiving <https://builds.apache.org/job/axiom-trunk/ws/axiom/buildutils/shade-axiom-xml/pom.xml>
to org.apache.ws.commons.axiom/shade-axiom-xml/1.3.0-SNAPSHOT/shade-axiom-xml-1.3.0-SNAPSHOT.pom
[JENKINS] Archiving <https://builds.apache.org/job/axiom-trunk/ws/axiom/buildutils/shade-axiom-xml/target/shade-axiom-xml-1.3.0-SNAPSHOT.jar>
to org.apache.ws.commons.axiom/shade-axiom-xml/1.3.0-20180104.225516-471/shade-axiom-xml-1.3.0-20180104.225516-471.jar
[JENKINS] Archiving <https://builds.apache.org/job/axiom-trunk/ws/axiom/buildutils/shade-axiom-xml/target/shade-axiom-xml-1.3.0-SNAPSHOT-sources.jar>
to org.apache.ws.commons.axiom/shade-axiom-xml/1.3.0-20180104.225516-471/shade-axiom-xml-1.3.0-20180104.225516-471-sources.jar
[JENKINS] Archiving <https://builds.apache.org/job/axiom-trunk/ws/axiom/buildutils/shade-axiom-xml/target/shade-axiom-xml-1.3.0-SNAPSHOT-javadoc.jar>
to org.apache.ws.commons.axiom/shade-axiom-xml/1.3.0-20180104.225516-471/shade-axiom-xml-1.3.0-20180104.225516-471-javadoc.jar
[JENKINS] Archiving <https://builds.apache.org/job/axiom-trunk/ws/axiom/testing/dom-testsuite/pom.xml>
to org.apache.ws.commons.axiom/dom-testsuite/1.3.0-SNAPSHOT/dom-testsuite-1.3.0-SNAPSHOT.pom
[JENKINS] Archiving <https://builds.apache.org/job/axiom-trunk/ws/axiom/testing/dom-testsuite/target/dom-testsuite-1.3.0-SNAPSHOT.jar>
to org.apache.ws.commons.axiom/dom-testsuite/1.3.0-20180104.230619-463/dom-testsuite-1.3.0-20180104.230619-463.jar
[JENKINS] Archiving <https://builds.apache.org/job/axiom-trunk/ws/axiom/testing/dom-testsuite/target/dom-testsuite-1.3.0-SNAPSHOT-sources.jar>
to org.apache.ws.commons.axiom/dom-testsuite/1.3.0-20180104.230619-463/dom-testsuite-1.3.0-20180104.230619-463-sources.jar
[JENKINS] Archiving <https://builds.apache.org/job/axiom-trunk/ws/axiom/testing/dom-testsuite/target/dom-testsuite-1.3.0-SNAPSHOT-javadoc.jar>
to org.apache.ws.commons.axiom/dom-testsuite/1.3.0-20180104.230619-463/dom-testsuite-1.3.0-20180104.230619-463-javadoc.jar
[JENKINS] Archiving <https://builds.apache.org/job/axiom-trunk/ws/axiom/testing/dom-testsuite/target/jacoco.exec>
to org.apache.ws.commons.axiom/dom-testsuite/1.3.0-20180104.230619-463/dom-testsuite-1.3.0-20180104.230619-463-jacoco.exec
[JENKINS] Archiving <https://builds.apache.org/job/axiom-trunk/ws/axiom/implementations/axiom-impl/pom.xml>
to org.apache.ws.commons.axiom/axiom-impl/1.3.0-SNAPSHOT/axiom-impl-1.3.0-SNAPSHOT.pom
[JENKINS] Archiving <https://builds.apache.org/job/axiom-trunk/ws/axiom/implementations/axiom-impl/target/axiom-impl-1.3.0-SNAPSHOT.jar>
to org.apache.ws.commons.axiom/axiom-impl/1.3.0-20180104.230505-463/axiom-impl-1.3.0-20180104.230505-463.jar
[JENKINS] Archiving <https://builds.apache.org/job/axiom-trunk/ws/axiom/implementations/axiom-impl/target/axiom-impl-1.3.0-SNAPSHOT-sources.jar>
to org.apache.ws.commons.axiom/axiom-impl/1.3.0-20180104.230505-463/axiom-impl-1.3.0-20180104.230505-463-sources.jar
[JENKINS] Archiving <https://builds.apache.org/job/axiom-trunk/ws/axiom/implementations/axiom-impl/target/axiom-impl-1.3.0-SNAPSHOT-javadoc.jar>
to org.apache.ws.commons.axiom/axiom-impl/1.3.0-20180104.230505-463/axiom-impl-1.3.0-20180104.230505-463-javadoc.jar
[JENKINS] Archiving <https://builds.apache.org/job/axiom-trunk/ws/axiom/implementations/axiom-impl/target/jacoco.exec>
to org.apache.ws.commons.axiom/axiom-impl/1.3.0-20180104.230505-463/axiom-impl-1.3.0-20180104.230505-463-jacoco.exec
[JENKINS] Archiving <https://builds.apache.org/job/axiom-trunk/ws/axiom/systests/wildfly-tests/pom.xml>
to org.apache.ws.commons.axiom/wildfly-tests/1.3.0-SNAPSHOT/wildfly-tests-1.3.0-SNAPSHOT.pom
[JENKINS] Archiving <https://builds.apache.org/job/axiom-trunk/ws/axiom/systests/wildfly-tests/target/wildfly-tests-1.3.0-SNAPSHOT.jar>
to org.apache.ws.commons.axiom/wildfly-tests/1.3.0-SNAPSHOT/wildfly-tests-1.3.0-SNAPSHOT.jar
[JENKINS] Archiving <https://builds.apache.org/job/axiom-trunk/ws/axiom/systests/wildfly-tests/target/wildfly-tests-1.3.0-SNAPSHOT-sources.jar>
to org.apache.ws.commons.axiom/wildfly-tests/1.3.0-SNAPSHOT/wildfly-tests-1.3.0-SNAPSHOT-sources.jar
[JENKINS] Archiving <https://builds.apache.org/job/axiom-trunk/ws/axiom/systests/wildfly-tests/target/jacoco.exec>
to org.apache.ws.commons.axiom/wildfly-tests/1.3.0-SNAPSHOT/wildfly-tests-1.3.0-SNAPSHOT-jacoco.exec
[JENKINS] Archiving <https://builds.apache.org/job/axiom-trunk/ws/axiom/components/core-streams/pom.xml>
to org.apache.ws.commons.axiom/core-streams/1.3.0-SNAPSHOT/core-streams-1.3.0-SNAPSHOT.pom
[JENKINS] Archiving <https://builds.apache.org/job/axiom-trunk/ws/axiom/components/core-streams/target/core-streams-1.3.0-SNAPSHOT.jar>
to org.apache.ws.commons.axiom/core-streams/1.3.0-20180104.230050-77/core-streams-1.3.0-20180104.230050-77.jar
[JENKINS] Archiving <https://builds.apache.org/job/axiom-trunk/ws/axiom/components/core-streams/target/core-streams-1.3.0-SNAPSHOT-sources.jar>
to org.apache.ws.commons.axiom/core-streams/1.3.0-20180104.230050-77/core-streams-1.3.0-20180104.230050-77-sources.jar
[JENKINS] Archiving <https://builds.apache.org/job/axiom-trunk/ws/axiom/components/core-streams/target/core-streams-1.3.0-SNAPSHOT-javadoc.jar>
to org.apache.ws.commons.axiom/core-streams/1.3.0-20180104.230050-77/core-streams-1.3.0-20180104.230050-77-javadoc.jar
[JENKINS] Archiving <https://builds.apache.org/job/axiom-trunk/ws/axiom/components/core-streams/target/jacoco.exec>
to org.apache.ws.commons.axiom/core-streams/1.3.0-20180104.230050-77/core-streams-1.3.0-20180104.230050-77-jacoco.exec
[JENKINS] Archiving <https://builds.apache.org/job/axiom-trunk/ws/axiom/testing/testutils/pom.xml>
to org.apache.ws.commons.axiom/testutils/1.3.0-SNAPSHOT/testutils-1.3.0-SNAPSHOT.pom
[JENKINS] Archiving <https://builds.apache.org/job/axiom-trunk/ws/axiom/testing/testutils/target/testutils-1.3.0-SNAPSHOT.jar>
to org.apache.ws.commons.axiom/testutils/1.3.0-20180104.225716-467/testutils-1.3.0-20180104.225716-467.jar
[JENKINS] Archiving <https://builds.apache.org/job/axiom-trunk/ws/axiom/testing/testutils/target/testutils-1.3.0-SNAPSHOT-sources.jar>
to org.apache.ws.commons.axiom/testutils/1.3.0-20180104.225716-467/testutils-1.3.0-20180104.225716-467-sources.jar
[JENKINS] Archiving <https://builds.apache.org/job/axiom-trunk/ws/axiom/testing/testutils/target/testutils-1.3.0-SNAPSHOT-javadoc.jar>
to org.apache.ws.commons.axiom/testutils/1.3.0-20180104.225716-467/testutils-1.3.0-20180104.225716-467-javadoc.jar
[JENKINS] Archiving <https://builds.apache.org/job/axiom-trunk/ws/axiom/testing/testutils/target/jacoco.exec>
to org.apache.ws.commons.axiom/testutils/1.3.0-20180104.225716-467/testutils-1.3.0-20180104.225716-467-jacoco.exec
[JENKINS] Archiving <https://builds.apache.org/job/axiom-trunk/ws/axiom/testing/xml-truth/pom.xml>
to org.apache.ws.commons.axiom/xml-truth/1.3.0-SNAPSHOT/xml-truth-1.3.0-SNAPSHOT.pom
[JENKINS] Archiving <https://builds.apache.org/job/axiom-trunk/ws/axiom/testing/xml-truth/target/xml-truth-1.3.0-SNAPSHOT.jar>
to org.apache.ws.commons.axiom/xml-truth/1.3.0-20180104.225817-466/xml-truth-1.3.0-20180104.225817-466.jar
[JENKINS] Archiving <https://builds.apache.org/job/axiom-trunk/ws/axiom/testing/xml-truth/target/xml-truth-1.3.0-SNAPSHOT-sources.jar>
to org.apache.ws.commons.axiom/xml-truth/1.3.0-20180104.225817-466/xml-truth-1.3.0-20180104.225817-466-sources.jar
[JENKINS] Archiving <https://builds.apache.org/job/axiom-trunk/ws/axiom/testing/xml-truth/target/xml-truth-1.3.0-SNAPSHOT-javadoc.jar>
to org.apache.ws.commons.axiom/xml-truth/1.3.0-20180104.225817-466/xml-truth-1.3.0-20180104.225817-466-javadoc.jar
[JENKINS] Archiving <https://builds.apache.org/job/axiom-trunk/ws/axiom/testing/xml-truth/target/jacoco.exec>
to org.apache.ws.commons.axiom/xml-truth/1.3.0-20180104.225817-466/xml-truth-1.3.0-20180104.225817-466-jacoco.exec
[JENKINS] Archiving <https://builds.apache.org/job/axiom-trunk/ws/axiom/testing/axiom-testsuite/pom.xml>
to org.apache.ws.commons.axiom/axiom-testsuite/1.3.0-SNAPSHOT/axiom-testsuite-1.3.0-SNAPSHOT.pom
[JENKINS] Archiving <https://builds.apache.org/job/axiom-trunk/ws/axiom/testing/axiom-testsuite/target/axiom-testsuite-1.3.0-SNAPSHOT.jar>
to org.apache.ws.commons.axiom/axiom-testsuite/1.3.0-20180104.230334-464/axiom-testsuite-1.3.0-20180104.230334-464.jar
[JENKINS] Archiving <https://builds.apache.org/job/axiom-trunk/ws/axiom/testing/axiom-testsuite/target/axiom-testsuite-1.3.0-SNAPSHOT-sources.jar>
to org.apache.ws.commons.axiom/axiom-testsuite/1.3.0-20180104.230334-464/axiom-testsuite-1.3.0-20180104.230334-464-sources.jar
[JENKINS] Archiving <https://builds.apache.org/job/axiom-trunk/ws/axiom/testing/axiom-testsuite/target/axiom-testsuite-1.3.0-SNAPSHOT-javadoc.jar>
to org.apache.ws.commons.axiom/axiom-testsuite/1.3.0-20180104.230334-464/axiom-testsuite-1.3.0-20180104.230334-464-javadoc.jar
[JENKINS] Archiving <https://builds.apache.org/job/axiom-trunk/ws/axiom/testing/multiton/pom.xml>
to org.apache.ws.commons.axiom/multiton/1.3.0-SNAPSHOT/multiton-1.3.0-SNAPSHOT.pom
[JENKINS] Archiving <https://builds.apache.org/job/axiom-trunk/ws/axiom/testing/multiton/target/multiton-1.3.0-SNAPSHOT.jar>
to org.apache.ws.commons.axiom/multiton/1.3.0-20180104.225606-467/multiton-1.3.0-20180104.225606-467.jar
[JENKINS] Archiving <https://builds.apache.org/job/axiom-trunk/ws/axiom/testing/multiton/target/multiton-1.3.0-SNAPSHOT-sources.jar>
to org.apache.ws.commons.axiom/multiton/1.3.0-20180104.225606-467/multiton-1.3.0-20180104.225606-467-sources.jar
[JENKINS] Archiving <https://builds.apache.org/job/axiom-trunk/ws/axiom/testing/multiton/target/multiton-1.3.0-SNAPSHOT-javadoc.jar>
to org.apache.ws.commons.axiom/multiton/1.3.0-20180104.225606-467/multiton-1.3.0-20180104.225606-467-javadoc.jar
[JENKINS] Archiving <https://builds.apache.org/job/axiom-trunk/ws/axiom/apidocs/pom.xml>
to org.apache.ws.commons.axiom/apidocs/1.3.0-SNAPSHOT/apidocs-1.3.0-SNAPSHOT.pom
[JENKINS] Archiving <https://builds.apache.org/job/axiom-trunk/ws/axiom/apidocs/target/apidocs-1.3.0-SNAPSHOT-javadoc.zip>
to org.apache.ws.commons.axiom/apidocs/1.3.0-SNAPSHOT/apidocs-1.3.0-SNAPSHOT-javadoc.zip
[JENKINS] Archiving <https://builds.apache.org/job/axiom-trunk/ws/axiom/axiom-compat/pom.xml>
to org.apache.ws.commons.axiom/axiom-compat/1.3.0-SNAPSHOT/axiom-compat-1.3.0-SNAPSHOT.pom
[JENKINS] Archiving <https://builds.apache.org/job/axiom-trunk/ws/axiom/axiom-compat/target/axiom-compat-1.3.0-SNAPSHOT.jar>
to org.apache.ws.commons.axiom/axiom-compat/1.3.0-20180104.230817-459/axiom-compat-1.3.0-20180104.230817-459.jar
[JENKINS] Archiving <https://builds.apache.org/job/axiom-trunk/ws/axiom/axiom-compat/target/axiom-compat-1.3.0-SNAPSHOT-sources.jar>
to org.apache.ws.commons.axiom/axiom-compat/1.3.0-20180104.230817-459/axiom-compat-1.3.0-20180104.230817-459-sources.jar
[JENKINS] Archiving <https://builds.apache.org/job/axiom-trunk/ws/axiom/axiom-compat/target/axiom-compat-1.3.0-SNAPSHOT-javadoc.jar>
to org.apache.ws.commons.axiom/axiom-compat/1.3.0-20180104.230817-459/axiom-compat-1.3.0-20180104.230817-459-javadoc.jar
[JENKINS] Archiving <https://builds.apache.org/job/axiom-trunk/ws/axiom/axiom-compat/target/jacoco.exec>
to org.apache.ws.commons.axiom/axiom-compat/1.3.0-20180104.230817-459/axiom-compat-1.3.0-20180104.230817-459-jacoco.exec
[JENKINS] Archiving <https://builds.apache.org/job/axiom-trunk/ws/axiom/testing/xml-testsuite/pom.xml>
to org.apache.ws.commons.axiom/xml-testsuite/1.3.0-SNAPSHOT/xml-testsuite-1.3.0-SNAPSHOT.pom
[JENKINS] Archiving <https://builds.apache.org/job/axiom-trunk/ws/axiom/testing/xml-testsuite/target/xml-testsuite-1.3.0-SNAPSHOT.jar>
to org.apache.ws.commons.axiom/xml-testsuite/1.3.0-20180104.225735-467/xml-testsuite-1.3.0-20180104.225735-467.jar
[JENKINS] Archiving <https://builds.apache.org/job/axiom-trunk/ws/axiom/testing/xml-testsuite/target/xml-testsuite-1.3.0-SNAPSHOT-sources.jar>
to org.apache.ws.commons.axiom/xml-testsuite/1.3.0-20180104.225735-467/xml-testsuite-1.3.0-20180104.225735-467-sources.jar
[JENKINS] Archiving <https://builds.apache.org/job/axiom-trunk/ws/axiom/testing/xml-testsuite/target/xml-testsuite-1.3.0-SNAPSHOT-javadoc.jar>
to org.apache.ws.commons.axiom/xml-testsuite/1.3.0-20180104.225735-467/xml-testsuite-1.3.0-20180104.225735-467-javadoc.jar
[JENKINS] Archiving <https://builds.apache.org/job/axiom-trunk/ws/axiom/systests/old-tests/pom.xml>
to org.apache.ws.commons.axiom/old-tests/1.3.0-SNAPSHOT/old-tests-1.3.0-SNAPSHOT.pom
[JENKINS] Archiving <https://builds.apache.org/job/axiom-trunk/ws/axiom/systests/old-tests/target/old-tests-1.3.0-SNAPSHOT.jar>
to org.apache.ws.commons.axiom/old-tests/1.3.0-SNAPSHOT/old-tests-1.3.0-SNAPSHOT.jar
[JENKINS] Archiving <https://builds.apache.org/job/axiom-trunk/ws/axiom/systests/old-tests/target/old-tests-1.3.0-SNAPSHOT-sources.jar>
to org.apache.ws.commons.axiom/old-tests/1.3.0-SNAPSHOT/old-tests-1.3.0-SNAPSHOT-sources.jar
[JENKINS] Archiving <https://builds.apache.org/job/axiom-trunk/ws/axiom/systests/old-tests/target/jacoco.exec>
to org.apache.ws.commons.axiom/old-tests/1.3.0-SNAPSHOT/old-tests-1.3.0-SNAPSHOT-jacoco.exec
[JENKINS] Archiving <https://builds.apache.org/job/axiom-trunk/ws/axiom/systests/compat-tests/pom.xml>
to org.apache.ws.commons.axiom/compat-tests/1.3.0-SNAPSHOT/compat-tests-1.3.0-SNAPSHOT.pom
[JENKINS] Archiving <https://builds.apache.org/job/axiom-trunk/ws/axiom/systests/compat-tests/target/compat-tests-1.3.0-SNAPSHOT.jar>
to org.apache.ws.commons.axiom/compat-tests/1.3.0-SNAPSHOT/compat-tests-1.3.0-SNAPSHOT.jar
[JENKINS] Archiving <https://builds.apache.org/job/axiom-trunk/ws/axiom/systests/compat-tests/target/compat-tests-1.3.0-SNAPSHOT-sources.jar>
to org.apache.ws.commons.axiom/compat-tests/1.3.0-SNAPSHOT/compat-tests-1.3.0-SNAPSHOT-sources.jar
[JENKINS] Archiving <https://builds.apache.org/job/axiom-trunk/ws/axiom/systests/compat-tests/target/jacoco.exec>
to org.apache.ws.commons.axiom/compat-tests/1.3.0-SNAPSHOT/compat-tests-1.3.0-SNAPSHOT-jacoco.exec
[JENKINS] Archiving <https://builds.apache.org/job/axiom-trunk/ws/axiom/components/pom.xml>
to org.apache.ws.commons.axiom/components/1.3.0-SNAPSHOT/components-1.3.0-SNAPSHOT.pom
[JENKINS] Archiving <https://builds.apache.org/job/axiom-trunk/ws/axiom/samples/pom.xml>
to org.apache.ws.commons.axiom/samples/1.3.0-SNAPSHOT/samples-1.3.0-SNAPSHOT.pom
[JENKINS] Archiving <https://builds.apache.org/job/axiom-trunk/ws/axiom/samples/target/samples-1.3.0-SNAPSHOT.jar>
to org.apache.ws.commons.axiom/samples/1.3.0-SNAPSHOT/samples-1.3.0-SNAPSHOT.jar
[JENKINS] Archiving <https://builds.apache.org/job/axiom-trunk/ws/axiom/samples/target/samples-1.3.0-SNAPSHOT-sources.jar>
to org.apache.ws.commons.axiom/samples/1.3.0-SNAPSHOT/samples-1.3.0-SNAPSHOT-sources.jar
[JENKINS] Archiving <https://builds.apache.org/job/axiom-trunk/ws/axiom/samples/target/jacoco.exec>
to org.apache.ws.commons.axiom/samples/1.3.0-SNAPSHOT/samples-1.3.0-SNAPSHOT-jacoco.exec
[JENKINS] Archiving <https://builds.apache.org/job/axiom-trunk/ws/axiom/buildutils/pom.xml>
to org.apache.ws.commons.axiom/buildutils/1.3.0-SNAPSHOT/buildutils-1.3.0-SNAPSHOT.pom
[JENKINS] Archiving <https://builds.apache.org/job/axiom-trunk/ws/axiom/axiom-all/pom.xml>
to org.apache.ws.commons.axiom/axiom-all/1.3.0-SNAPSHOT/axiom-all-1.3.0-SNAPSHOT.pom
[JENKINS] Archiving <https://builds.apache.org/job/axiom-trunk/ws/axiom/axiom-all/target/axiom-all-1.3.0-SNAPSHOT.jar>
to org.apache.ws.commons.axiom/axiom-all/1.3.0-SNAPSHOT/axiom-all-1.3.0-SNAPSHOT.jar
[JENKINS] Archiving <https://builds.apache.org/job/axiom-trunk/ws/axiom/axiom-all/target/axiom-all-1.3.0-SNAPSHOT-sources.jar>
to org.apache.ws.commons.axiom/axiom-all/1.3.0-SNAPSHOT/axiom-all-1.3.0-SNAPSHOT-sources.jar
[JENKINS] Archiving <https://builds.apache.org/job/axiom-trunk/ws/axiom/aspects/pom.xml>
to org.apache.ws.commons.axiom/aspects/1.3.0-SNAPSHOT/aspects-1.3.0-SNAPSHOT.pom
Sending e-mails to: dev@ws.apache.org
channel stopped


---------------------------------------------------------------------
To unsubscribe, e-mail: dev-unsubscribe@ws.apache.org
For additional commands, e-mail: dev-help@ws.apache.org


Mime
View raw message