ws-dev mailing list archives

Site index · List index
Message view « Date » · « Thread »
Top « Date » · « Thread »
From Apache Jenkins Server <jenk...@builds.apache.org>
Subject Build failed in Jenkins: axiom-1.2.x #92
Date Tue, 08 Jan 2019 22:48:26 GMT
See <https://builds.apache.org/job/axiom-1.2.x/92/display/redirect?page=changes>

Changes:

[veithen] [maven-release-plugin] prepare for next development iteration

[veithen] [maven-release-plugin] prepare release 1.2.22

[veithen] Merge r1850800 to the 1.2 branch.

[veithen] Merge r1850798 to the 1.2 branch.

------------------------------------------
[...truncated 3.10 MB...]
[INFO] --- hermetic-maven-plugin:0.1.0:generate-policy (default) @ distribution ---
[INFO] 
[INFO] --- gmavenplus-plugin:1.5:execute (generate-release-note) @ distribution ---
[INFO] Using Groovy 2.4.4 to perform execute.
[INFO] ------------------------------------------------------------------------
[INFO] Reactor Summary:
[INFO] 
[INFO] Axiom .............................................. SUCCESS [ 28.150 s]
[INFO] Build utilities .................................... SUCCESS [  7.962 s]
[INFO] JAR Resource Bundle ................................ SUCCESS [ 15.059 s]
[INFO] Resource Transformer for META-INF/axiom.xml files .. SUCCESS [ 17.138 s]
[INFO] Resource Transformer for OSGi Manifests ............ SUCCESS [ 16.066 s]
[INFO] javadoc-postprocessor-plugin ....................... SUCCESS [ 20.332 s]
[INFO] no-package-cycles-enforcer-rule .................... SUCCESS [ 15.816 s]
[INFO] Testing ............................................ SUCCESS [  9.520 s]
[INFO] Multiton pattern implementation .................... SUCCESS [ 15.643 s]
[INFO] Axiom Test Utilities ............................... SUCCESS [01:14 min]
[INFO] XML Test Suite ..................................... SUCCESS [ 17.435 s]
[INFO] jaxp-testsuite ..................................... SUCCESS [ 16.031 s]
[INFO] Google Truth extension for XML ..................... SUCCESS [ 20.817 s]
[INFO] components ......................................... SUCCESS [  7.491 s]
[INFO] xml-utils .......................................... SUCCESS [ 19.536 s]
[INFO] SOAP Test Suite .................................... SUCCESS [ 18.737 s]
[INFO] Axiom API .......................................... SUCCESS [01:27 min]
[INFO] Aspects ............................................ SUCCESS [  9.026 s]
[INFO] Core Aspects ....................................... SUCCESS [ 19.532 s]
[INFO] Shared Aspects ..................................... SUCCESS [ 15.384 s]
[INFO] OM Aspects ......................................... SUCCESS [ 29.950 s]
[INFO] Google Truth extension for Axiom ................... SUCCESS [ 16.030 s]
[INFO] Jaxen Test Suite ................................... SUCCESS [ 16.807 s]
[INFO] Axiom Implementation Test Suite .................... SUCCESS [ 37.691 s]
[INFO] Implementations .................................... SUCCESS [  9.767 s]
[INFO] LLOM ............................................... SUCCESS [02:25 min]
[INFO] DOM Aspects ........................................ SUCCESS [ 19.055 s]
[INFO] DOM Test Suite ..................................... SUCCESS [ 53.430 s]
[INFO] DOOM ............................................... SUCCESS [02:45 min]
[INFO] Axiom Compatibility Classes ........................ SUCCESS [ 21.251 s]
[INFO] Axiom JAXB Integration ............................. SUCCESS [ 20.217 s]
[INFO] Axiom C14N ......................................... SUCCESS [ 20.719 s]
[INFO] Axiom Uber-JAR ..................................... SUCCESS [  6.336 s]
[INFO] Samples ............................................ SUCCESS [ 16.204 s]
[INFO] System Tests ....................................... SUCCESS [  4.055 s]
[INFO] Cross OM Tests ..................................... SUCCESS [  8.080 s]
[INFO] Eclipse Tests ...................................... SUCCESS [ 44.503 s]
[INFO] JAX-WS Tests ....................................... SUCCESS [ 13.543 s]
[INFO] JBoss Tests ........................................ SUCCESS [ 30.634 s]
[INFO] Axiom Test Suite (old) ............................. SUCCESS [  9.592 s]
[INFO] Axiom OSGi Tests ................................... SUCCESS [ 14.725 s]
[INFO] Spring-WS Test Suite ............................... SUCCESS [ 35.781 s]
[INFO] Spring WS Tests .................................... SUCCESS [ 20.038 s]
[INFO] WSS4J Tests ........................................ SUCCESS [ 12.588 s]
[INFO] Developer Guide .................................... SUCCESS [ 12.944 s]
[INFO] User Guide ......................................... SUCCESS [  6.617 s]
[INFO] Javadoc ............................................ SUCCESS [ 12.149 s]
[INFO] FOM Aspects ........................................ SUCCESS [ 18.833 s]
[INFO] FOM Test Suite ..................................... SUCCESS [ 19.513 s]
[INFO] Abdera Model (FOM) Implementation .................. SUCCESS [ 44.875 s]
[INFO] Distribution ....................................... FAILURE [  3.090 s]
[INFO] SAAJ Test Suite .................................... SKIPPED
[INFO] ------------------------------------------------------------------------
[INFO] BUILD FAILURE
[INFO] ------------------------------------------------------------------------
[INFO] Total time: 26:39 min
[INFO] Finished at: 2019-01-08T22:47:15+00:00
[INFO] Final Memory: 242M/490M
[INFO] ------------------------------------------------------------------------
[ERROR] Failed to execute goal org.codehaus.gmavenplus:gmavenplus-plugin:1.5:execute (generate-release-note)
on project distribution: Error occurred while calling a method on a Groovy class from classpath.
InvocationTargetException: <https://builds.apache.org/job/axiom-1.2.x/ws/axiom/distribution/../src/site/markdown/release-notes/1.2.23.md>
(No such file or directory) -> [Help 1]
[ERROR] 
[ERROR] To see the full stack trace of the errors, re-run Maven with the -e switch.
[ERROR] Re-run Maven using the -X switch to enable full debug logging.
[ERROR] 
[ERROR] For more information about the errors and possible solutions, please read the following
articles:
[ERROR] [Help 1] http://cwiki.apache.org/confluence/display/MAVEN/MojoExecutionException
[ERROR] 
[ERROR] After correcting the problems, you can resume the build with the command
[ERROR]   mvn <goals> -rf :distribution
[JENKINS] Archiving <https://builds.apache.org/job/axiom-1.2.x/ws/axiom/aspects/core-aspects/pom.xml>
to org.apache.ws.commons.axiom/core-aspects/1.2.23-SNAPSHOT/core-aspects-1.2.23-SNAPSHOT.pom
[JENKINS] Archiving <https://builds.apache.org/job/axiom-1.2.x/ws/axiom/aspects/core-aspects/target/core-aspects-1.2.23-SNAPSHOT.jar>
to org.apache.ws.commons.axiom/core-aspects/1.2.23-20190108.222854-1/core-aspects-1.2.23-20190108.222854-1.jar
[JENKINS] Archiving <https://builds.apache.org/job/axiom-1.2.x/ws/axiom/aspects/core-aspects/target/core-aspects-1.2.23-SNAPSHOT-sources.jar>
to org.apache.ws.commons.axiom/core-aspects/1.2.23-20190108.222854-1/core-aspects-1.2.23-20190108.222854-1-sources.jar
[JENKINS] Archiving <https://builds.apache.org/job/axiom-1.2.x/ws/axiom/aspects/core-aspects/target/core-aspects-1.2.23-SNAPSHOT-javadoc.jar>
to org.apache.ws.commons.axiom/core-aspects/1.2.23-20190108.222854-1/core-aspects-1.2.23-20190108.222854-1-javadoc.jar
[JENKINS] Archiving <https://builds.apache.org/job/axiom-1.2.x/ws/axiom/components/xml-utils/pom.xml>
to org.apache.ws.commons.axiom/xml-utils/1.2.23-SNAPSHOT/xml-utils-1.2.23-SNAPSHOT.pom
[JENKINS] Archiving <https://builds.apache.org/job/axiom-1.2.x/ws/axiom/components/xml-utils/target/xml-utils-1.2.23-SNAPSHOT.jar>
to org.apache.ws.commons.axiom/xml-utils/1.2.23-20190108.222625-1/xml-utils-1.2.23-20190108.222625-1.jar
[JENKINS] Archiving <https://builds.apache.org/job/axiom-1.2.x/ws/axiom/components/xml-utils/target/xml-utils-1.2.23-SNAPSHOT-sources.jar>
to org.apache.ws.commons.axiom/xml-utils/1.2.23-20190108.222625-1/xml-utils-1.2.23-20190108.222625-1-sources.jar
[JENKINS] Archiving <https://builds.apache.org/job/axiom-1.2.x/ws/axiom/components/xml-utils/target/xml-utils-1.2.23-SNAPSHOT-javadoc.jar>
to org.apache.ws.commons.axiom/xml-utils/1.2.23-20190108.222625-1/xml-utils-1.2.23-20190108.222625-1-javadoc.jar
[JENKINS] Archiving <https://builds.apache.org/job/axiom-1.2.x/ws/axiom/axiom-c14n/pom.xml>
to org.apache.ws.commons.axiom/axiom-c14n/1.2.23-SNAPSHOT/axiom-c14n-1.2.23-SNAPSHOT.pom
[JENKINS] Archiving <https://builds.apache.org/job/axiom-1.2.x/ws/axiom/axiom-c14n/target/axiom-c14n-1.2.23-SNAPSHOT.jar>
to org.apache.ws.commons.axiom/axiom-c14n/1.2.23-20190108.223914-1/axiom-c14n-1.2.23-20190108.223914-1.jar
[JENKINS] Archiving <https://builds.apache.org/job/axiom-1.2.x/ws/axiom/axiom-c14n/target/axiom-c14n-1.2.23-SNAPSHOT-sources.jar>
to org.apache.ws.commons.axiom/axiom-c14n/1.2.23-20190108.223914-1/axiom-c14n-1.2.23-20190108.223914-1-sources.jar
[JENKINS] Archiving <https://builds.apache.org/job/axiom-1.2.x/ws/axiom/axiom-c14n/target/axiom-c14n-1.2.23-SNAPSHOT-javadoc.jar>
to org.apache.ws.commons.axiom/axiom-c14n/1.2.23-20190108.223914-1/axiom-c14n-1.2.23-20190108.223914-1-javadoc.jar
[JENKINS] Archiving <https://builds.apache.org/job/axiom-1.2.x/ws/axiom/systests/wss4j-tests/pom.xml>
to org.apache.ws.commons.axiom/wss4j-tests/1.2.23-SNAPSHOT/wss4j-tests-1.2.23-SNAPSHOT.pom
[JENKINS] Archiving <https://builds.apache.org/job/axiom-1.2.x/ws/axiom/systests/wss4j-tests/target/wss4j-tests-1.2.23-SNAPSHOT.jar>
to org.apache.ws.commons.axiom/wss4j-tests/1.2.23-SNAPSHOT/wss4j-tests-1.2.23-SNAPSHOT.jar
[JENKINS] Archiving <https://builds.apache.org/job/axiom-1.2.x/ws/axiom/systests/wss4j-tests/target/wss4j-tests-1.2.23-SNAPSHOT-sources.jar>
to org.apache.ws.commons.axiom/wss4j-tests/1.2.23-SNAPSHOT/wss4j-tests-1.2.23-SNAPSHOT-sources.jar
[JENKINS] Archiving <https://builds.apache.org/job/axiom-1.2.x/ws/axiom/pom.xml> to
org.apache.ws.commons.axiom/axiom/1.2.23-SNAPSHOT/axiom-1.2.23-SNAPSHOT.pom
[JENKINS] Archiving <https://builds.apache.org/job/axiom-1.2.x/ws/axiom/target/axiom-1.2.23-SNAPSHOT-site.xml>
to org.apache.ws.commons.axiom/axiom/1.2.23-20190108.222103-1/axiom-1.2.23-20190108.222103-1-site.xml
[JENKINS] Archiving <https://builds.apache.org/job/axiom-1.2.x/ws/axiom/testing/soap-testsuite/pom.xml>
to org.apache.ws.commons.axiom/soap-testsuite/1.2.23-SNAPSHOT/soap-testsuite-1.2.23-SNAPSHOT.pom
[JENKINS] Archiving <https://builds.apache.org/job/axiom-1.2.x/ws/axiom/testing/soap-testsuite/target/soap-testsuite-1.2.23-SNAPSHOT.jar>
to org.apache.ws.commons.axiom/soap-testsuite/1.2.23-20190108.222647-1/soap-testsuite-1.2.23-20190108.222647-1.jar
[JENKINS] Archiving <https://builds.apache.org/job/axiom-1.2.x/ws/axiom/testing/soap-testsuite/target/soap-testsuite-1.2.23-SNAPSHOT-sources.jar>
to org.apache.ws.commons.axiom/soap-testsuite/1.2.23-20190108.222647-1/soap-testsuite-1.2.23-20190108.222647-1-sources.jar
[JENKINS] Archiving <https://builds.apache.org/job/axiom-1.2.x/ws/axiom/testing/soap-testsuite/target/soap-testsuite-1.2.23-SNAPSHOT-javadoc.jar>
to org.apache.ws.commons.axiom/soap-testsuite/1.2.23-20190108.222647-1/soap-testsuite-1.2.23-20190108.222647-1-javadoc.jar
[Fast Archiver] Compressed 400.64 KB of artifacts by 31.9% relative to #91
[JENKINS] Archiving <https://builds.apache.org/job/axiom-1.2.x/ws/axiom/userguide/pom.xml>
to org.apache.ws.commons.axiom/userguide/1.2.23-SNAPSHOT/userguide-1.2.23-SNAPSHOT.pom
[JENKINS] Archiving <https://builds.apache.org/job/axiom-1.2.x/ws/axiom/userguide/target/docbkx/pdf/userguide.pdf>
to org.apache.ws.commons.axiom/userguide/1.2.23-SNAPSHOT/userguide-1.2.23-SNAPSHOT.pdf
[Fast Archiver] Compressed 348.69 KB of artifacts by 64.2% relative to #91
[JENKINS] Archiving <https://builds.apache.org/job/axiom-1.2.x/ws/axiom/devguide/pom.xml>
to org.apache.ws.commons.axiom/devguide/1.2.23-SNAPSHOT/devguide-1.2.23-SNAPSHOT.pom
[JENKINS] Archiving <https://builds.apache.org/job/axiom-1.2.x/ws/axiom/devguide/target/docbkx/pdf/devguide.pdf>
to org.apache.ws.commons.axiom/devguide/1.2.23-SNAPSHOT/devguide-1.2.23-SNAPSHOT.pdf
[Fast Archiver] Compressed 353.35 KB of artifacts by 81.5% relative to #91
[JENKINS] Archiving <https://builds.apache.org/job/axiom-1.2.x/ws/axiom/buildutils/jar-resource-bundle/pom.xml>
to org.apache.ws.commons.axiom/jar-resource-bundle/1.2.23-SNAPSHOT/jar-resource-bundle-1.2.23-SNAPSHOT.pom
[JENKINS] Archiving <https://builds.apache.org/job/axiom-1.2.x/ws/axiom/buildutils/jar-resource-bundle/target/jar-resource-bundle-1.2.23-SNAPSHOT.jar>
to org.apache.ws.commons.axiom/jar-resource-bundle/1.2.23-20190108.222133-1/jar-resource-bundle-1.2.23-20190108.222133-1.jar
[JENKINS] Archiving <https://builds.apache.org/job/axiom-1.2.x/ws/axiom/buildutils/jar-resource-bundle/target/jar-resource-bundle-1.2.23-SNAPSHOT-sources.jar>
to org.apache.ws.commons.axiom/jar-resource-bundle/1.2.23-20190108.222133-1/jar-resource-bundle-1.2.23-20190108.222133-1-sources.jar
[JENKINS] Archiving <https://builds.apache.org/job/axiom-1.2.x/ws/axiom/testing/pom.xml>
to org.apache.ws.commons.axiom/testing/1.2.23-SNAPSHOT/testing-1.2.23-SNAPSHOT.pom
[JENKINS] Archiving <https://builds.apache.org/job/axiom-1.2.x/ws/axiom/testing/target/testing-1.2.23-SNAPSHOT-site.xml>
to org.apache.ws.commons.axiom/testing/1.2.23-20190108.222311-1/testing-1.2.23-20190108.222311-1-site.xml
[JENKINS] Archiving <https://builds.apache.org/job/axiom-1.2.x/ws/axiom/buildutils/javadoc-postprocessor-plugin/pom.xml>
to org.apache.ws.commons.axiom/javadoc-postprocessor-plugin/1.2.23-SNAPSHOT/javadoc-postprocessor-plugin-1.2.23-SNAPSHOT.pom
[JENKINS] Archiving <https://builds.apache.org/job/axiom-1.2.x/ws/axiom/buildutils/javadoc-postprocessor-plugin/target/javadoc-postprocessor-plugin-1.2.23-SNAPSHOT.jar>
to org.apache.ws.commons.axiom/javadoc-postprocessor-plugin/1.2.23-20190108.222234-1/javadoc-postprocessor-plugin-1.2.23-20190108.222234-1.jar
[JENKINS] Archiving <https://builds.apache.org/job/axiom-1.2.x/ws/axiom/buildutils/javadoc-postprocessor-plugin/target/javadoc-postprocessor-plugin-1.2.23-SNAPSHOT-sources.jar>
to org.apache.ws.commons.axiom/javadoc-postprocessor-plugin/1.2.23-20190108.222234-1/javadoc-postprocessor-plugin-1.2.23-20190108.222234-1-sources.jar
[JENKINS] Archiving <https://builds.apache.org/job/axiom-1.2.x/ws/axiom/buildutils/javadoc-postprocessor-plugin/target/javadoc-postprocessor-plugin-1.2.23-SNAPSHOT-javadoc.jar>
to org.apache.ws.commons.axiom/javadoc-postprocessor-plugin/1.2.23-20190108.222234-1/javadoc-postprocessor-plugin-1.2.23-20190108.222234-1-javadoc.jar
[JENKINS] Archiving <https://builds.apache.org/job/axiom-1.2.x/ws/axiom/systests/osgi-tests/pom.xml>
to org.apache.ws.commons.axiom/osgi-tests/1.2.23-SNAPSHOT/osgi-tests-1.2.23-SNAPSHOT.pom
[JENKINS] Archiving <https://builds.apache.org/job/axiom-1.2.x/ws/axiom/systests/osgi-tests/target/osgi-tests-1.2.23-SNAPSHOT.jar>
to org.apache.ws.commons.axiom/osgi-tests/1.2.23-SNAPSHOT/osgi-tests-1.2.23-SNAPSHOT.jar
[JENKINS] Archiving <https://builds.apache.org/job/axiom-1.2.x/ws/axiom/systests/osgi-tests/target/osgi-tests-1.2.23-SNAPSHOT-sources.jar>
to org.apache.ws.commons.axiom/osgi-tests/1.2.23-SNAPSHOT/osgi-tests-1.2.23-SNAPSHOT-sources.jar
[JENKINS] Archiving <https://builds.apache.org/job/axiom-1.2.x/ws/axiom/testing/saaj-testsuite/pom.xml>
to org.apache.ws.commons.axiom/saaj-testsuite/1.2.23-SNAPSHOT/saaj-testsuite-1.2.23-SNAPSHOT.pom
[JENKINS] Archiving <https://builds.apache.org/job/axiom-1.2.x/ws/axiom/systests/cross-om-tests/pom.xml>
to org.apache.ws.commons.axiom/cross-om-tests/1.2.23-SNAPSHOT/cross-om-tests-1.2.23-SNAPSHOT.pom
[JENKINS] Archiving <https://builds.apache.org/job/axiom-1.2.x/ws/axiom/systests/cross-om-tests/target/cross-om-tests-1.2.23-SNAPSHOT.jar>
to org.apache.ws.commons.axiom/cross-om-tests/1.2.23-SNAPSHOT/cross-om-tests-1.2.23-SNAPSHOT.jar
[JENKINS] Archiving <https://builds.apache.org/job/axiom-1.2.x/ws/axiom/systests/cross-om-tests/target/cross-om-tests-1.2.23-SNAPSHOT-sources.jar>
to org.apache.ws.commons.axiom/cross-om-tests/1.2.23-SNAPSHOT/cross-om-tests-1.2.23-SNAPSHOT-sources.jar
[JENKINS] Archiving <https://builds.apache.org/job/axiom-1.2.x/ws/axiom/testing/spring-ws-testsuite/pom.xml>
to org.apache.ws.commons.axiom/spring-ws-testsuite/1.2.23-SNAPSHOT/spring-ws-testsuite-1.2.23-SNAPSHOT.pom
[JENKINS] Archiving <https://builds.apache.org/job/axiom-1.2.x/ws/axiom/testing/spring-ws-testsuite/target/spring-ws-testsuite-1.2.23-SNAPSHOT.jar>
to org.apache.ws.commons.axiom/spring-ws-testsuite/1.2.23-20190108.224251-1/spring-ws-testsuite-1.2.23-20190108.224251-1.jar
[JENKINS] Archiving <https://builds.apache.org/job/axiom-1.2.x/ws/axiom/testing/spring-ws-testsuite/target/spring-ws-testsuite-1.2.23-SNAPSHOT-sources.jar>
to org.apache.ws.commons.axiom/spring-ws-testsuite/1.2.23-20190108.224251-1/spring-ws-testsuite-1.2.23-20190108.224251-1-sources.jar
[JENKINS] Archiving <https://builds.apache.org/job/axiom-1.2.x/ws/axiom/testing/spring-ws-testsuite/target/spring-ws-testsuite-1.2.23-SNAPSHOT-javadoc.jar>
to org.apache.ws.commons.axiom/spring-ws-testsuite/1.2.23-20190108.224251-1/spring-ws-testsuite-1.2.23-20190108.224251-1-javadoc.jar
[JENKINS] Archiving <https://builds.apache.org/job/axiom-1.2.x/ws/axiom/aspects/dom-aspects/pom.xml>
to org.apache.ws.commons.axiom/dom-aspects/1.2.23-SNAPSHOT/dom-aspects-1.2.23-SNAPSHOT.pom
[JENKINS] Archiving <https://builds.apache.org/job/axiom-1.2.x/ws/axiom/aspects/dom-aspects/target/dom-aspects-1.2.23-SNAPSHOT.jar>
to org.apache.ws.commons.axiom/dom-aspects/1.2.23-20190108.223413-1/dom-aspects-1.2.23-20190108.223413-1.jar
[JENKINS] Archiving <https://builds.apache.org/job/axiom-1.2.x/ws/axiom/aspects/dom-aspects/target/dom-aspects-1.2.23-SNAPSHOT-sources.jar>
to org.apache.ws.commons.axiom/dom-aspects/1.2.23-20190108.223413-1/dom-aspects-1.2.23-20190108.223413-1-sources.jar
[JENKINS] Archiving <https://builds.apache.org/job/axiom-1.2.x/ws/axiom/aspects/dom-aspects/target/dom-aspects-1.2.23-SNAPSHOT-javadoc.jar>
to org.apache.ws.commons.axiom/dom-aspects/1.2.23-20190108.223413-1/dom-aspects-1.2.23-20190108.223413-1-javadoc.jar
[JENKINS] Archiving <https://builds.apache.org/job/axiom-1.2.x/ws/axiom/implementations/axiom-dom/pom.xml>
to org.apache.ws.commons.axiom/axiom-dom/1.2.23-SNAPSHOT/axiom-dom-1.2.23-SNAPSHOT.pom
[JENKINS] Archiving <https://builds.apache.org/job/axiom-1.2.x/ws/axiom/implementations/axiom-dom/target/axiom-dom-1.2.23-SNAPSHOT.jar>
to org.apache.ws.commons.axiom/axiom-dom/1.2.23-20190108.223757-1/axiom-dom-1.2.23-20190108.223757-1.jar
[JENKINS] Archiving <https://builds.apache.org/job/axiom-1.2.x/ws/axiom/implementations/axiom-dom/target/axiom-dom-1.2.23-SNAPSHOT-sources.jar>
to org.apache.ws.commons.axiom/axiom-dom/1.2.23-20190108.223757-1/axiom-dom-1.2.23-20190108.223757-1-sources.jar
[JENKINS] Archiving <https://builds.apache.org/job/axiom-1.2.x/ws/axiom/implementations/axiom-dom/target/axiom-dom-1.2.23-SNAPSHOT-javadoc.jar>
to org.apache.ws.commons.axiom/axiom-dom/1.2.23-20190108.223757-1/axiom-dom-1.2.23-20190108.223757-1-javadoc.jar
[JENKINS] Archiving <https://builds.apache.org/job/axiom-1.2.x/ws/axiom/testing/jaxp-testsuite/pom.xml>
to org.apache.ws.commons.axiom/jaxp-testsuite/1.2.23-SNAPSHOT/jaxp-testsuite-1.2.23-SNAPSHOT.pom
[JENKINS] Archiving <https://builds.apache.org/job/axiom-1.2.x/ws/axiom/testing/jaxp-testsuite/target/jaxp-testsuite-1.2.23-SNAPSHOT.jar>
to org.apache.ws.commons.axiom/jaxp-testsuite/1.2.23-20190108.222527-1/jaxp-testsuite-1.2.23-20190108.222527-1.jar
[JENKINS] Archiving <https://builds.apache.org/job/axiom-1.2.x/ws/axiom/testing/jaxp-testsuite/target/jaxp-testsuite-1.2.23-SNAPSHOT-sources.jar>
to org.apache.ws.commons.axiom/jaxp-testsuite/1.2.23-20190108.222527-1/jaxp-testsuite-1.2.23-20190108.222527-1-sources.jar
[JENKINS] Archiving <https://builds.apache.org/job/axiom-1.2.x/ws/axiom/testing/jaxp-testsuite/target/jaxp-testsuite-1.2.23-SNAPSHOT-javadoc.jar>
to org.apache.ws.commons.axiom/jaxp-testsuite/1.2.23-20190108.222527-1/jaxp-testsuite-1.2.23-20190108.222527-1-javadoc.jar
[JENKINS] Archiving <https://builds.apache.org/job/axiom-1.2.x/ws/axiom/aspects/fom-aspects/pom.xml>
to org.apache.ws.commons.axiom/fom-aspects/1.2.23-SNAPSHOT/fom-aspects-1.2.23-SNAPSHOT.pom
[JENKINS] Archiving <https://builds.apache.org/job/axiom-1.2.x/ws/axiom/aspects/fom-aspects/target/fom-aspects-1.2.23-SNAPSHOT.jar>
to org.apache.ws.commons.axiom/fom-aspects/1.2.23-20190108.224434-1/fom-aspects-1.2.23-20190108.224434-1.jar
[JENKINS] Archiving <https://builds.apache.org/job/axiom-1.2.x/ws/axiom/aspects/fom-aspects/target/fom-aspects-1.2.23-SNAPSHOT-sources.jar>
to org.apache.ws.commons.axiom/fom-aspects/1.2.23-20190108.224434-1/fom-aspects-1.2.23-20190108.224434-1-sources.jar
[JENKINS] Archiving <https://builds.apache.org/job/axiom-1.2.x/ws/axiom/aspects/fom-aspects/target/fom-aspects-1.2.23-SNAPSHOT-javadoc.jar>
to org.apache.ws.commons.axiom/fom-aspects/1.2.23-20190108.224434-1/fom-aspects-1.2.23-20190108.224434-1-javadoc.jar
[JENKINS] Archiving <https://builds.apache.org/job/axiom-1.2.x/ws/axiom/axiom-api/pom.xml>
to org.apache.ws.commons.axiom/axiom-api/1.2.23-SNAPSHOT/axiom-api-1.2.23-SNAPSHOT.pom
[JENKINS] Archiving <https://builds.apache.org/job/axiom-1.2.x/ws/axiom/axiom-api/target/axiom-api-1.2.23-SNAPSHOT.jar>
to org.apache.ws.commons.axiom/axiom-api/1.2.23-20190108.222816-1/axiom-api-1.2.23-20190108.222816-1.jar
[JENKINS] Archiving <https://builds.apache.org/job/axiom-1.2.x/ws/axiom/axiom-api/target/axiom-api-1.2.23-SNAPSHOT-sources.jar>
to org.apache.ws.commons.axiom/axiom-api/1.2.23-20190108.222816-1/axiom-api-1.2.23-20190108.222816-1-sources.jar
[JENKINS] Archiving <https://builds.apache.org/job/axiom-1.2.x/ws/axiom/axiom-api/target/axiom-api-1.2.23-SNAPSHOT-javadoc.jar>
to org.apache.ws.commons.axiom/axiom-api/1.2.23-20190108.222816-1/axiom-api-1.2.23-20190108.222816-1-javadoc.jar
[JENKINS] Archiving <https://builds.apache.org/job/axiom-1.2.x/ws/axiom/axiom-api/target/axiom-api-1.2.23-SNAPSHOT-tests.jar>
to org.apache.ws.commons.axiom/axiom-api/1.2.23-20190108.222816-1/axiom-api-1.2.23-20190108.222816-1-tests.jar
[JENKINS] Archiving <https://builds.apache.org/job/axiom-1.2.x/ws/axiom/testing/fom-testsuite/pom.xml>
to org.apache.ws.commons.axiom/fom-testsuite/1.2.23-SNAPSHOT/fom-testsuite-1.2.23-SNAPSHOT.pom
[JENKINS] Archiving <https://builds.apache.org/job/axiom-1.2.x/ws/axiom/testing/fom-testsuite/target/fom-testsuite-1.2.23-SNAPSHOT.jar>
to org.apache.ws.commons.axiom/fom-testsuite/1.2.23-20190108.224458-1/fom-testsuite-1.2.23-20190108.224458-1.jar
[JENKINS] Archiving <https://builds.apache.org/job/axiom-1.2.x/ws/axiom/testing/fom-testsuite/target/fom-testsuite-1.2.23-SNAPSHOT-sources.jar>
to org.apache.ws.commons.axiom/fom-testsuite/1.2.23-20190108.224458-1/fom-testsuite-1.2.23-20190108.224458-1-sources.jar
[JENKINS] Archiving <https://builds.apache.org/job/axiom-1.2.x/ws/axiom/testing/fom-testsuite/target/fom-testsuite-1.2.23-SNAPSHOT-javadoc.jar>
to org.apache.ws.commons.axiom/fom-testsuite/1.2.23-20190108.224458-1/fom-testsuite-1.2.23-20190108.224458-1-javadoc.jar
[JENKINS] Archiving <https://builds.apache.org/job/axiom-1.2.x/ws/axiom/systests/jaxws-tests/pom.xml>
to org.apache.ws.commons.axiom/jaxws-tests/1.2.23-SNAPSHOT/jaxws-tests-1.2.23-SNAPSHOT.pom
[JENKINS] Archiving <https://builds.apache.org/job/axiom-1.2.x/ws/axiom/systests/jaxws-tests/target/jaxws-tests-1.2.23-SNAPSHOT.jar>
to org.apache.ws.commons.axiom/jaxws-tests/1.2.23-SNAPSHOT/jaxws-tests-1.2.23-SNAPSHOT.jar
[JENKINS] Archiving <https://builds.apache.org/job/axiom-1.2.x/ws/axiom/systests/jaxws-tests/target/jaxws-tests-1.2.23-SNAPSHOT-sources.jar>
to org.apache.ws.commons.axiom/jaxws-tests/1.2.23-SNAPSHOT/jaxws-tests-1.2.23-SNAPSHOT-sources.jar
[JENKINS] Archiving <https://builds.apache.org/job/axiom-1.2.x/ws/axiom/testing/dom-testsuite/pom.xml>
to org.apache.ws.commons.axiom/dom-testsuite/1.2.23-SNAPSHOT/dom-testsuite-1.2.23-SNAPSHOT.pom
[JENKINS] Archiving <https://builds.apache.org/job/axiom-1.2.x/ws/axiom/testing/dom-testsuite/target/dom-testsuite-1.2.23-SNAPSHOT.jar>
to org.apache.ws.commons.axiom/dom-testsuite/1.2.23-20190108.223509-1/dom-testsuite-1.2.23-20190108.223509-1.jar
[JENKINS] Archiving <https://builds.apache.org/job/axiom-1.2.x/ws/axiom/testing/dom-testsuite/target/dom-testsuite-1.2.23-SNAPSHOT-sources.jar>
to org.apache.ws.commons.axiom/dom-testsuite/1.2.23-20190108.223509-1/dom-testsuite-1.2.23-20190108.223509-1-sources.jar
[JENKINS] Archiving <https://builds.apache.org/job/axiom-1.2.x/ws/axiom/testing/dom-testsuite/target/dom-testsuite-1.2.23-SNAPSHOT-javadoc.jar>
to org.apache.ws.commons.axiom/dom-testsuite/1.2.23-20190108.223509-1/dom-testsuite-1.2.23-20190108.223509-1-javadoc.jar
[JENKINS] Archiving <https://builds.apache.org/job/axiom-1.2.x/ws/axiom/implementations/axiom-impl/pom.xml>
to org.apache.ws.commons.axiom/axiom-impl/1.2.23-SNAPSHOT/axiom-impl-1.2.23-SNAPSHOT.pom
[JENKINS] Archiving <https://builds.apache.org/job/axiom-1.2.x/ws/axiom/implementations/axiom-impl/target/axiom-impl-1.2.23-SNAPSHOT.jar>
to org.apache.ws.commons.axiom/axiom-impl/1.2.23-20190108.223347-1/axiom-impl-1.2.23-20190108.223347-1.jar
[JENKINS] Archiving <https://builds.apache.org/job/axiom-1.2.x/ws/axiom/implementations/axiom-impl/target/axiom-impl-1.2.23-SNAPSHOT-sources.jar>
to org.apache.ws.commons.axiom/axiom-impl/1.2.23-20190108.223347-1/axiom-impl-1.2.23-20190108.223347-1-sources.jar
[JENKINS] Archiving <https://builds.apache.org/job/axiom-1.2.x/ws/axiom/implementations/axiom-impl/target/axiom-impl-1.2.23-SNAPSHOT-javadoc.jar>
to org.apache.ws.commons.axiom/axiom-impl/1.2.23-20190108.223347-1/axiom-impl-1.2.23-20190108.223347-1-javadoc.jar
[JENKINS] Archiving <https://builds.apache.org/job/axiom-1.2.x/ws/axiom/implementations/fom-impl/pom.xml>
to org.apache.ws.commons.axiom/fom-impl/1.2.23-SNAPSHOT/fom-impl-1.2.23-SNAPSHOT.pom
[JENKINS] Archiving <https://builds.apache.org/job/axiom-1.2.x/ws/axiom/implementations/fom-impl/target/fom-impl-1.2.23-SNAPSHOT.jar>
to org.apache.ws.commons.axiom/fom-impl/1.2.23-20190108.224543-1/fom-impl-1.2.23-20190108.224543-1.jar
[JENKINS] Archiving <https://builds.apache.org/job/axiom-1.2.x/ws/axiom/implementations/fom-impl/target/fom-impl-1.2.23-SNAPSHOT-sources.jar>
to org.apache.ws.commons.axiom/fom-impl/1.2.23-20190108.224543-1/fom-impl-1.2.23-20190108.224543-1-sources.jar
[JENKINS] Archiving <https://builds.apache.org/job/axiom-1.2.x/ws/axiom/implementations/fom-impl/target/fom-impl-1.2.23-SNAPSHOT-javadoc.jar>
to org.apache.ws.commons.axiom/fom-impl/1.2.23-20190108.224543-1/fom-impl-1.2.23-20190108.224543-1-javadoc.jar
[JENKINS] Archiving <https://builds.apache.org/job/axiom-1.2.x/ws/axiom/testing/testutils/pom.xml>
to org.apache.ws.commons.axiom/testutils/1.2.23-SNAPSHOT/testutils-1.2.23-SNAPSHOT.pom
[JENKINS] Archiving <https://builds.apache.org/job/axiom-1.2.x/ws/axiom/testing/testutils/target/testutils-1.2.23-SNAPSHOT.jar>
to org.apache.ws.commons.axiom/testutils/1.2.23-20190108.222445-1/testutils-1.2.23-20190108.222445-1.jar
[JENKINS] Archiving <https://builds.apache.org/job/axiom-1.2.x/ws/axiom/testing/testutils/target/testutils-1.2.23-SNAPSHOT-sources.jar>
to org.apache.ws.commons.axiom/testutils/1.2.23-20190108.222445-1/testutils-1.2.23-20190108.222445-1-sources.jar
[JENKINS] Archiving <https://builds.apache.org/job/axiom-1.2.x/ws/axiom/testing/testutils/target/testutils-1.2.23-SNAPSHOT-javadoc.jar>
to org.apache.ws.commons.axiom/testutils/1.2.23-20190108.222445-1/testutils-1.2.23-20190108.222445-1-javadoc.jar
[JENKINS] Archiving <https://builds.apache.org/job/axiom-1.2.x/ws/axiom/testing/xml-truth/pom.xml>
to org.apache.ws.commons.axiom/xml-truth/1.2.23-SNAPSHOT/xml-truth-1.2.23-SNAPSHOT.pom
[JENKINS] Archiving <https://builds.apache.org/job/axiom-1.2.x/ws/axiom/testing/xml-truth/target/xml-truth-1.2.23-SNAPSHOT.jar>
to org.apache.ws.commons.axiom/xml-truth/1.2.23-20190108.222551-1/xml-truth-1.2.23-20190108.222551-1.jar
[JENKINS] Archiving <https://builds.apache.org/job/axiom-1.2.x/ws/axiom/testing/xml-truth/target/xml-truth-1.2.23-SNAPSHOT-sources.jar>
to org.apache.ws.commons.axiom/xml-truth/1.2.23-20190108.222551-1/xml-truth-1.2.23-20190108.222551-1-sources.jar
[JENKINS] Archiving <https://builds.apache.org/job/axiom-1.2.x/ws/axiom/testing/xml-truth/target/xml-truth-1.2.23-SNAPSHOT-javadoc.jar>
to org.apache.ws.commons.axiom/xml-truth/1.2.23-20190108.222551-1/xml-truth-1.2.23-20190108.222551-1-javadoc.jar
[JENKINS] Archiving <https://builds.apache.org/job/axiom-1.2.x/ws/axiom/apidocs/pom.xml>
to org.apache.ws.commons.axiom/apidocs/1.2.23-SNAPSHOT/apidocs-1.2.23-SNAPSHOT.pom
[JENKINS] Archiving <https://builds.apache.org/job/axiom-1.2.x/ws/axiom/apidocs/target/apidocs-1.2.23-SNAPSHOT-javadoc.zip>
to org.apache.ws.commons.axiom/apidocs/1.2.23-SNAPSHOT/apidocs-1.2.23-SNAPSHOT-javadoc.zip
[JENKINS] Archiving <https://builds.apache.org/job/axiom-1.2.x/ws/axiom/testing/xml-testsuite/pom.xml>
to org.apache.ws.commons.axiom/xml-testsuite/1.2.23-SNAPSHOT/xml-testsuite-1.2.23-SNAPSHOT.pom
[JENKINS] Archiving <https://builds.apache.org/job/axiom-1.2.x/ws/axiom/testing/xml-testsuite/target/xml-testsuite-1.2.23-SNAPSHOT.jar>
to org.apache.ws.commons.axiom/xml-testsuite/1.2.23-20190108.222507-1/xml-testsuite-1.2.23-20190108.222507-1.jar
[JENKINS] Archiving <https://builds.apache.org/job/axiom-1.2.x/ws/axiom/testing/xml-testsuite/target/xml-testsuite-1.2.23-SNAPSHOT-sources.jar>
to org.apache.ws.commons.axiom/xml-testsuite/1.2.23-20190108.222507-1/xml-testsuite-1.2.23-20190108.222507-1-sources.jar
[JENKINS] Archiving <https://builds.apache.org/job/axiom-1.2.x/ws/axiom/testing/xml-testsuite/target/xml-testsuite-1.2.23-SNAPSHOT-javadoc.jar>
to org.apache.ws.commons.axiom/xml-testsuite/1.2.23-20190108.222507-1/xml-testsuite-1.2.23-20190108.222507-1-javadoc.jar
[JENKINS] Archiving <https://builds.apache.org/job/axiom-1.2.x/ws/axiom/samples/pom.xml>
to org.apache.ws.commons.axiom/samples/1.2.23-SNAPSHOT/samples-1.2.23-SNAPSHOT.pom
[JENKINS] Archiving <https://builds.apache.org/job/axiom-1.2.x/ws/axiom/samples/target/samples-1.2.23-SNAPSHOT.jar>
to org.apache.ws.commons.axiom/samples/1.2.23-SNAPSHOT/samples-1.2.23-SNAPSHOT.jar
[JENKINS] Archiving <https://builds.apache.org/job/axiom-1.2.x/ws/axiom/samples/target/samples-1.2.23-SNAPSHOT-sources.jar>
to org.apache.ws.commons.axiom/samples/1.2.23-SNAPSHOT/samples-1.2.23-SNAPSHOT-sources.jar
[JENKINS] Archiving <https://builds.apache.org/job/axiom-1.2.x/ws/axiom/buildutils/pom.xml>
to org.apache.ws.commons.axiom/buildutils/1.2.23-SNAPSHOT/buildutils-1.2.23-SNAPSHOT.pom
[JENKINS] Archiving <https://builds.apache.org/job/axiom-1.2.x/ws/axiom/axiom-all/pom.xml>
to org.apache.ws.commons.axiom/axiom-all/1.2.23-SNAPSHOT/axiom-all-1.2.23-SNAPSHOT.pom
[JENKINS] Archiving <https://builds.apache.org/job/axiom-1.2.x/ws/axiom/axiom-all/target/axiom-all-1.2.23-SNAPSHOT.jar>
to org.apache.ws.commons.axiom/axiom-all/1.2.23-SNAPSHOT/axiom-all-1.2.23-SNAPSHOT.jar
[JENKINS] Archiving <https://builds.apache.org/job/axiom-1.2.x/ws/axiom/axiom-all/target/axiom-all-1.2.23-SNAPSHOT-sources.jar>
to org.apache.ws.commons.axiom/axiom-all/1.2.23-SNAPSHOT/axiom-all-1.2.23-SNAPSHOT-sources.jar
[JENKINS] Archiving <https://builds.apache.org/job/axiom-1.2.x/ws/axiom/implementations/pom.xml>
to org.apache.ws.commons.axiom/implementations/1.2.23-SNAPSHOT/implementations-1.2.23-SNAPSHOT.pom
[JENKINS] Archiving <https://builds.apache.org/job/axiom-1.2.x/ws/axiom/implementations/target/implementations-1.2.23-SNAPSHOT-site.xml>
to org.apache.ws.commons.axiom/implementations/1.2.23-20190108.223125-1/implementations-1.2.23-20190108.223125-1-site.xml
[JENKINS] Archiving <https://builds.apache.org/job/axiom-1.2.x/ws/axiom/systests/pom.xml>
to org.apache.ws.commons.axiom/systests/1.2.23-SNAPSHOT/systests-1.2.23-SNAPSHOT.pom
[JENKINS] Archiving <https://builds.apache.org/job/axiom-1.2.x/ws/axiom/distribution/pom.xml>
to org.apache.ws.commons.axiom/distribution/1.2.23-SNAPSHOT/distribution-1.2.23-SNAPSHOT.pom
[JENKINS] Archiving <https://builds.apache.org/job/axiom-1.2.x/ws/axiom/testing/axiom-truth/pom.xml>
to org.apache.ws.commons.axiom/axiom-truth/1.2.23-SNAPSHOT/axiom-truth-1.2.23-SNAPSHOT.pom
[JENKINS] Archiving <https://builds.apache.org/job/axiom-1.2.x/ws/axiom/testing/axiom-truth/target/axiom-truth-1.2.23-SNAPSHOT.jar>
to org.apache.ws.commons.axiom/axiom-truth/1.2.23-20190108.223007-1/axiom-truth-1.2.23-20190108.223007-1.jar
[JENKINS] Archiving <https://builds.apache.org/job/axiom-1.2.x/ws/axiom/testing/axiom-truth/target/axiom-truth-1.2.23-SNAPSHOT-sources.jar>
to org.apache.ws.commons.axiom/axiom-truth/1.2.23-20190108.223007-1/axiom-truth-1.2.23-20190108.223007-1-sources.jar
[JENKINS] Archiving <https://builds.apache.org/job/axiom-1.2.x/ws/axiom/testing/axiom-truth/target/axiom-truth-1.2.23-SNAPSHOT-javadoc.jar>
to org.apache.ws.commons.axiom/axiom-truth/1.2.23-20190108.223007-1/axiom-truth-1.2.23-20190108.223007-1-javadoc.jar
[JENKINS] Archiving <https://builds.apache.org/job/axiom-1.2.x/ws/axiom/systests/jboss-tests/pom.xml>
to org.apache.ws.commons.axiom/jboss-tests/1.2.23-SNAPSHOT/jboss-tests-1.2.23-SNAPSHOT.pom
[JENKINS] Archiving <https://builds.apache.org/job/axiom-1.2.x/ws/axiom/systests/jboss-tests/target/jboss-tests-1.2.23-SNAPSHOT.jar>
to org.apache.ws.commons.axiom/jboss-tests/1.2.23-SNAPSHOT/jboss-tests-1.2.23-SNAPSHOT.jar
[JENKINS] Archiving <https://builds.apache.org/job/axiom-1.2.x/ws/axiom/systests/jboss-tests/target/jboss-tests-1.2.23-SNAPSHOT-sources.jar>
to org.apache.ws.commons.axiom/jboss-tests/1.2.23-SNAPSHOT/jboss-tests-1.2.23-SNAPSHOT-sources.jar
[JENKINS] Archiving <https://builds.apache.org/job/axiom-1.2.x/ws/axiom/systests/spring-ws-tests/pom.xml>
to org.apache.ws.commons.axiom/spring-ws-tests/1.2.23-SNAPSHOT/spring-ws-tests-1.2.23-SNAPSHOT.pom
[JENKINS] Archiving <https://builds.apache.org/job/axiom-1.2.x/ws/axiom/systests/spring-ws-tests/target/spring-ws-tests-1.2.23-SNAPSHOT.jar>
to org.apache.ws.commons.axiom/spring-ws-tests/1.2.23-SNAPSHOT/spring-ws-tests-1.2.23-SNAPSHOT.jar
[JENKINS] Archiving <https://builds.apache.org/job/axiom-1.2.x/ws/axiom/systests/spring-ws-tests/target/spring-ws-tests-1.2.23-SNAPSHOT-sources.jar>
to org.apache.ws.commons.axiom/spring-ws-tests/1.2.23-SNAPSHOT/spring-ws-tests-1.2.23-SNAPSHOT-sources.jar
[JENKINS] Archiving <https://builds.apache.org/job/axiom-1.2.x/ws/axiom/aspects/om-aspects/pom.xml>
to org.apache.ws.commons.axiom/om-aspects/1.2.23-SNAPSHOT/om-aspects-1.2.23-SNAPSHOT.pom
[JENKINS] Archiving <https://builds.apache.org/job/axiom-1.2.x/ws/axiom/aspects/om-aspects/target/om-aspects-1.2.23-SNAPSHOT.jar>
to org.apache.ws.commons.axiom/om-aspects/1.2.23-20190108.222946-1/om-aspects-1.2.23-20190108.222946-1.jar
[JENKINS] Archiving <https://builds.apache.org/job/axiom-1.2.x/ws/axiom/aspects/om-aspects/target/om-aspects-1.2.23-SNAPSHOT-sources.jar>
to org.apache.ws.commons.axiom/om-aspects/1.2.23-20190108.222946-1/om-aspects-1.2.23-20190108.222946-1-sources.jar
[JENKINS] Archiving <https://builds.apache.org/job/axiom-1.2.x/ws/axiom/aspects/om-aspects/target/om-aspects-1.2.23-SNAPSHOT-javadoc.jar>
to org.apache.ws.commons.axiom/om-aspects/1.2.23-20190108.222946-1/om-aspects-1.2.23-20190108.222946-1-javadoc.jar
[Fast Archiver] Compressed 1.50 MB of artifacts by 27.0% relative to #91
[JENKINS] Archiving <https://builds.apache.org/job/axiom-1.2.x/ws/axiom/testing/jaxen-testsuite/pom.xml>
to org.apache.ws.commons.axiom/jaxen-testsuite/1.2.23-SNAPSHOT/jaxen-testsuite-1.2.23-SNAPSHOT.pom
[JENKINS] Archiving <https://builds.apache.org/job/axiom-1.2.x/ws/axiom/testing/jaxen-testsuite/target/jaxen-testsuite-1.2.23-SNAPSHOT.jar>
to org.apache.ws.commons.axiom/jaxen-testsuite/1.2.23-20190108.223027-1/jaxen-testsuite-1.2.23-20190108.223027-1.jar
[JENKINS] Archiving <https://builds.apache.org/job/axiom-1.2.x/ws/axiom/testing/jaxen-testsuite/target/jaxen-testsuite-1.2.23-SNAPSHOT-sources.jar>
to org.apache.ws.commons.axiom/jaxen-testsuite/1.2.23-20190108.223027-1/jaxen-testsuite-1.2.23-20190108.223027-1-sources.jar
[JENKINS] Archiving <https://builds.apache.org/job/axiom-1.2.x/ws/axiom/testing/jaxen-testsuite/target/jaxen-testsuite-1.2.23-SNAPSHOT-javadoc.jar>
to org.apache.ws.commons.axiom/jaxen-testsuite/1.2.23-20190108.223027-1/jaxen-testsuite-1.2.23-20190108.223027-1-javadoc.jar
[Fast Archiver] Compressed 251.96 KB of artifacts by 25.4% relative to #91
[JENKINS] Archiving <https://builds.apache.org/job/axiom-1.2.x/ws/axiom/systests/eclipse-tests/pom.xml>
to org.apache.ws.commons.axiom/eclipse-tests/1.2.23-SNAPSHOT/eclipse-tests-1.2.23-SNAPSHOT.pom
[JENKINS] Archiving <https://builds.apache.org/job/axiom-1.2.x/ws/axiom/aspects/shared-aspects/pom.xml>
to org.apache.ws.commons.axiom/shared-aspects/1.2.23-SNAPSHOT/shared-aspects-1.2.23-SNAPSHOT.pom
[JENKINS] Archiving <https://builds.apache.org/job/axiom-1.2.x/ws/axiom/aspects/shared-aspects/target/shared-aspects-1.2.23-SNAPSHOT.jar>
to org.apache.ws.commons.axiom/shared-aspects/1.2.23-20190108.222913-1/shared-aspects-1.2.23-20190108.222913-1.jar
[JENKINS] Archiving <https://builds.apache.org/job/axiom-1.2.x/ws/axiom/aspects/shared-aspects/target/shared-aspects-1.2.23-SNAPSHOT-sources.jar>
to org.apache.ws.commons.axiom/shared-aspects/1.2.23-20190108.222913-1/shared-aspects-1.2.23-20190108.222913-1-sources.jar
[JENKINS] Archiving <https://builds.apache.org/job/axiom-1.2.x/ws/axiom/aspects/shared-aspects/target/shared-aspects-1.2.23-SNAPSHOT-javadoc.jar>
to org.apache.ws.commons.axiom/shared-aspects/1.2.23-20190108.222913-1/shared-aspects-1.2.23-20190108.222913-1-javadoc.jar
[JENKINS] Archiving <https://builds.apache.org/job/axiom-1.2.x/ws/axiom/buildutils/shade-osgi/pom.xml>
to org.apache.ws.commons.axiom/shade-osgi/1.2.23-SNAPSHOT/shade-osgi-1.2.23-SNAPSHOT.pom
[JENKINS] Archiving <https://builds.apache.org/job/axiom-1.2.x/ws/axiom/buildutils/shade-osgi/target/shade-osgi-1.2.23-SNAPSHOT.jar>
to org.apache.ws.commons.axiom/shade-osgi/1.2.23-20190108.222212-1/shade-osgi-1.2.23-20190108.222212-1.jar
[JENKINS] Archiving <https://builds.apache.org/job/axiom-1.2.x/ws/axiom/buildutils/shade-osgi/target/shade-osgi-1.2.23-SNAPSHOT-sources.jar>
to org.apache.ws.commons.axiom/shade-osgi/1.2.23-20190108.222212-1/shade-osgi-1.2.23-20190108.222212-1-sources.jar
[JENKINS] Archiving <https://builds.apache.org/job/axiom-1.2.x/ws/axiom/buildutils/shade-osgi/target/shade-osgi-1.2.23-SNAPSHOT-javadoc.jar>
to org.apache.ws.commons.axiom/shade-osgi/1.2.23-20190108.222212-1/shade-osgi-1.2.23-20190108.222212-1-javadoc.jar
[JENKINS] Archiving <https://builds.apache.org/job/axiom-1.2.x/ws/axiom/buildutils/shade-axiom-xml/pom.xml>
to org.apache.ws.commons.axiom/shade-axiom-xml/1.2.23-SNAPSHOT/shade-axiom-xml-1.2.23-SNAPSHOT.pom
[JENKINS] Archiving <https://builds.apache.org/job/axiom-1.2.x/ws/axiom/buildutils/shade-axiom-xml/target/shade-axiom-xml-1.2.23-SNAPSHOT.jar>
to org.apache.ws.commons.axiom/shade-axiom-xml/1.2.23-20190108.222152-1/shade-axiom-xml-1.2.23-20190108.222152-1.jar
[JENKINS] Archiving <https://builds.apache.org/job/axiom-1.2.x/ws/axiom/buildutils/shade-axiom-xml/target/shade-axiom-xml-1.2.23-SNAPSHOT-sources.jar>
to org.apache.ws.commons.axiom/shade-axiom-xml/1.2.23-20190108.222152-1/shade-axiom-xml-1.2.23-20190108.222152-1-sources.jar
[JENKINS] Archiving <https://builds.apache.org/job/axiom-1.2.x/ws/axiom/buildutils/shade-axiom-xml/target/shade-axiom-xml-1.2.23-SNAPSHOT-javadoc.jar>
to org.apache.ws.commons.axiom/shade-axiom-xml/1.2.23-20190108.222152-1/shade-axiom-xml-1.2.23-20190108.222152-1-javadoc.jar
[JENKINS] Archiving <https://builds.apache.org/job/axiom-1.2.x/ws/axiom/axiom-jaxb/pom.xml>
to org.apache.ws.commons.axiom/axiom-jaxb/1.2.23-SNAPSHOT/axiom-jaxb-1.2.23-SNAPSHOT.pom
[JENKINS] Archiving <https://builds.apache.org/job/axiom-1.2.x/ws/axiom/axiom-jaxb/target/axiom-jaxb-1.2.23-SNAPSHOT.jar>
to org.apache.ws.commons.axiom/axiom-jaxb/1.2.23-20190108.223849-1/axiom-jaxb-1.2.23-20190108.223849-1.jar
[JENKINS] Archiving <https://builds.apache.org/job/axiom-1.2.x/ws/axiom/axiom-jaxb/target/axiom-jaxb-1.2.23-SNAPSHOT-sources.jar>
to org.apache.ws.commons.axiom/axiom-jaxb/1.2.23-20190108.223849-1/axiom-jaxb-1.2.23-20190108.223849-1-sources.jar
[JENKINS] Archiving <https://builds.apache.org/job/axiom-1.2.x/ws/axiom/axiom-jaxb/target/axiom-jaxb-1.2.23-SNAPSHOT-javadoc.jar>
to org.apache.ws.commons.axiom/axiom-jaxb/1.2.23-20190108.223849-1/axiom-jaxb-1.2.23-20190108.223849-1-javadoc.jar
[JENKINS] Archiving <https://builds.apache.org/job/axiom-1.2.x/ws/axiom/testing/axiom-testsuite/pom.xml>
to org.apache.ws.commons.axiom/axiom-testsuite/1.2.23-SNAPSHOT/axiom-testsuite-1.2.23-SNAPSHOT.pom
[JENKINS] Archiving <https://builds.apache.org/job/axiom-1.2.x/ws/axiom/testing/axiom-testsuite/target/axiom-testsuite-1.2.23-SNAPSHOT.jar>
to org.apache.ws.commons.axiom/axiom-testsuite/1.2.23-20190108.223107-1/axiom-testsuite-1.2.23-20190108.223107-1.jar
[JENKINS] Archiving <https://builds.apache.org/job/axiom-1.2.x/ws/axiom/testing/axiom-testsuite/target/axiom-testsuite-1.2.23-SNAPSHOT-sources.jar>
to org.apache.ws.commons.axiom/axiom-testsuite/1.2.23-20190108.223107-1/axiom-testsuite-1.2.23-20190108.223107-1-sources.jar
[JENKINS] Archiving <https://builds.apache.org/job/axiom-1.2.x/ws/axiom/testing/axiom-testsuite/target/axiom-testsuite-1.2.23-SNAPSHOT-javadoc.jar>
to org.apache.ws.commons.axiom/axiom-testsuite/1.2.23-20190108.223107-1/axiom-testsuite-1.2.23-20190108.223107-1-javadoc.jar
[JENKINS] Archiving <https://builds.apache.org/job/axiom-1.2.x/ws/axiom/testing/multiton/pom.xml>
to org.apache.ws.commons.axiom/multiton/1.2.23-SNAPSHOT/multiton-1.2.23-SNAPSHOT.pom
[JENKINS] Archiving <https://builds.apache.org/job/axiom-1.2.x/ws/axiom/testing/multiton/target/multiton-1.2.23-SNAPSHOT.jar>
to org.apache.ws.commons.axiom/multiton/1.2.23-20190108.222327-1/multiton-1.2.23-20190108.222327-1.jar
[JENKINS] Archiving <https://builds.apache.org/job/axiom-1.2.x/ws/axiom/testing/multiton/target/multiton-1.2.23-SNAPSHOT-sources.jar>
to org.apache.ws.commons.axiom/multiton/1.2.23-20190108.222327-1/multiton-1.2.23-20190108.222327-1-sources.jar
[JENKINS] Archiving <https://builds.apache.org/job/axiom-1.2.x/ws/axiom/testing/multiton/target/multiton-1.2.23-SNAPSHOT-javadoc.jar>
to org.apache.ws.commons.axiom/multiton/1.2.23-20190108.222327-1/multiton-1.2.23-20190108.222327-1-javadoc.jar
[JENKINS] Archiving <https://builds.apache.org/job/axiom-1.2.x/ws/axiom/buildutils/no-package-cycles-enforcer-rule/pom.xml>
to org.apache.ws.commons.axiom/no-package-cycles-enforcer-rule/1.2.23-SNAPSHOT/no-package-cycles-enforcer-rule-1.2.23-SNAPSHOT.pom
[JENKINS] Archiving <https://builds.apache.org/job/axiom-1.2.x/ws/axiom/buildutils/no-package-cycles-enforcer-rule/target/no-package-cycles-enforcer-rule-1.2.23-SNAPSHOT.jar>
to org.apache.ws.commons.axiom/no-package-cycles-enforcer-rule/1.2.23-20190108.222255-1/no-package-cycles-enforcer-rule-1.2.23-20190108.222255-1.jar
[JENKINS] Archiving <https://builds.apache.org/job/axiom-1.2.x/ws/axiom/buildutils/no-package-cycles-enforcer-rule/target/no-package-cycles-enforcer-rule-1.2.23-SNAPSHOT-sources.jar>
to org.apache.ws.commons.axiom/no-package-cycles-enforcer-rule/1.2.23-20190108.222255-1/no-package-cycles-enforcer-rule-1.2.23-20190108.222255-1-sources.jar
[JENKINS] Archiving <https://builds.apache.org/job/axiom-1.2.x/ws/axiom/buildutils/no-package-cycles-enforcer-rule/target/no-package-cycles-enforcer-rule-1.2.23-SNAPSHOT-javadoc.jar>
to org.apache.ws.commons.axiom/no-package-cycles-enforcer-rule/1.2.23-20190108.222255-1/no-package-cycles-enforcer-rule-1.2.23-20190108.222255-1-javadoc.jar
[JENKINS] Archiving <https://builds.apache.org/job/axiom-1.2.x/ws/axiom/axiom-compat/pom.xml>
to org.apache.ws.commons.axiom/axiom-compat/1.2.23-SNAPSHOT/axiom-compat-1.2.23-SNAPSHOT.pom
[JENKINS] Archiving <https://builds.apache.org/job/axiom-1.2.x/ws/axiom/axiom-compat/target/axiom-compat-1.2.23-SNAPSHOT.jar>
to org.apache.ws.commons.axiom/axiom-compat/1.2.23-20190108.223825-1/axiom-compat-1.2.23-20190108.223825-1.jar
[JENKINS] Archiving <https://builds.apache.org/job/axiom-1.2.x/ws/axiom/axiom-compat/target/axiom-compat-1.2.23-SNAPSHOT-sources.jar>
to org.apache.ws.commons.axiom/axiom-compat/1.2.23-20190108.223825-1/axiom-compat-1.2.23-20190108.223825-1-sources.jar
[JENKINS] Archiving <https://builds.apache.org/job/axiom-1.2.x/ws/axiom/axiom-compat/target/axiom-compat-1.2.23-SNAPSHOT-javadoc.jar>
to org.apache.ws.commons.axiom/axiom-compat/1.2.23-20190108.223825-1/axiom-compat-1.2.23-20190108.223825-1-javadoc.jar
[JENKINS] Archiving <https://builds.apache.org/job/axiom-1.2.x/ws/axiom/systests/old-tests/pom.xml>
to org.apache.ws.commons.axiom/old-tests/1.2.23-SNAPSHOT/old-tests-1.2.23-SNAPSHOT.pom
[JENKINS] Archiving <https://builds.apache.org/job/axiom-1.2.x/ws/axiom/systests/old-tests/target/old-tests-1.2.23-SNAPSHOT.jar>
to org.apache.ws.commons.axiom/old-tests/1.2.23-SNAPSHOT/old-tests-1.2.23-SNAPSHOT.jar
[JENKINS] Archiving <https://builds.apache.org/job/axiom-1.2.x/ws/axiom/systests/old-tests/target/old-tests-1.2.23-SNAPSHOT-sources.jar>
to org.apache.ws.commons.axiom/old-tests/1.2.23-SNAPSHOT/old-tests-1.2.23-SNAPSHOT-sources.jar
[JENKINS] Archiving <https://builds.apache.org/job/axiom-1.2.x/ws/axiom/components/pom.xml>
to org.apache.ws.commons.axiom/components/1.2.23-SNAPSHOT/components-1.2.23-SNAPSHOT.pom
[JENKINS] Archiving <https://builds.apache.org/job/axiom-1.2.x/ws/axiom/aspects/pom.xml>
to org.apache.ws.commons.axiom/aspects/1.2.23-SNAPSHOT/aspects-1.2.23-SNAPSHOT.pom
Sending e-mails to: dev@ws.apache.org veithen@apache.org
channel stopped

---------------------------------------------------------------------
To unsubscribe, e-mail: dev-unsubscribe@ws.apache.org
For additional commands, e-mail: dev-help@ws.apache.org


Mime
View raw message