ws-dev mailing list archives

Site index · List index
Message view « Date » · « Thread »
Top « Date » · « Thread »
From Apache Jenkins Server <>
Subject Build failed in Jenkins: wss4j-2.1 #177
Date Mon, 21 Jan 2019 15:47:25 GMT
See <>


[coheigea] WSS-640 - Streaming Sender-Vouches validation does not work with SOAP 1.2

Started by an SCM change
[EnvInject] - Loading node environment variables.
Building remotely on H35 (ubuntu xenial) in workspace <>
Updating at revision
'2019-01-21T15:47:01.620 +0000'
U         ws-security-stax/src/main/java/org/apache/wss4j/stax/impl/processor/input/
At revision 1851751

[wss4j] $ /home/jenkins/tools/maven/apache-maven-3.2.5/bin/mvn -Dmaven.repo.local=<>
clean install -Pnochecks -Dmaven.test.skip.exec=true
[INFO] Scanning for projects...
[ERROR] The build could not read 1 project -> [Help 1]
[ERROR]   The project org.apache.wss4j:wss4j:2.1.13-SNAPSHOT (<>
has 1 error
[ERROR]     Non-resolvable parent POM: Could not transfer artifact org.apache:apache:pom:21
from/to central ( Received fatal alert: protocol_version
and 'parent.relativePath' points at wrong local POM @ line 103, column 13 -> [Help 2]
[ERROR] To see the full stack trace of the errors, re-run Maven with the -e switch.
[ERROR] Re-run Maven using the -X switch to enable full debug logging.
[ERROR] For more information about the errors and possible solutions, please read the following
[ERROR] [Help 1]
[ERROR] [Help 2]
Build step 'Invoke top-level Maven targets' marked build as failure

To unsubscribe, e-mail:
For additional commands, e-mail:

View raw message