ws-dev mailing list archives

Site index · List index
Message view « Date » · « Thread »
Top « Date » · « Thread »
From Apache Jenkins Server <jenk...@builds.apache.org>
Subject Build failed in Jenkins: axiom-master #3008
Date Wed, 06 Nov 2019 17:59:16 GMT
See <https://builds.apache.org/job/axiom-master/3008/display/redirect?page=changes>

Changes:

[coheigea] Exclude .repository from rat to get the plugin to pass in Jenkins


------------------------------------------
[...truncated 2.49 MB...]
[INFO] Samples ............................................ SUCCESS [ 21.372 s]
[INFO] System Tests ....................................... SUCCESS [  3.850 s]
[INFO] compat-tests ....................................... SUCCESS [  9.781 s]
[INFO] Cross OM Tests ..................................... SUCCESS [ 10.418 s]
[INFO] Eclipse Tests ...................................... SUCCESS [ 24.477 s]
[INFO] JAX-WS Tests ....................................... SUCCESS [ 18.273 s]
[INFO] Wildfly Tests ...................................... SUCCESS [01:29 min]
[INFO] Axiom Test Suite (old) ............................. SUCCESS [ 10.773 s]
[INFO] Axiom OSGi Tests ................................... SUCCESS [ 17.844 s]
[INFO] psychopath-tests ................................... SUCCESS [ 11.852 s]
[INFO] Spring-WS Test Suite ............................... SUCCESS [ 44.863 s]
[INFO] Spring WS Tests .................................... SUCCESS [ 28.207 s]
[INFO] WSS4J Tests ........................................ SUCCESS [ 14.361 s]
[INFO] Developer Guide .................................... SUCCESS [ 15.539 s]
[INFO] User Guide ......................................... SUCCESS [  8.226 s]
[INFO] Javadoc ............................................ SUCCESS [ 12.852 s]
[INFO] Distribution ....................................... SUCCESS [ 55.069 s]
[INFO] SAAJ Test Suite .................................... FAILURE [ 12.247 s]
[INFO] ------------------------------------------------------------------------
[INFO] BUILD FAILURE
[INFO] ------------------------------------------------------------------------
[INFO] Total time: 30:16 min
[INFO] Finished at: 2019-11-06T17:54:48Z
[INFO] Final Memory: 182M/483M
[INFO] ------------------------------------------------------------------------
[ERROR] Failed to execute goal com.github.veithen.maven:jacoco-report-maven-plugin:0.1.2:process
(default) on project saaj-testsuite: Execution default of goal com.github.veithen.maven:jacoco-report-maven-plugin:0.1.2:process
failed: HTTP 400 Bad Request -> [Help 1]
[ERROR] 
[ERROR] To see the full stack trace of the errors, re-run Maven with the -e switch.
[ERROR] Re-run Maven using the -X switch to enable full debug logging.
[ERROR] 
[ERROR] For more information about the errors and possible solutions, please read the following
articles:
[ERROR] [Help 1] http://cwiki.apache.org/confluence/display/MAVEN/PluginExecutionException
[ERROR] 
[ERROR] After correcting the problems, you can resume the build with the command
[ERROR]   mvn <goals> -rf :saaj-testsuite
[JENKINS] Archiving <https://builds.apache.org/job/axiom-master/ws/aspects/core-aspects/pom.xml>
to org.apache.ws.commons.axiom/core-aspects/1.3.0-SNAPSHOT/core-aspects-1.3.0-SNAPSHOT.pom
[JENKINS] Archiving <https://builds.apache.org/job/axiom-master/ws/aspects/core-aspects/target/core-aspects-1.3.0-SNAPSHOT.jar>
to org.apache.ws.commons.axiom/core-aspects/1.3.0-20191106.173348-540/core-aspects-1.3.0-20191106.173348-540.jar
[JENKINS] Archiving <https://builds.apache.org/job/axiom-master/ws/aspects/core-aspects/target/core-aspects-1.3.0-SNAPSHOT-sources.jar>
to org.apache.ws.commons.axiom/core-aspects/1.3.0-20191106.173348-540/core-aspects-1.3.0-20191106.173348-540-sources.jar
[JENKINS] Archiving <https://builds.apache.org/job/axiom-master/ws/aspects/core-aspects/target/core-aspects-1.3.0-SNAPSHOT-javadoc.jar>
to org.apache.ws.commons.axiom/core-aspects/1.3.0-20191106.173348-540/core-aspects-1.3.0-20191106.173348-540-javadoc.jar
[JENKINS] Archiving <https://builds.apache.org/job/axiom-master/ws/components/xml-utils/pom.xml>
to org.apache.ws.commons.axiom/xml-utils/1.3.0-SNAPSHOT/xml-utils-1.3.0-SNAPSHOT.pom
[JENKINS] Archiving <https://builds.apache.org/job/axiom-master/ws/components/xml-utils/target/xml-utils-1.3.0-SNAPSHOT.jar>
to org.apache.ws.commons.axiom/xml-utils/1.3.0-20191106.173025-540/xml-utils-1.3.0-20191106.173025-540.jar
[JENKINS] Archiving <https://builds.apache.org/job/axiom-master/ws/components/xml-utils/target/xml-utils-1.3.0-SNAPSHOT-sources.jar>
to org.apache.ws.commons.axiom/xml-utils/1.3.0-20191106.173025-540/xml-utils-1.3.0-20191106.173025-540-sources.jar
[JENKINS] Archiving <https://builds.apache.org/job/axiom-master/ws/components/xml-utils/target/xml-utils-1.3.0-SNAPSHOT-javadoc.jar>
to org.apache.ws.commons.axiom/xml-utils/1.3.0-20191106.173025-540/xml-utils-1.3.0-20191106.173025-540-javadoc.jar
[JENKINS] Archiving <https://builds.apache.org/job/axiom-master/ws/systests/wss4j-tests/pom.xml>
to org.apache.ws.commons.axiom/wss4j-tests/1.3.0-SNAPSHOT/wss4j-tests-1.3.0-SNAPSHOT.pom
[JENKINS] Archiving <https://builds.apache.org/job/axiom-master/ws/systests/wss4j-tests/target/wss4j-tests-1.3.0-SNAPSHOT.jar>
to org.apache.ws.commons.axiom/wss4j-tests/1.3.0-SNAPSHOT/wss4j-tests-1.3.0-SNAPSHOT.jar
[JENKINS] Archiving <https://builds.apache.org/job/axiom-master/ws/systests/wss4j-tests/target/wss4j-tests-1.3.0-SNAPSHOT-sources.jar>
to org.apache.ws.commons.axiom/wss4j-tests/1.3.0-SNAPSHOT/wss4j-tests-1.3.0-SNAPSHOT-sources.jar
[JENKINS] Archiving <https://builds.apache.org/job/axiom-master/ws/pom.xml> to org.apache.ws.commons.axiom/axiom/1.3.0-SNAPSHOT/axiom-1.3.0-SNAPSHOT.pom
[JENKINS] Archiving <https://builds.apache.org/job/axiom-master/ws/target/axiom-1.3.0-SNAPSHOT-site.xml>
to org.apache.ws.commons.axiom/axiom/1.3.0-20191106.172454-548/axiom-1.3.0-20191106.172454-548-site.xml
[JENKINS] Archiving <https://builds.apache.org/job/axiom-master/ws/testing/soap-testsuite/pom.xml>
to org.apache.ws.commons.axiom/soap-testsuite/1.3.0-SNAPSHOT/soap-testsuite-1.3.0-SNAPSHOT.pom
[JENKINS] Archiving <https://builds.apache.org/job/axiom-master/ws/testing/soap-testsuite/target/soap-testsuite-1.3.0-SNAPSHOT.jar>
to org.apache.ws.commons.axiom/soap-testsuite/1.3.0-20191106.173051-540/soap-testsuite-1.3.0-20191106.173051-540.jar
[JENKINS] Archiving <https://builds.apache.org/job/axiom-master/ws/testing/soap-testsuite/target/soap-testsuite-1.3.0-SNAPSHOT-sources.jar>
to org.apache.ws.commons.axiom/soap-testsuite/1.3.0-20191106.173051-540/soap-testsuite-1.3.0-20191106.173051-540-sources.jar
[JENKINS] Archiving <https://builds.apache.org/job/axiom-master/ws/testing/soap-testsuite/target/soap-testsuite-1.3.0-SNAPSHOT-javadoc.jar>
to org.apache.ws.commons.axiom/soap-testsuite/1.3.0-20191106.173051-540/soap-testsuite-1.3.0-20191106.173051-540-javadoc.jar
[Fast Archiver] Compressed 402.90 KB of artifacts by 31.8% relative to #3005
[JENKINS] Archiving <https://builds.apache.org/job/axiom-master/ws/userguide/pom.xml>
to org.apache.ws.commons.axiom/userguide/1.3.0-SNAPSHOT/userguide-1.3.0-SNAPSHOT.pom
[JENKINS] Archiving <https://builds.apache.org/job/axiom-master/ws/userguide/target/docbkx/pdf/userguide.pdf>
to org.apache.ws.commons.axiom/userguide/1.3.0-SNAPSHOT/userguide-1.3.0-SNAPSHOT.pdf
[Fast Archiver] Compressed 344.78 KB of artifacts by 74.2% relative to #3005
[JENKINS] Archiving <https://builds.apache.org/job/axiom-master/ws/devguide/pom.xml>
to org.apache.ws.commons.axiom/devguide/1.3.0-SNAPSHOT/devguide-1.3.0-SNAPSHOT.pom
[JENKINS] Archiving <https://builds.apache.org/job/axiom-master/ws/devguide/target/docbkx/pdf/devguide.pdf>
to org.apache.ws.commons.axiom/devguide/1.3.0-SNAPSHOT/devguide-1.3.0-SNAPSHOT.pdf
[Fast Archiver] Compressed 92.23 KB of artifacts by 34.7% relative to #3005
[JENKINS] Archiving <https://builds.apache.org/job/axiom-master/ws/testing/pom.xml>
to org.apache.ws.commons.axiom/testing/1.3.0-SNAPSHOT/testing-1.3.0-SNAPSHOT.pom
[JENKINS] Archiving <https://builds.apache.org/job/axiom-master/ws/testing/target/testing-1.3.0-SNAPSHOT-site.xml>
to org.apache.ws.commons.axiom/testing/1.3.0-20191106.172655-544/testing-1.3.0-20191106.172655-544-site.xml
[JENKINS] Archiving <https://builds.apache.org/job/axiom-master/ws/systests/osgi-tests/pom.xml>
to org.apache.ws.commons.axiom/osgi-tests/1.3.0-SNAPSHOT/osgi-tests-1.3.0-SNAPSHOT.pom
[JENKINS] Archiving <https://builds.apache.org/job/axiom-master/ws/systests/osgi-tests/target/osgi-tests-1.3.0-SNAPSHOT.jar>
to org.apache.ws.commons.axiom/osgi-tests/1.3.0-SNAPSHOT/osgi-tests-1.3.0-SNAPSHOT.jar
[JENKINS] Archiving <https://builds.apache.org/job/axiom-master/ws/systests/osgi-tests/target/osgi-tests-1.3.0-SNAPSHOT-sources.jar>
to org.apache.ws.commons.axiom/osgi-tests/1.3.0-SNAPSHOT/osgi-tests-1.3.0-SNAPSHOT-sources.jar
[JENKINS] Archiving <https://builds.apache.org/job/axiom-master/ws/testing/saaj-testsuite/pom.xml>
to org.apache.ws.commons.axiom/saaj-testsuite/1.3.0-SNAPSHOT/saaj-testsuite-1.3.0-SNAPSHOT.pom
[JENKINS] Archiving <https://builds.apache.org/job/axiom-master/ws/testing/saaj-testsuite/target/saaj-testsuite-1.3.0-SNAPSHOT.jar>
to org.apache.ws.commons.axiom/saaj-testsuite/1.3.0-SNAPSHOT/saaj-testsuite-1.3.0-SNAPSHOT.jar
[JENKINS] Archiving <https://builds.apache.org/job/axiom-master/ws/testing/saaj-testsuite/target/saaj-testsuite-1.3.0-SNAPSHOT-sources.jar>
to org.apache.ws.commons.axiom/saaj-testsuite/1.3.0-SNAPSHOT/saaj-testsuite-1.3.0-SNAPSHOT-sources.jar
[JENKINS] Archiving <https://builds.apache.org/job/axiom-master/ws/testing/saaj-testsuite/target/saaj-testsuite-1.3.0-SNAPSHOT-javadoc.jar>
to org.apache.ws.commons.axiom/saaj-testsuite/1.3.0-SNAPSHOT/saaj-testsuite-1.3.0-SNAPSHOT-javadoc.jar
[JENKINS] Archiving <https://builds.apache.org/job/axiom-master/ws/systests/cross-om-tests/pom.xml>
to org.apache.ws.commons.axiom/cross-om-tests/1.3.0-SNAPSHOT/cross-om-tests-1.3.0-SNAPSHOT.pom
[JENKINS] Archiving <https://builds.apache.org/job/axiom-master/ws/systests/cross-om-tests/target/cross-om-tests-1.3.0-SNAPSHOT.jar>
to org.apache.ws.commons.axiom/cross-om-tests/1.3.0-SNAPSHOT/cross-om-tests-1.3.0-SNAPSHOT.jar
[JENKINS] Archiving <https://builds.apache.org/job/axiom-master/ws/systests/cross-om-tests/target/cross-om-tests-1.3.0-SNAPSHOT-sources.jar>
to org.apache.ws.commons.axiom/cross-om-tests/1.3.0-SNAPSHOT/cross-om-tests-1.3.0-SNAPSHOT-sources.jar
[JENKINS] Archiving <https://builds.apache.org/job/axiom-master/ws/testing/spring-ws-testsuite/pom.xml>
to org.apache.ws.commons.axiom/spring-ws-testsuite/1.3.0-SNAPSHOT/spring-ws-testsuite-1.3.0-SNAPSHOT.pom
[JENKINS] Archiving <https://builds.apache.org/job/axiom-master/ws/testing/spring-ws-testsuite/target/spring-ws-testsuite-1.3.0-SNAPSHOT.jar>
to org.apache.ws.commons.axiom/spring-ws-testsuite/1.3.0-20191106.175029-523/spring-ws-testsuite-1.3.0-20191106.175029-523.jar
[JENKINS] Archiving <https://builds.apache.org/job/axiom-master/ws/testing/spring-ws-testsuite/target/spring-ws-testsuite-1.3.0-SNAPSHOT-sources.jar>
to org.apache.ws.commons.axiom/spring-ws-testsuite/1.3.0-20191106.175029-523/spring-ws-testsuite-1.3.0-20191106.175029-523-sources.jar
[JENKINS] Archiving <https://builds.apache.org/job/axiom-master/ws/testing/spring-ws-testsuite/target/spring-ws-testsuite-1.3.0-SNAPSHOT-javadoc.jar>
to org.apache.ws.commons.axiom/spring-ws-testsuite/1.3.0-20191106.175029-523/spring-ws-testsuite-1.3.0-20191106.175029-523-javadoc.jar
[JENKINS] Archiving <https://builds.apache.org/job/axiom-master/ws/aspects/dom-aspects/pom.xml>
to org.apache.ws.commons.axiom/dom-aspects/1.3.0-SNAPSHOT/dom-aspects-1.3.0-SNAPSHOT.pom
[JENKINS] Archiving <https://builds.apache.org/job/axiom-master/ws/aspects/dom-aspects/target/dom-aspects-1.3.0-SNAPSHOT.jar>
to org.apache.ws.commons.axiom/dom-aspects/1.3.0-20191106.174033-536/dom-aspects-1.3.0-20191106.174033-536.jar
[JENKINS] Archiving <https://builds.apache.org/job/axiom-master/ws/aspects/dom-aspects/target/dom-aspects-1.3.0-SNAPSHOT-sources.jar>
to org.apache.ws.commons.axiom/dom-aspects/1.3.0-20191106.174033-536/dom-aspects-1.3.0-20191106.174033-536-sources.jar
[JENKINS] Archiving <https://builds.apache.org/job/axiom-master/ws/aspects/dom-aspects/target/dom-aspects-1.3.0-SNAPSHOT-javadoc.jar>
to org.apache.ws.commons.axiom/dom-aspects/1.3.0-20191106.174033-536/dom-aspects-1.3.0-20191106.174033-536-javadoc.jar
[JENKINS] Archiving <https://builds.apache.org/job/axiom-master/ws/implementations/axiom-dom/pom.xml>
to org.apache.ws.commons.axiom/axiom-dom/1.3.0-SNAPSHOT/axiom-dom-1.3.0-SNAPSHOT.pom
[JENKINS] Archiving <https://builds.apache.org/job/axiom-master/ws/implementations/axiom-dom/target/axiom-dom-1.3.0-SNAPSHOT.jar>
to org.apache.ws.commons.axiom/axiom-dom/1.3.0-20191106.174442-534/axiom-dom-1.3.0-20191106.174442-534.jar
[JENKINS] Archiving <https://builds.apache.org/job/axiom-master/ws/implementations/axiom-dom/target/axiom-dom-1.3.0-SNAPSHOT-sources.jar>
to org.apache.ws.commons.axiom/axiom-dom/1.3.0-20191106.174442-534/axiom-dom-1.3.0-20191106.174442-534-sources.jar
[JENKINS] Archiving <https://builds.apache.org/job/axiom-master/ws/implementations/axiom-dom/target/axiom-dom-1.3.0-SNAPSHOT-javadoc.jar>
to org.apache.ws.commons.axiom/axiom-dom/1.3.0-20191106.174442-534/axiom-dom-1.3.0-20191106.174442-534-javadoc.jar
[JENKINS] Archiving <https://builds.apache.org/job/axiom-master/ws/components/base64-utils/pom.xml>
to org.apache.ws.commons.axiom/base64-utils/1.3.0-SNAPSHOT/base64-utils-1.3.0-SNAPSHOT.pom
[JENKINS] Archiving <https://builds.apache.org/job/axiom-master/ws/components/base64-utils/target/base64-utils-1.3.0-SNAPSHOT.jar>
to org.apache.ws.commons.axiom/base64-utils/1.3.0-20191106.172636-146/base64-utils-1.3.0-20191106.172636-146.jar
[JENKINS] Archiving <https://builds.apache.org/job/axiom-master/ws/components/base64-utils/target/base64-utils-1.3.0-SNAPSHOT-sources.jar>
to org.apache.ws.commons.axiom/base64-utils/1.3.0-20191106.172636-146/base64-utils-1.3.0-20191106.172636-146-sources.jar
[JENKINS] Archiving <https://builds.apache.org/job/axiom-master/ws/components/base64-utils/target/base64-utils-1.3.0-SNAPSHOT-javadoc.jar>
to org.apache.ws.commons.axiom/base64-utils/1.3.0-20191106.172636-146/base64-utils-1.3.0-20191106.172636-146-javadoc.jar
[JENKINS] Archiving <https://builds.apache.org/job/axiom-master/ws/testing/jaxp-testsuite/pom.xml>
to org.apache.ws.commons.axiom/jaxp-testsuite/1.3.0-SNAPSHOT/jaxp-testsuite-1.3.0-SNAPSHOT.pom
[JENKINS] Archiving <https://builds.apache.org/job/axiom-master/ws/testing/jaxp-testsuite/target/jaxp-testsuite-1.3.0-SNAPSHOT.jar>
to org.apache.ws.commons.axiom/jaxp-testsuite/1.3.0-20191106.172929-540/jaxp-testsuite-1.3.0-20191106.172929-540.jar
[JENKINS] Archiving <https://builds.apache.org/job/axiom-master/ws/testing/jaxp-testsuite/target/jaxp-testsuite-1.3.0-SNAPSHOT-sources.jar>
to org.apache.ws.commons.axiom/jaxp-testsuite/1.3.0-20191106.172929-540/jaxp-testsuite-1.3.0-20191106.172929-540-sources.jar
[JENKINS] Archiving <https://builds.apache.org/job/axiom-master/ws/testing/jaxp-testsuite/target/jaxp-testsuite-1.3.0-SNAPSHOT-javadoc.jar>
to org.apache.ws.commons.axiom/jaxp-testsuite/1.3.0-20191106.172929-540/jaxp-testsuite-1.3.0-20191106.172929-540-javadoc.jar
[JENKINS] Archiving <https://builds.apache.org/job/axiom-master/ws/axiom-api/pom.xml>
to org.apache.ws.commons.axiom/axiom-api/1.3.0-SNAPSHOT/axiom-api-1.3.0-SNAPSHOT.pom
[JENKINS] Archiving <https://builds.apache.org/job/axiom-master/ws/axiom-api/target/axiom-api-1.3.0-SNAPSHOT.jar>
to org.apache.ws.commons.axiom/axiom-api/1.3.0-20191106.173232-540/axiom-api-1.3.0-20191106.173232-540.jar
[JENKINS] Archiving <https://builds.apache.org/job/axiom-master/ws/axiom-api/target/axiom-api-1.3.0-SNAPSHOT-sources.jar>
to org.apache.ws.commons.axiom/axiom-api/1.3.0-20191106.173232-540/axiom-api-1.3.0-20191106.173232-540-sources.jar
[JENKINS] Archiving <https://builds.apache.org/job/axiom-master/ws/axiom-api/target/axiom-api-1.3.0-SNAPSHOT-javadoc.jar>
to org.apache.ws.commons.axiom/axiom-api/1.3.0-20191106.173232-540/axiom-api-1.3.0-20191106.173232-540-javadoc.jar
[JENKINS] Archiving <https://builds.apache.org/job/axiom-master/ws/systests/jaxws-tests/pom.xml>
to org.apache.ws.commons.axiom/jaxws-tests/1.3.0-SNAPSHOT/jaxws-tests-1.3.0-SNAPSHOT.pom
[JENKINS] Archiving <https://builds.apache.org/job/axiom-master/ws/systests/jaxws-tests/target/jaxws-tests-1.3.0-SNAPSHOT.jar>
to org.apache.ws.commons.axiom/jaxws-tests/1.3.0-SNAPSHOT/jaxws-tests-1.3.0-SNAPSHOT.jar
[JENKINS] Archiving <https://builds.apache.org/job/axiom-master/ws/systests/jaxws-tests/target/jaxws-tests-1.3.0-SNAPSHOT-sources.jar>
to org.apache.ws.commons.axiom/jaxws-tests/1.3.0-SNAPSHOT/jaxws-tests-1.3.0-SNAPSHOT-sources.jar
[JENKINS] Archiving <https://builds.apache.org/job/axiom-master/ws/systests/psychopath-tests/pom.xml>
to org.apache.ws.commons.axiom/psychopath-tests/1.3.0-SNAPSHOT/psychopath-tests-1.3.0-SNAPSHOT.pom
[JENKINS] Archiving <https://builds.apache.org/job/axiom-master/ws/systests/psychopath-tests/target/psychopath-tests-1.3.0-SNAPSHOT.jar>
to org.apache.ws.commons.axiom/psychopath-tests/1.3.0-SNAPSHOT/psychopath-tests-1.3.0-SNAPSHOT.jar
[JENKINS] Archiving <https://builds.apache.org/job/axiom-master/ws/systests/psychopath-tests/target/psychopath-tests-1.3.0-SNAPSHOT-sources.jar>
to org.apache.ws.commons.axiom/psychopath-tests/1.3.0-SNAPSHOT/psychopath-tests-1.3.0-SNAPSHOT-sources.jar
[JENKINS] Archiving <https://builds.apache.org/job/axiom-master/ws/testing/dom-testsuite/pom.xml>
to org.apache.ws.commons.axiom/dom-testsuite/1.3.0-SNAPSHOT/dom-testsuite-1.3.0-SNAPSHOT.pom
[JENKINS] Archiving <https://builds.apache.org/job/axiom-master/ws/testing/dom-testsuite/target/dom-testsuite-1.3.0-SNAPSHOT.jar>
to org.apache.ws.commons.axiom/dom-testsuite/1.3.0-20191106.174151-536/dom-testsuite-1.3.0-20191106.174151-536.jar
[JENKINS] Archiving <https://builds.apache.org/job/axiom-master/ws/testing/dom-testsuite/target/dom-testsuite-1.3.0-SNAPSHOT-sources.jar>
to org.apache.ws.commons.axiom/dom-testsuite/1.3.0-20191106.174151-536/dom-testsuite-1.3.0-20191106.174151-536-sources.jar
[JENKINS] Archiving <https://builds.apache.org/job/axiom-master/ws/testing/dom-testsuite/target/dom-testsuite-1.3.0-SNAPSHOT-javadoc.jar>
to org.apache.ws.commons.axiom/dom-testsuite/1.3.0-20191106.174151-536/dom-testsuite-1.3.0-20191106.174151-536-javadoc.jar
[JENKINS] Archiving <https://builds.apache.org/job/axiom-master/ws/implementations/axiom-impl/pom.xml>
to org.apache.ws.commons.axiom/axiom-impl/1.3.0-SNAPSHOT/axiom-impl-1.3.0-SNAPSHOT.pom
[JENKINS] Archiving <https://builds.apache.org/job/axiom-master/ws/implementations/axiom-impl/target/axiom-impl-1.3.0-SNAPSHOT.jar>
to org.apache.ws.commons.axiom/axiom-impl/1.3.0-20191106.174005-536/axiom-impl-1.3.0-20191106.174005-536.jar
[JENKINS] Archiving <https://builds.apache.org/job/axiom-master/ws/implementations/axiom-impl/target/axiom-impl-1.3.0-SNAPSHOT-sources.jar>
to org.apache.ws.commons.axiom/axiom-impl/1.3.0-20191106.174005-536/axiom-impl-1.3.0-20191106.174005-536-sources.jar
[JENKINS] Archiving <https://builds.apache.org/job/axiom-master/ws/implementations/axiom-impl/target/axiom-impl-1.3.0-SNAPSHOT-javadoc.jar>
to org.apache.ws.commons.axiom/axiom-impl/1.3.0-20191106.174005-536/axiom-impl-1.3.0-20191106.174005-536-javadoc.jar
[JENKINS] Archiving <https://builds.apache.org/job/axiom-master/ws/systests/wildfly-tests/pom.xml>
to org.apache.ws.commons.axiom/wildfly-tests/1.3.0-SNAPSHOT/wildfly-tests-1.3.0-SNAPSHOT.pom
[JENKINS] Archiving <https://builds.apache.org/job/axiom-master/ws/systests/wildfly-tests/target/wildfly-tests-1.3.0-SNAPSHOT.jar>
to org.apache.ws.commons.axiom/wildfly-tests/1.3.0-SNAPSHOT/wildfly-tests-1.3.0-SNAPSHOT.jar
[JENKINS] Archiving <https://builds.apache.org/job/axiom-master/ws/systests/wildfly-tests/target/wildfly-tests-1.3.0-SNAPSHOT-sources.jar>
to org.apache.ws.commons.axiom/wildfly-tests/1.3.0-SNAPSHOT/wildfly-tests-1.3.0-SNAPSHOT-sources.jar
[JENKINS] Archiving <https://builds.apache.org/job/axiom-master/ws/components/core-streams/pom.xml>
to org.apache.ws.commons.axiom/core-streams/1.3.0-SNAPSHOT/core-streams-1.3.0-SNAPSHOT.pom
[JENKINS] Archiving <https://builds.apache.org/job/axiom-master/ws/components/core-streams/target/core-streams-1.3.0-SNAPSHOT.jar>
to org.apache.ws.commons.axiom/core-streams/1.3.0-20191106.173307-151/core-streams-1.3.0-20191106.173307-151.jar
[JENKINS] Archiving <https://builds.apache.org/job/axiom-master/ws/components/core-streams/target/core-streams-1.3.0-SNAPSHOT-sources.jar>
to org.apache.ws.commons.axiom/core-streams/1.3.0-20191106.173307-151/core-streams-1.3.0-20191106.173307-151-sources.jar
[JENKINS] Archiving <https://builds.apache.org/job/axiom-master/ws/components/core-streams/target/core-streams-1.3.0-SNAPSHOT-javadoc.jar>
to org.apache.ws.commons.axiom/core-streams/1.3.0-20191106.173307-151/core-streams-1.3.0-20191106.173307-151-javadoc.jar
[JENKINS] Archiving <https://builds.apache.org/job/axiom-master/ws/testing/testutils/pom.xml>
to org.apache.ws.commons.axiom/testutils/1.3.0-SNAPSHOT/testutils-1.3.0-SNAPSHOT.pom
[JENKINS] Archiving <https://builds.apache.org/job/axiom-master/ws/testing/testutils/target/testutils-1.3.0-SNAPSHOT.jar>
to org.apache.ws.commons.axiom/testutils/1.3.0-20191106.172836-542/testutils-1.3.0-20191106.172836-542.jar
[JENKINS] Archiving <https://builds.apache.org/job/axiom-master/ws/testing/testutils/target/testutils-1.3.0-SNAPSHOT-sources.jar>
to org.apache.ws.commons.axiom/testutils/1.3.0-20191106.172836-542/testutils-1.3.0-20191106.172836-542-sources.jar
[JENKINS] Archiving <https://builds.apache.org/job/axiom-master/ws/testing/testutils/target/testutils-1.3.0-SNAPSHOT-javadoc.jar>
to org.apache.ws.commons.axiom/testutils/1.3.0-20191106.172836-542/testutils-1.3.0-20191106.172836-542-javadoc.jar
[JENKINS] Archiving <https://builds.apache.org/job/axiom-master/ws/testing/xml-truth/pom.xml>
to org.apache.ws.commons.axiom/xml-truth/1.3.0-SNAPSHOT/xml-truth-1.3.0-SNAPSHOT.pom
[JENKINS] Archiving <https://builds.apache.org/job/axiom-master/ws/testing/xml-truth/target/xml-truth-1.3.0-SNAPSHOT.jar>
to org.apache.ws.commons.axiom/xml-truth/1.3.0-20191106.172959-540/xml-truth-1.3.0-20191106.172959-540.jar
[JENKINS] Archiving <https://builds.apache.org/job/axiom-master/ws/testing/xml-truth/target/xml-truth-1.3.0-SNAPSHOT-sources.jar>
to org.apache.ws.commons.axiom/xml-truth/1.3.0-20191106.172959-540/xml-truth-1.3.0-20191106.172959-540-sources.jar
[JENKINS] Archiving <https://builds.apache.org/job/axiom-master/ws/testing/xml-truth/target/xml-truth-1.3.0-SNAPSHOT-javadoc.jar>
to org.apache.ws.commons.axiom/xml-truth/1.3.0-20191106.172959-540/xml-truth-1.3.0-20191106.172959-540-javadoc.jar
[JENKINS] Archiving <https://builds.apache.org/job/axiom-master/ws/apidocs/pom.xml>
to org.apache.ws.commons.axiom/apidocs/1.3.0-SNAPSHOT/apidocs-1.3.0-SNAPSHOT.pom
[JENKINS] Archiving <https://builds.apache.org/job/axiom-master/ws/apidocs/target/apidocs-1.3.0-SNAPSHOT-javadoc.zip>
to org.apache.ws.commons.axiom/apidocs/1.3.0-SNAPSHOT/apidocs-1.3.0-SNAPSHOT-javadoc.zip
[JENKINS] Archiving <https://builds.apache.org/job/axiom-master/ws/testing/xml-testsuite/pom.xml>
to org.apache.ws.commons.axiom/xml-testsuite/1.3.0-SNAPSHOT/xml-testsuite-1.3.0-SNAPSHOT.pom
[JENKINS] Archiving <https://builds.apache.org/job/axiom-master/ws/testing/xml-testsuite/target/xml-testsuite-1.3.0-SNAPSHOT.jar>
to org.apache.ws.commons.axiom/xml-testsuite/1.3.0-20191106.172901-542/xml-testsuite-1.3.0-20191106.172901-542.jar
[JENKINS] Archiving <https://builds.apache.org/job/axiom-master/ws/testing/xml-testsuite/target/xml-testsuite-1.3.0-SNAPSHOT-sources.jar>
to org.apache.ws.commons.axiom/xml-testsuite/1.3.0-20191106.172901-542/xml-testsuite-1.3.0-20191106.172901-542-sources.jar
[JENKINS] Archiving <https://builds.apache.org/job/axiom-master/ws/testing/xml-testsuite/target/xml-testsuite-1.3.0-SNAPSHOT-javadoc.jar>
to org.apache.ws.commons.axiom/xml-testsuite/1.3.0-20191106.172901-542/xml-testsuite-1.3.0-20191106.172901-542-javadoc.jar
[JENKINS] Archiving <https://builds.apache.org/job/axiom-master/ws/systests/compat-tests/pom.xml>
to org.apache.ws.commons.axiom/compat-tests/1.3.0-SNAPSHOT/compat-tests-1.3.0-SNAPSHOT.pom
[JENKINS] Archiving <https://builds.apache.org/job/axiom-master/ws/systests/compat-tests/target/compat-tests-1.3.0-SNAPSHOT.jar>
to org.apache.ws.commons.axiom/compat-tests/1.3.0-SNAPSHOT/compat-tests-1.3.0-SNAPSHOT.jar
[JENKINS] Archiving <https://builds.apache.org/job/axiom-master/ws/systests/compat-tests/target/compat-tests-1.3.0-SNAPSHOT-sources.jar>
to org.apache.ws.commons.axiom/compat-tests/1.3.0-SNAPSHOT/compat-tests-1.3.0-SNAPSHOT-sources.jar
[JENKINS] Archiving <https://builds.apache.org/job/axiom-master/ws/samples/pom.xml>
to org.apache.ws.commons.axiom/samples/1.3.0-SNAPSHOT/samples-1.3.0-SNAPSHOT.pom
[JENKINS] Archiving <https://builds.apache.org/job/axiom-master/ws/samples/target/samples-1.3.0-SNAPSHOT.jar>
to org.apache.ws.commons.axiom/samples/1.3.0-SNAPSHOT/samples-1.3.0-SNAPSHOT.jar
[JENKINS] Archiving <https://builds.apache.org/job/axiom-master/ws/samples/target/samples-1.3.0-SNAPSHOT-sources.jar>
to org.apache.ws.commons.axiom/samples/1.3.0-SNAPSHOT/samples-1.3.0-SNAPSHOT-sources.jar
[JENKINS] Archiving <https://builds.apache.org/job/axiom-master/ws/buildutils/pom.xml>
to org.apache.ws.commons.axiom/buildutils/1.3.0-SNAPSHOT/buildutils-1.3.0-SNAPSHOT.pom
[JENKINS] Archiving <https://builds.apache.org/job/axiom-master/ws/axiom-all/pom.xml>
to org.apache.ws.commons.axiom/axiom-all/1.3.0-SNAPSHOT/axiom-all-1.3.0-SNAPSHOT.pom
[JENKINS] Archiving <https://builds.apache.org/job/axiom-master/ws/axiom-all/target/axiom-all-1.3.0-SNAPSHOT.jar>
to org.apache.ws.commons.axiom/axiom-all/1.3.0-SNAPSHOT/axiom-all-1.3.0-SNAPSHOT.jar
[JENKINS] Archiving <https://builds.apache.org/job/axiom-master/ws/axiom-all/target/axiom-all-1.3.0-SNAPSHOT-sources.jar>
to org.apache.ws.commons.axiom/axiom-all/1.3.0-SNAPSHOT/axiom-all-1.3.0-SNAPSHOT-sources.jar
[JENKINS] Archiving <https://builds.apache.org/job/axiom-master/ws/implementations/pom.xml>
to org.apache.ws.commons.axiom/implementations/1.3.0-SNAPSHOT/implementations-1.3.0-SNAPSHOT.pom
[JENKINS] Archiving <https://builds.apache.org/job/axiom-master/ws/implementations/target/implementations-1.3.0-SNAPSHOT-site.xml>
to org.apache.ws.commons.axiom/implementations/1.3.0-20191106.173755-538/implementations-1.3.0-20191106.173755-538-site.xml
[JENKINS] Archiving <https://builds.apache.org/job/axiom-master/ws/systests/pom.xml>
to org.apache.ws.commons.axiom/systests/1.3.0-SNAPSHOT/systests-1.3.0-SNAPSHOT.pom
[JENKINS] Archiving <https://builds.apache.org/job/axiom-master/ws/distribution/pom.xml>
to org.apache.ws.commons.axiom/distribution/1.3.0-SNAPSHOT/distribution-1.3.0-SNAPSHOT.pom
[JENKINS] Archiving <https://builds.apache.org/job/axiom-master/ws/distribution/target/axiom-1.3.0-SNAPSHOT-bin.zip>
to org.apache.ws.commons.axiom/distribution/1.3.0-SNAPSHOT/distribution-1.3.0-SNAPSHOT-bin.zip
[JENKINS] Archiving <https://builds.apache.org/job/axiom-master/ws/distribution/target/axiom-1.3.0-SNAPSHOT-src.zip>
to org.apache.ws.commons.axiom/distribution/1.3.0-SNAPSHOT/distribution-1.3.0-SNAPSHOT-src.zip
[JENKINS] Archiving <https://builds.apache.org/job/axiom-master/ws/testing/axiom-truth/pom.xml>
to org.apache.ws.commons.axiom/axiom-truth/1.3.0-SNAPSHOT/axiom-truth-1.3.0-SNAPSHOT.pom
[JENKINS] Archiving <https://builds.apache.org/job/axiom-master/ws/testing/axiom-truth/target/axiom-truth-1.3.0-SNAPSHOT.jar>
to org.apache.ws.commons.axiom/axiom-truth/1.3.0-20191106.173536-539/axiom-truth-1.3.0-20191106.173536-539.jar
[JENKINS] Archiving <https://builds.apache.org/job/axiom-master/ws/testing/axiom-truth/target/axiom-truth-1.3.0-SNAPSHOT-sources.jar>
to org.apache.ws.commons.axiom/axiom-truth/1.3.0-20191106.173536-539/axiom-truth-1.3.0-20191106.173536-539-sources.jar
[JENKINS] Archiving <https://builds.apache.org/job/axiom-master/ws/testing/axiom-truth/target/axiom-truth-1.3.0-SNAPSHOT-javadoc.jar>
to org.apache.ws.commons.axiom/axiom-truth/1.3.0-20191106.173536-539/axiom-truth-1.3.0-20191106.173536-539-javadoc.jar
[JENKINS] Archiving <https://builds.apache.org/job/axiom-master/ws/buildutils/buildutils-maven-plugin/pom.xml>
to org.apache.ws.commons.axiom/buildutils-maven-plugin/1.3.0-SNAPSHOT/buildutils-maven-plugin-1.3.0-SNAPSHOT.pom
[JENKINS] Archiving <https://builds.apache.org/job/axiom-master/ws/buildutils/buildutils-maven-plugin/target/buildutils-maven-plugin-1.3.0-SNAPSHOT.jar>
to org.apache.ws.commons.axiom/buildutils-maven-plugin/1.3.0-20191106.172536-113/buildutils-maven-plugin-1.3.0-20191106.172536-113.jar
[JENKINS] Archiving <https://builds.apache.org/job/axiom-master/ws/buildutils/buildutils-maven-plugin/target/buildutils-maven-plugin-1.3.0-SNAPSHOT-sources.jar>
to org.apache.ws.commons.axiom/buildutils-maven-plugin/1.3.0-20191106.172536-113/buildutils-maven-plugin-1.3.0-20191106.172536-113-sources.jar
[JENKINS] Archiving <https://builds.apache.org/job/axiom-master/ws/buildutils/buildutils-maven-plugin/target/buildutils-maven-plugin-1.3.0-SNAPSHOT-javadoc.jar>
to org.apache.ws.commons.axiom/buildutils-maven-plugin/1.3.0-20191106.172536-113/buildutils-maven-plugin-1.3.0-20191106.172536-113-javadoc.jar
[JENKINS] Archiving <https://builds.apache.org/job/axiom-master/ws/systests/spring-ws-tests/pom.xml>
to org.apache.ws.commons.axiom/spring-ws-tests/1.3.0-SNAPSHOT/spring-ws-tests-1.3.0-SNAPSHOT.pom
[JENKINS] Archiving <https://builds.apache.org/job/axiom-master/ws/systests/spring-ws-tests/target/spring-ws-tests-1.3.0-SNAPSHOT.jar>
to org.apache.ws.commons.axiom/spring-ws-tests/1.3.0-SNAPSHOT/spring-ws-tests-1.3.0-SNAPSHOT.jar
[JENKINS] Archiving <https://builds.apache.org/job/axiom-master/ws/systests/spring-ws-tests/target/spring-ws-tests-1.3.0-SNAPSHOT-sources.jar>
to org.apache.ws.commons.axiom/spring-ws-tests/1.3.0-SNAPSHOT/spring-ws-tests-1.3.0-SNAPSHOT-sources.jar
[JENKINS] Archiving <https://builds.apache.org/job/axiom-master/ws/aspects/om-aspects/pom.xml>
to org.apache.ws.commons.axiom/om-aspects/1.3.0-SNAPSHOT/om-aspects-1.3.0-SNAPSHOT.pom
[JENKINS] Archiving <https://builds.apache.org/job/axiom-master/ws/aspects/om-aspects/target/om-aspects-1.3.0-SNAPSHOT.jar>
to org.apache.ws.commons.axiom/om-aspects/1.3.0-20191106.173450-539/om-aspects-1.3.0-20191106.173450-539.jar
[JENKINS] Archiving <https://builds.apache.org/job/axiom-master/ws/aspects/om-aspects/target/om-aspects-1.3.0-SNAPSHOT-sources.jar>
to org.apache.ws.commons.axiom/om-aspects/1.3.0-20191106.173450-539/om-aspects-1.3.0-20191106.173450-539-sources.jar
[JENKINS] Archiving <https://builds.apache.org/job/axiom-master/ws/aspects/om-aspects/target/om-aspects-1.3.0-SNAPSHOT-javadoc.jar>
to org.apache.ws.commons.axiom/om-aspects/1.3.0-20191106.173450-539/om-aspects-1.3.0-20191106.173450-539-javadoc.jar
[Fast Archiver] Compressed 1.47 MB of artifacts by 19.2% relative to #3005
[JENKINS] Archiving <https://builds.apache.org/job/axiom-master/ws/testing/jaxen-testsuite/pom.xml>
to org.apache.ws.commons.axiom/jaxen-testsuite/1.3.0-SNAPSHOT/jaxen-testsuite-1.3.0-SNAPSHOT.pom
[JENKINS] Archiving <https://builds.apache.org/job/axiom-master/ws/testing/jaxen-testsuite/target/jaxen-testsuite-1.3.0-SNAPSHOT.jar>
to org.apache.ws.commons.axiom/jaxen-testsuite/1.3.0-20191106.173559-538/jaxen-testsuite-1.3.0-20191106.173559-538.jar
[JENKINS] Archiving <https://builds.apache.org/job/axiom-master/ws/testing/jaxen-testsuite/target/jaxen-testsuite-1.3.0-SNAPSHOT-sources.jar>
to org.apache.ws.commons.axiom/jaxen-testsuite/1.3.0-20191106.173559-538/jaxen-testsuite-1.3.0-20191106.173559-538-sources.jar
[JENKINS] Archiving <https://builds.apache.org/job/axiom-master/ws/testing/jaxen-testsuite/target/jaxen-testsuite-1.3.0-SNAPSHOT-javadoc.jar>
to org.apache.ws.commons.axiom/jaxen-testsuite/1.3.0-20191106.173559-538/jaxen-testsuite-1.3.0-20191106.173559-538-javadoc.jar
[Fast Archiver] Compressed 251.46 KB of artifacts by 25.5% relative to #3005
[JENKINS] Archiving <https://builds.apache.org/job/axiom-master/ws/systests/eclipse-tests/pom.xml>
to org.apache.ws.commons.axiom/eclipse-tests/1.3.0-SNAPSHOT/eclipse-tests-1.3.0-SNAPSHOT.pom
[JENKINS] Archiving <https://builds.apache.org/job/axiom-master/ws/systests/eclipse-tests/target/eclipse-tests-1.3.0-SNAPSHOT.jar>
to org.apache.ws.commons.axiom/eclipse-tests/1.3.0-SNAPSHOT/eclipse-tests-1.3.0-SNAPSHOT.jar
[JENKINS] Archiving <https://builds.apache.org/job/axiom-master/ws/systests/eclipse-tests/target/eclipse-tests-1.3.0-SNAPSHOT-sources.jar>
to org.apache.ws.commons.axiom/eclipse-tests/1.3.0-SNAPSHOT/eclipse-tests-1.3.0-SNAPSHOT-sources.jar
[JENKINS] Archiving <https://builds.apache.org/job/axiom-master/ws/aspects/shared-aspects/pom.xml>
to org.apache.ws.commons.axiom/shared-aspects/1.3.0-SNAPSHOT/shared-aspects-1.3.0-SNAPSHOT.pom
[JENKINS] Archiving <https://builds.apache.org/job/axiom-master/ws/aspects/shared-aspects/target/shared-aspects-1.3.0-SNAPSHOT.jar>
to org.apache.ws.commons.axiom/shared-aspects/1.3.0-20191106.173410-540/shared-aspects-1.3.0-20191106.173410-540.jar
[JENKINS] Archiving <https://builds.apache.org/job/axiom-master/ws/aspects/shared-aspects/target/shared-aspects-1.3.0-SNAPSHOT-sources.jar>
to org.apache.ws.commons.axiom/shared-aspects/1.3.0-20191106.173410-540/shared-aspects-1.3.0-20191106.173410-540-sources.jar
[JENKINS] Archiving <https://builds.apache.org/job/axiom-master/ws/aspects/shared-aspects/target/shared-aspects-1.3.0-SNAPSHOT-javadoc.jar>
to org.apache.ws.commons.axiom/shared-aspects/1.3.0-20191106.173410-540/shared-aspects-1.3.0-20191106.173410-540-javadoc.jar
[JENKINS] Archiving <https://builds.apache.org/job/axiom-master/ws/buildutils/shade-axiom-xml/pom.xml>
to org.apache.ws.commons.axiom/shade-axiom-xml/1.3.0-SNAPSHOT/shade-axiom-xml-1.3.0-SNAPSHOT.pom
[JENKINS] Archiving <https://builds.apache.org/job/axiom-master/ws/buildutils/shade-axiom-xml/target/shade-axiom-xml-1.3.0-SNAPSHOT.jar>
to org.apache.ws.commons.axiom/shade-axiom-xml/1.3.0-20191106.172601-546/shade-axiom-xml-1.3.0-20191106.172601-546.jar
[JENKINS] Archiving <https://builds.apache.org/job/axiom-master/ws/buildutils/shade-axiom-xml/target/shade-axiom-xml-1.3.0-SNAPSHOT-sources.jar>
to org.apache.ws.commons.axiom/shade-axiom-xml/1.3.0-20191106.172601-546/shade-axiom-xml-1.3.0-20191106.172601-546-sources.jar
[JENKINS] Archiving <https://builds.apache.org/job/axiom-master/ws/buildutils/shade-axiom-xml/target/shade-axiom-xml-1.3.0-SNAPSHOT-javadoc.jar>
to org.apache.ws.commons.axiom/shade-axiom-xml/1.3.0-20191106.172601-546/shade-axiom-xml-1.3.0-20191106.172601-546-javadoc.jar
[JENKINS] Archiving <https://builds.apache.org/job/axiom-master/ws/axiom-jaxb/pom.xml>
to org.apache.ws.commons.axiom/axiom-jaxb/1.3.0-SNAPSHOT/axiom-jaxb-1.3.0-SNAPSHOT.pom
[JENKINS] Archiving <https://builds.apache.org/job/axiom-master/ws/axiom-jaxb/target/axiom-jaxb-1.3.0-SNAPSHOT.jar>
to org.apache.ws.commons.axiom/axiom-jaxb/1.3.0-20191106.173514-358/axiom-jaxb-1.3.0-20191106.173514-358.jar
[JENKINS] Archiving <https://builds.apache.org/job/axiom-master/ws/axiom-jaxb/target/axiom-jaxb-1.3.0-SNAPSHOT-sources.jar>
to org.apache.ws.commons.axiom/axiom-jaxb/1.3.0-20191106.173514-358/axiom-jaxb-1.3.0-20191106.173514-358-sources.jar
[JENKINS] Archiving <https://builds.apache.org/job/axiom-master/ws/axiom-jaxb/target/axiom-jaxb-1.3.0-SNAPSHOT-javadoc.jar>
to org.apache.ws.commons.axiom/axiom-jaxb/1.3.0-20191106.173514-358/axiom-jaxb-1.3.0-20191106.173514-358-javadoc.jar
[JENKINS] Archiving <https://builds.apache.org/job/axiom-master/ws/testing/axiom-testsuite/pom.xml>
to org.apache.ws.commons.axiom/axiom-testsuite/1.3.0-SNAPSHOT/axiom-testsuite-1.3.0-SNAPSHOT.pom
[JENKINS] Archiving <https://builds.apache.org/job/axiom-master/ws/testing/axiom-testsuite/target/axiom-testsuite-1.3.0-SNAPSHOT.jar>
to org.apache.ws.commons.axiom/axiom-testsuite/1.3.0-20191106.173731-538/axiom-testsuite-1.3.0-20191106.173731-538.jar
[JENKINS] Archiving <https://builds.apache.org/job/axiom-master/ws/testing/axiom-testsuite/target/axiom-testsuite-1.3.0-SNAPSHOT-sources.jar>
to org.apache.ws.commons.axiom/axiom-testsuite/1.3.0-20191106.173731-538/axiom-testsuite-1.3.0-20191106.173731-538-sources.jar
[JENKINS] Archiving <https://builds.apache.org/job/axiom-master/ws/testing/axiom-testsuite/target/axiom-testsuite-1.3.0-SNAPSHOT-javadoc.jar>
to org.apache.ws.commons.axiom/axiom-testsuite/1.3.0-20191106.173731-538/axiom-testsuite-1.3.0-20191106.173731-538-javadoc.jar
[JENKINS] Archiving <https://builds.apache.org/job/axiom-master/ws/testing/multiton/pom.xml>
to org.apache.ws.commons.axiom/multiton/1.3.0-SNAPSHOT/multiton-1.3.0-SNAPSHOT.pom
[JENKINS] Archiving <https://builds.apache.org/job/axiom-master/ws/testing/multiton/target/multiton-1.3.0-SNAPSHOT.jar>
to org.apache.ws.commons.axiom/multiton/1.3.0-20191106.172712-542/multiton-1.3.0-20191106.172712-542.jar
[JENKINS] Archiving <https://builds.apache.org/job/axiom-master/ws/testing/multiton/target/multiton-1.3.0-SNAPSHOT-sources.jar>
to org.apache.ws.commons.axiom/multiton/1.3.0-20191106.172712-542/multiton-1.3.0-20191106.172712-542-sources.jar
[JENKINS] Archiving <https://builds.apache.org/job/axiom-master/ws/testing/multiton/target/multiton-1.3.0-SNAPSHOT-javadoc.jar>
to org.apache.ws.commons.axiom/multiton/1.3.0-20191106.172712-542/multiton-1.3.0-20191106.172712-542-javadoc.jar
[JENKINS] Archiving <https://builds.apache.org/job/axiom-master/ws/axiom-compat/pom.xml>
to org.apache.ws.commons.axiom/axiom-compat/1.3.0-SNAPSHOT/axiom-compat-1.3.0-SNAPSHOT.pom
[JENKINS] Archiving <https://builds.apache.org/job/axiom-master/ws/axiom-compat/target/axiom-compat-1.3.0-SNAPSHOT.jar>
to org.apache.ws.commons.axiom/axiom-compat/1.3.0-20191106.174519-532/axiom-compat-1.3.0-20191106.174519-532.jar
[JENKINS] Archiving <https://builds.apache.org/job/axiom-master/ws/axiom-compat/target/axiom-compat-1.3.0-SNAPSHOT-sources.jar>
to org.apache.ws.commons.axiom/axiom-compat/1.3.0-20191106.174519-532/axiom-compat-1.3.0-20191106.174519-532-sources.jar
[JENKINS] Archiving <https://builds.apache.org/job/axiom-master/ws/axiom-compat/target/axiom-compat-1.3.0-SNAPSHOT-javadoc.jar>
to org.apache.ws.commons.axiom/axiom-compat/1.3.0-20191106.174519-532/axiom-compat-1.3.0-20191106.174519-532-javadoc.jar
[JENKINS] Archiving <https://builds.apache.org/job/axiom-master/ws/systests/old-tests/pom.xml>
to org.apache.ws.commons.axiom/old-tests/1.3.0-SNAPSHOT/old-tests-1.3.0-SNAPSHOT.pom
[JENKINS] Archiving <https://builds.apache.org/job/axiom-master/ws/systests/old-tests/target/old-tests-1.3.0-SNAPSHOT.jar>
to org.apache.ws.commons.axiom/old-tests/1.3.0-SNAPSHOT/old-tests-1.3.0-SNAPSHOT.jar
[JENKINS] Archiving <https://builds.apache.org/job/axiom-master/ws/systests/old-tests/target/old-tests-1.3.0-SNAPSHOT-sources.jar>
to org.apache.ws.commons.axiom/old-tests/1.3.0-SNAPSHOT/old-tests-1.3.0-SNAPSHOT-sources.jar
[JENKINS] Archiving <https://builds.apache.org/job/axiom-master/ws/components/pom.xml>
to org.apache.ws.commons.axiom/components/1.3.0-SNAPSHOT/components-1.3.0-SNAPSHOT.pom
[JENKINS] Archiving <https://builds.apache.org/job/axiom-master/ws/aspects/pom.xml>
to org.apache.ws.commons.axiom/aspects/1.3.0-SNAPSHOT/aspects-1.3.0-SNAPSHOT.pom
No mail will be sent out, as 'axiom-master » Core Aspects #3008' does not have a result
yet. Please make sure you set a proper result in case of pipeline/build scripts.
No mail will be sent out, as 'axiom-master » xml-utils #3008' does not have a result yet.
Please make sure you set a proper result in case of pipeline/build scripts.
No mail will be sent out, as 'axiom-master » WSS4J Tests #3008' does not have a result
yet. Please make sure you set a proper result in case of pipeline/build scripts.
Sending e-mails to: dev@ws.apache.org coheigea@apache.org
No mail will be sent out, as 'axiom-master » SOAP Test Suite #3008' does not have a result
yet. Please make sure you set a proper result in case of pipeline/build scripts.
No mail will be sent out, as 'axiom-master » User Guide #3008' does not have a result yet.
Please make sure you set a proper result in case of pipeline/build scripts.
No mail will be sent out, as 'axiom-master » Developer Guide #3008' does not have a result
yet. Please make sure you set a proper result in case of pipeline/build scripts.
No mail will be sent out, as 'axiom-master » Testing #3008' does not have a result yet.
Please make sure you set a proper result in case of pipeline/build scripts.
No mail will be sent out, as 'axiom-master » Axiom OSGi Tests #3008' does not have a result
yet. Please make sure you set a proper result in case of pipeline/build scripts.
Sending e-mails to: dev@ws.apache.org
No mail will be sent out, as 'axiom-master » Cross OM Tests #3008' does not have a result
yet. Please make sure you set a proper result in case of pipeline/build scripts.
No mail will be sent out, as 'axiom-master » Spring-WS Test Suite #3008' does not have
a result yet. Please make sure you set a proper result in case of pipeline/build scripts.
No mail will be sent out, as 'axiom-master » DOM Aspects #3008' does not have a result
yet. Please make sure you set a proper result in case of pipeline/build scripts.
No mail will be sent out, as 'axiom-master » DOOM #3008' does not have a result yet. Please
make sure you set a proper result in case of pipeline/build scripts.
No mail will be sent out, as 'axiom-master » base64-utils #3008' does not have a result
yet. Please make sure you set a proper result in case of pipeline/build scripts.
No mail will be sent out, as 'axiom-master » jaxp-testsuite #3008' does not have a result
yet. Please make sure you set a proper result in case of pipeline/build scripts.
No mail will be sent out, as 'axiom-master » Axiom API #3008' does not have a result yet.
Please make sure you set a proper result in case of pipeline/build scripts.
No mail will be sent out, as 'axiom-master » JAX-WS Tests #3008' does not have a result
yet. Please make sure you set a proper result in case of pipeline/build scripts.
No mail will be sent out, as 'axiom-master » psychopath-tests #3008' does not have a result
yet. Please make sure you set a proper result in case of pipeline/build scripts.
No mail will be sent out, as 'axiom-master » DOM Test Suite #3008' does not have a result
yet. Please make sure you set a proper result in case of pipeline/build scripts.
No mail will be sent out, as 'axiom-master » LLOM #3008' does not have a result yet. Please
make sure you set a proper result in case of pipeline/build scripts.
No mail will be sent out, as 'axiom-master » Wildfly Tests #3008' does not have a result
yet. Please make sure you set a proper result in case of pipeline/build scripts.
No mail will be sent out, as 'axiom-master » core-streams #3008' does not have a result
yet. Please make sure you set a proper result in case of pipeline/build scripts.
No mail will be sent out, as 'axiom-master » Axiom Test Utilities #3008' does not have
a result yet. Please make sure you set a proper result in case of pipeline/build scripts.
No mail will be sent out, as 'axiom-master » Google Truth extension for XML #3008' does
not have a result yet. Please make sure you set a proper result in case of pipeline/build
scripts.
No mail will be sent out, as 'axiom-master » Javadoc #3008' does not have a result yet.
Please make sure you set a proper result in case of pipeline/build scripts.
No mail will be sent out, as 'axiom-master » XML Test Suite #3008' does not have a result
yet. Please make sure you set a proper result in case of pipeline/build scripts.
No mail will be sent out, as 'axiom-master » compat-tests #3008' does not have a result
yet. Please make sure you set a proper result in case of pipeline/build scripts.
No mail will be sent out, as 'axiom-master » Samples #3008' does not have a result yet.
Please make sure you set a proper result in case of pipeline/build scripts.
No mail will be sent out, as 'axiom-master » Build utilities #3008' does not have a result
yet. Please make sure you set a proper result in case of pipeline/build scripts.
No mail will be sent out, as 'axiom-master » Axiom Uber-JAR #3008' does not have a result
yet. Please make sure you set a proper result in case of pipeline/build scripts.
No mail will be sent out, as 'axiom-master » Implementations #3008' does not have a result
yet. Please make sure you set a proper result in case of pipeline/build scripts.
No mail will be sent out, as 'axiom-master » System Tests #3008' does not have a result
yet. Please make sure you set a proper result in case of pipeline/build scripts.
No mail will be sent out, as 'axiom-master » Distribution #3008' does not have a result
yet. Please make sure you set a proper result in case of pipeline/build scripts.
No mail will be sent out, as 'axiom-master » Google Truth extension for Axiom #3008' does
not have a result yet. Please make sure you set a proper result in case of pipeline/build
scripts.
No mail will be sent out, as 'axiom-master » buildutils-maven-plugin #3008' does not have
a result yet. Please make sure you set a proper result in case of pipeline/build scripts.
No mail will be sent out, as 'axiom-master » Spring WS Tests #3008' does not have a result
yet. Please make sure you set a proper result in case of pipeline/build scripts.
No mail will be sent out, as 'axiom-master » OM Aspects #3008' does not have a result yet.
Please make sure you set a proper result in case of pipeline/build scripts.
No mail will be sent out, as 'axiom-master » Jaxen Test Suite #3008' does not have a result
yet. Please make sure you set a proper result in case of pipeline/build scripts.
No mail will be sent out, as 'axiom-master » Eclipse Tests #3008' does not have a result
yet. Please make sure you set a proper result in case of pipeline/build scripts.
No mail will be sent out, as 'axiom-master » Shared Aspects #3008' does not have a result
yet. Please make sure you set a proper result in case of pipeline/build scripts.
No mail will be sent out, as 'axiom-master » Resource Transformer for META-INF/axiom.xml
files #3008' does not have a result yet. Please make sure you set a proper result in case
of pipeline/build scripts.
No mail will be sent out, as 'axiom-master » Axiom JAXB Integration #3008' does not have
a result yet. Please make sure you set a proper result in case of pipeline/build scripts.
No mail will be sent out, as 'axiom-master » Axiom Implementation Test Suite #3008' does
not have a result yet. Please make sure you set a proper result in case of pipeline/build
scripts.
No mail will be sent out, as 'axiom-master » Multiton pattern implementation #3008' does
not have a result yet. Please make sure you set a proper result in case of pipeline/build
scripts.
No mail will be sent out, as 'axiom-master » Axiom Compatibility Classes #3008' does not
have a result yet. Please make sure you set a proper result in case of pipeline/build scripts.
No mail will be sent out, as 'axiom-master » Axiom Test Suite (old) #3008' does not have
a result yet. Please make sure you set a proper result in case of pipeline/build scripts.
No mail will be sent out, as 'axiom-master » components #3008' does not have a result yet.
Please make sure you set a proper result in case of pipeline/build scripts.
No mail will be sent out, as 'axiom-master » Aspects #3008' does not have a result yet.
Please make sure you set a proper result in case of pipeline/build scripts.
channel stopped

---------------------------------------------------------------------
To unsubscribe, e-mail: dev-unsubscribe@ws.apache.org
For additional commands, e-mail: dev-help@ws.apache.org


Mime
View raw message