ws-dev mailing list archives

Site index · List index
Message view « Date » · « Thread »
Top « Date » · « Thread »
From Apache Jenkins Server <jenk...@builds.apache.org>
Subject Build failed in Jenkins: axiom-master #3006
Date Wed, 06 Nov 2019 16:55:20 GMT
See <https://builds.apache.org/job/axiom-master/3006/display/redirect>

Changes:


------------------------------------------
[...truncated 342.41 KB...]
[INFO] Downloaded from central: https://repo.maven.apache.org/maven2/org/apache/maven/reporting/maven-reporting-api/2.0/maven-reporting-api-2.0.pom
(1.1 kB at 85 kB/s)
[INFO] Downloading from central: https://repo.maven.apache.org/maven2/org/apache/maven/reporting/maven-reporting/2.0/maven-reporting-2.0.pom
[INFO] Downloaded from central: https://repo.maven.apache.org/maven2/org/apache/maven/reporting/maven-reporting/2.0/maven-reporting-2.0.pom
(504 B at 39 kB/s)
[INFO] Downloading from central: https://repo.maven.apache.org/maven2/doxia/doxia-sink-api/1.0-alpha-4/doxia-sink-api-1.0-alpha-4.pom
[INFO] Downloaded from central: https://repo.maven.apache.org/maven2/doxia/doxia-sink-api/1.0-alpha-4/doxia-sink-api-1.0-alpha-4.pom
(1.1 kB at 91 kB/s)
[INFO] Downloading from central: https://repo.maven.apache.org/maven2/org/apache/maven/maven-error-diagnostics/2.0/maven-error-diagnostics-2.0.pom
[INFO] Downloaded from central: https://repo.maven.apache.org/maven2/org/apache/maven/maven-error-diagnostics/2.0/maven-error-diagnostics-2.0.pom
(812 B at 74 kB/s)
[INFO] Downloading from central: https://repo.maven.apache.org/maven2/org/apache/maven/maven-plugin-registry/2.0/maven-plugin-registry-2.0.pom
[INFO] Downloaded from central: https://repo.maven.apache.org/maven2/org/apache/maven/maven-plugin-registry/2.0/maven-plugin-registry-2.0.pom
(1.3 kB at 86 kB/s)
[INFO] Downloading from central: https://repo.maven.apache.org/maven2/org/apache/maven/maven-plugin-api/2.0/maven-plugin-api-2.0.pom
[INFO] Downloaded from central: https://repo.maven.apache.org/maven2/org/apache/maven/maven-plugin-api/2.0/maven-plugin-api-2.0.pom
(601 B at 46 kB/s)
[INFO] Downloading from central: https://repo.maven.apache.org/maven2/org/apache/maven/maven-plugin-descriptor/2.0/maven-plugin-descriptor-2.0.pom
[INFO] Downloaded from central: https://repo.maven.apache.org/maven2/org/apache/maven/maven-plugin-descriptor/2.0/maven-plugin-descriptor-2.0.pom
(1.5 kB at 122 kB/s)
[INFO] Downloading from central: https://repo.maven.apache.org/maven2/org/apache/maven/maven-monitor/2.0/maven-monitor-2.0.pom
[INFO] Downloaded from central: https://repo.maven.apache.org/maven2/org/apache/maven/maven-monitor/2.0/maven-monitor-2.0.pom
(400 B at 17 kB/s)
[INFO] Downloading from central: https://repo.maven.apache.org/maven2/org/codehaus/plexus/plexus-archiver/1.0-alpha-7/plexus-archiver-1.0-alpha-7.pom
[INFO] Downloaded from central: https://repo.maven.apache.org/maven2/org/codehaus/plexus/plexus-archiver/1.0-alpha-7/plexus-archiver-1.0-alpha-7.pom
(1.0 kB at 87 kB/s)
[INFO] Downloading from central: https://repo.maven.apache.org/maven2/org/codehaus/plexus/plexus-components/1.1.6/plexus-components-1.1.6.pom
[INFO] Downloaded from central: https://repo.maven.apache.org/maven2/org/codehaus/plexus/plexus-components/1.1.6/plexus-components-1.1.6.pom
(1.9 kB at 145 kB/s)
[INFO] Downloading from central: https://repo.maven.apache.org/maven2/org/codehaus/plexus/plexus-utils/1.2/plexus-utils-1.2.pom
[INFO] Downloaded from central: https://repo.maven.apache.org/maven2/org/codehaus/plexus/plexus-utils/1.2/plexus-utils-1.2.pom
(767 B at 59 kB/s)
[INFO] Downloading from central: https://repo.maven.apache.org/maven2/org/codehaus/plexus/plexus/1.0.5/plexus-1.0.5.pom
[INFO] Downloaded from central: https://repo.maven.apache.org/maven2/org/codehaus/plexus/plexus/1.0.5/plexus-1.0.5.pom
(5.9 kB at 495 kB/s)
[INFO] Downloading from central: https://repo.maven.apache.org/maven2/org/codehaus/plexus/plexus-utils/3.0.8/plexus-utils-3.0.8.pom
[INFO] Downloaded from central: https://repo.maven.apache.org/maven2/org/codehaus/plexus/plexus-utils/3.0.8/plexus-utils-3.0.8.pom
(3.1 kB at 262 kB/s)
[INFO] Downloading from central: https://repo.maven.apache.org/maven2/org/apache/rat/apache-rat-core/0.11/apache-rat-core-0.11.jar
[INFO] Downloading from central: https://repo.maven.apache.org/maven2/commons-lang/commons-lang/2.6/commons-lang-2.6.jar
[INFO] Downloading from central: https://repo.maven.apache.org/maven2/commons-io/commons-io/2.2/commons-io-2.2.jar
[INFO] Downloading from central: https://repo.maven.apache.org/maven2/org/apache/commons/commons-compress/1.5/commons-compress-1.5.jar
[INFO] Downloading from central: https://repo.maven.apache.org/maven2/org/apache/maven/doxia/doxia-core/1.2/doxia-core-1.2.jar
[INFO] Downloaded from central: https://repo.maven.apache.org/maven2/org/apache/rat/apache-rat-core/0.11/apache-rat-core-0.11.jar
(118 kB at 4.9 MB/s)
[INFO] Downloading from central: https://repo.maven.apache.org/maven2/org/apache/maven/doxia/doxia-logging-api/1.2/doxia-logging-api-1.2.jar
[INFO] Downloaded from central: https://repo.maven.apache.org/maven2/org/apache/maven/doxia/doxia-core/1.2/doxia-core-1.2.jar
(154 kB at 6.7 MB/s)
[INFO] Downloading from central: https://repo.maven.apache.org/maven2/xerces/xercesImpl/2.9.1/xercesImpl-2.9.1.jar
[INFO] Downloaded from central: https://repo.maven.apache.org/maven2/commons-io/commons-io/2.2/commons-io-2.2.jar
(174 kB at 7.2 MB/s)
[INFO] Downloading from central: https://repo.maven.apache.org/maven2/xml-apis/xml-apis/1.3.04/xml-apis-1.3.04.jar
[INFO] Downloaded from central: https://repo.maven.apache.org/maven2/commons-lang/commons-lang/2.6/commons-lang-2.6.jar
(284 kB at 8.9 MB/s)
[INFO] Downloaded from central: https://repo.maven.apache.org/maven2/org/apache/commons/commons-compress/1.5/commons-compress-1.5.jar
(256 kB at 8.0 MB/s)
[INFO] Downloading from central: https://repo.maven.apache.org/maven2/commons-logging/commons-logging/1.1.1/commons-logging-1.1.1.jar
[INFO] Downloading from central: https://repo.maven.apache.org/maven2/org/apache/maven/doxia/doxia-decoration-model/1.2/doxia-decoration-model-1.2.jar
[INFO] Downloaded from central: https://repo.maven.apache.org/maven2/org/apache/maven/doxia/doxia-logging-api/1.2/doxia-logging-api-1.2.jar
(11 kB at 307 kB/s)
[INFO] Downloading from central: https://repo.maven.apache.org/maven2/org/apache/maven/doxia/doxia-sink-api/1.2/doxia-sink-api-1.2.jar
[INFO] Downloaded from central: https://repo.maven.apache.org/maven2/org/apache/maven/doxia/doxia-sink-api/1.2/doxia-sink-api-1.2.jar
(11 kB at 229 kB/s)
[INFO] Downloading from central: https://repo.maven.apache.org/maven2/org/apache/maven/doxia/doxia-site-renderer/1.2/doxia-site-renderer-1.2.jar
[INFO] Downloaded from central: https://repo.maven.apache.org/maven2/xml-apis/xml-apis/1.3.04/xml-apis-1.3.04.jar
(194 kB at 3.9 MB/s)
[INFO] Downloading from central: https://repo.maven.apache.org/maven2/org/apache/maven/doxia/doxia-module-xhtml/1.2/doxia-module-xhtml-1.2.jar
[INFO] Downloaded from central: https://repo.maven.apache.org/maven2/commons-logging/commons-logging/1.1.1/commons-logging-1.1.1.jar
(61 kB at 1.2 MB/s)
[INFO] Downloading from central: https://repo.maven.apache.org/maven2/org/apache/maven/doxia/doxia-module-fml/1.2/doxia-module-fml-1.2.jar
[INFO] Downloaded from central: https://repo.maven.apache.org/maven2/org/apache/maven/doxia/doxia-decoration-model/1.2/doxia-decoration-model-1.2.jar
(60 kB at 1.1 MB/s)
[INFO] Downloading from central: https://repo.maven.apache.org/maven2/org/apache/maven/shared/maven-plugin-testing-harness/1.1/maven-plugin-testing-harness-1.1.jar
[INFO] Downloaded from central: https://repo.maven.apache.org/maven2/org/apache/maven/doxia/doxia-site-renderer/1.2/doxia-site-renderer-1.2.jar
(52 kB at 814 kB/s)
[INFO] Downloading from central: https://repo.maven.apache.org/maven2/org/apache/maven/maven-core/2.0/maven-core-2.0.jar
[INFO] Downloaded from central: https://repo.maven.apache.org/maven2/org/apache/maven/doxia/doxia-module-xhtml/1.2/doxia-module-xhtml-1.2.jar
(15 kB at 232 kB/s)
[INFO] Downloading from central: https://repo.maven.apache.org/maven2/org/apache/maven/maven-plugin-parameter-documenter/2.0/maven-plugin-parameter-documenter-2.0.jar
[INFO] Downloaded from central: https://repo.maven.apache.org/maven2/org/apache/maven/shared/maven-plugin-testing-harness/1.1/maven-plugin-testing-harness-1.1.jar
(32 kB at 478 kB/s)
[INFO] Downloaded from central: https://repo.maven.apache.org/maven2/org/apache/maven/doxia/doxia-module-fml/1.2/doxia-module-fml-1.2.jar
(38 kB at 557 kB/s)
[INFO] Downloading from central: https://repo.maven.apache.org/maven2/org/apache/maven/maven-error-diagnostics/2.0/maven-error-diagnostics-2.0.jar
[INFO] Downloading from central: https://repo.maven.apache.org/maven2/org/apache/maven/maven-plugin-descriptor/2.0/maven-plugin-descriptor-2.0.jar
[INFO] Downloaded from central: https://repo.maven.apache.org/maven2/org/apache/maven/maven-plugin-parameter-documenter/2.0/maven-plugin-parameter-documenter-2.0.jar
(18 kB at 223 kB/s)
[INFO] Downloading from central: https://repo.maven.apache.org/maven2/org/apache/maven/maven-monitor/2.0/maven-monitor-2.0.jar
[INFO] Downloaded from central: https://repo.maven.apache.org/maven2/org/apache/maven/maven-error-diagnostics/2.0/maven-error-diagnostics-2.0.jar
(10 kB at 127 kB/s)
[INFO] Downloading from central: https://repo.maven.apache.org/maven2/org/codehaus/plexus/plexus-archiver/1.0-alpha-7/plexus-archiver-1.0-alpha-7.jar
[INFO] Downloaded from central: https://repo.maven.apache.org/maven2/org/apache/maven/maven-plugin-descriptor/2.0/maven-plugin-descriptor-2.0.jar
(33 kB at 409 kB/s)
[INFO] Downloading from central: https://repo.maven.apache.org/maven2/org/codehaus/plexus/plexus-utils/3.0.8/plexus-utils-3.0.8.jar
[INFO] Downloaded from central: https://repo.maven.apache.org/maven2/org/apache/maven/maven-core/2.0/maven-core-2.0.jar
(136 kB at 1.6 MB/s)
[INFO] Downloaded from central: https://repo.maven.apache.org/maven2/org/apache/maven/maven-monitor/2.0/maven-monitor-2.0.jar
(7.6 kB at 83 kB/s)
[INFO] Downloaded from central: https://repo.maven.apache.org/maven2/org/codehaus/plexus/plexus-archiver/1.0-alpha-7/plexus-archiver-1.0-alpha-7.jar
(142 kB at 1.4 MB/s)
[INFO] Downloaded from central: https://repo.maven.apache.org/maven2/org/codehaus/plexus/plexus-utils/3.0.8/plexus-utils-3.0.8.jar
(232 kB at 2.2 MB/s)
[INFO] Downloaded from central: https://repo.maven.apache.org/maven2/xerces/xercesImpl/2.9.1/xercesImpl-2.9.1.jar
(1.2 MB at 10 MB/s)
[INFO] 66 implicit excludes (use -debug for more details).
[INFO] Exclude: RELEASE-NOTE.txt
[INFO] Exclude: src/site/markdown/release-notes/**
[INFO] Exclude: **/*.svg
[INFO] Exclude: legal/jaxen-LICENSE.txt
[INFO] Exclude: legal/stax2-api-LICENSE.txt
[INFO] Exclude: *.sonarj
[INFO] Exclude: release.properties
[INFO] Exclude: third_party/*.patch
[INFO] Exclude: bazel-*/**
[INFO] Exclude: src/test/resources/**
[INFO] Exclude: dependency-reduced-pom.xml
[INFO] 3227 resources included (use -debug for more details)
[INFO] Rat check: Summary of files. Unapproved: 2255 unknown: 2255 generated: 0 approved:
530 licence.
[INFO] ------------------------------------------------------------------------
[INFO] Reactor Summary:
[INFO] 
[INFO] Axiom .............................................. FAILURE [ 32.806 s]
[INFO] Build utilities .................................... SKIPPED
[INFO] buildutils-maven-plugin ............................ SKIPPED
[INFO] Resource Transformer for META-INF/axiom.xml files .. SKIPPED
[INFO] components ......................................... SKIPPED
[INFO] base64-utils ....................................... SKIPPED
[INFO] Testing ............................................ SKIPPED
[INFO] Multiton pattern implementation .................... SKIPPED
[INFO] Axiom Test Utilities ............................... SKIPPED
[INFO] XML Test Suite ..................................... SKIPPED
[INFO] jaxp-testsuite ..................................... SKIPPED
[INFO] Google Truth extension for XML ..................... SKIPPED
[INFO] xml-utils .......................................... SKIPPED
[INFO] SOAP Test Suite .................................... SKIPPED
[INFO] Axiom API .......................................... SKIPPED
[INFO] core-streams ....................................... SKIPPED
[INFO] Aspects ............................................ SKIPPED
[INFO] Core Aspects ....................................... SKIPPED
[INFO] Shared Aspects ..................................... SKIPPED
[INFO] OM Aspects ......................................... SKIPPED
[INFO] Axiom JAXB Integration ............................. SKIPPED
[INFO] Google Truth extension for Axiom ................... SKIPPED
[INFO] Jaxen Test Suite ................................... SKIPPED
[INFO] Axiom Implementation Test Suite .................... SKIPPED
[INFO] Implementations .................................... SKIPPED
[INFO] LLOM ............................................... SKIPPED
[INFO] DOM Aspects ........................................ SKIPPED
[INFO] DOM Test Suite ..................................... SKIPPED
[INFO] DOOM ............................................... SKIPPED
[INFO] Axiom Compatibility Classes ........................ SKIPPED
[INFO] Axiom Uber-JAR ..................................... SKIPPED
[INFO] Samples ............................................ SKIPPED
[INFO] System Tests ....................................... SKIPPED
[INFO] compat-tests ....................................... SKIPPED
[INFO] Cross OM Tests ..................................... SKIPPED
[INFO] Eclipse Tests ...................................... SKIPPED
[INFO] JAX-WS Tests ....................................... SKIPPED
[INFO] Wildfly Tests ...................................... SKIPPED
[INFO] Axiom Test Suite (old) ............................. SKIPPED
[INFO] Axiom OSGi Tests ................................... SKIPPED
[INFO] psychopath-tests ................................... SKIPPED
[INFO] Spring-WS Test Suite ............................... SKIPPED
[INFO] Spring WS Tests .................................... SKIPPED
[INFO] WSS4J Tests ........................................ SKIPPED
[INFO] Developer Guide .................................... SKIPPED
[INFO] User Guide ......................................... SKIPPED
[INFO] Javadoc ............................................ SKIPPED
[INFO] Distribution ....................................... SKIPPED
[INFO] SAAJ Test Suite .................................... SKIPPED
[INFO] ------------------------------------------------------------------------
[INFO] BUILD FAILURE
[INFO] ------------------------------------------------------------------------
[INFO] Total time: 01:32 min
[INFO] Finished at: 2019-11-06T16:53:27Z
[INFO] Final Memory: 51M/247M
[INFO] ------------------------------------------------------------------------
[ERROR] Failed to execute goal org.apache.rat:apache-rat-plugin:0.11:check (default) on project
axiom: Too many files with unapproved license: 2255 See RAT report in: <https://builds.apache.org/job/axiom-master/ws/target/rat.txt>
-> [Help 1]
[ERROR] 
[ERROR] To see the full stack trace of the errors, re-run Maven with the -e switch.
[ERROR] Re-run Maven using the -X switch to enable full debug logging.
[ERROR] 
[ERROR] For more information about the errors and possible solutions, please read the following
articles:
[ERROR] [Help 1] http://cwiki.apache.org/confluence/display/MAVEN/MojoFailureException
[JENKINS] Archiving <https://builds.apache.org/job/axiom-master/ws/aspects/core-aspects/pom.xml>
to org.apache.ws.commons.axiom/core-aspects/1.3.0-SNAPSHOT/core-aspects-1.3.0-SNAPSHOT.pom
[JENKINS] Archiving <https://builds.apache.org/job/axiom-master/ws/components/xml-utils/pom.xml>
to org.apache.ws.commons.axiom/xml-utils/1.3.0-SNAPSHOT/xml-utils-1.3.0-SNAPSHOT.pom
[JENKINS] Archiving <https://builds.apache.org/job/axiom-master/ws/systests/wss4j-tests/pom.xml>
to org.apache.ws.commons.axiom/wss4j-tests/1.3.0-SNAPSHOT/wss4j-tests-1.3.0-SNAPSHOT.pom
[JENKINS] Archiving <https://builds.apache.org/job/axiom-master/ws/pom.xml> to org.apache.ws.commons.axiom/axiom/1.3.0-SNAPSHOT/axiom-1.3.0-SNAPSHOT.pom
[JENKINS] Archiving <https://builds.apache.org/job/axiom-master/ws/target/axiom-1.3.0-SNAPSHOT-site.xml>
to org.apache.ws.commons.axiom/axiom/1.3.0-SNAPSHOT/axiom-1.3.0-SNAPSHOT-site.xml
[JENKINS] Archiving <https://builds.apache.org/job/axiom-master/ws/testing/soap-testsuite/pom.xml>
to org.apache.ws.commons.axiom/soap-testsuite/1.3.0-SNAPSHOT/soap-testsuite-1.3.0-SNAPSHOT.pom
[JENKINS] Archiving <https://builds.apache.org/job/axiom-master/ws/userguide/pom.xml>
to org.apache.ws.commons.axiom/userguide/1.3.0-SNAPSHOT/userguide-1.3.0-SNAPSHOT.pom
[JENKINS] Archiving <https://builds.apache.org/job/axiom-master/ws/devguide/pom.xml>
to org.apache.ws.commons.axiom/devguide/1.3.0-SNAPSHOT/devguide-1.3.0-SNAPSHOT.pom
[JENKINS] Archiving <https://builds.apache.org/job/axiom-master/ws/testing/pom.xml>
to org.apache.ws.commons.axiom/testing/1.3.0-SNAPSHOT/testing-1.3.0-SNAPSHOT.pom
[JENKINS] Archiving <https://builds.apache.org/job/axiom-master/ws/systests/osgi-tests/pom.xml>
to org.apache.ws.commons.axiom/osgi-tests/1.3.0-SNAPSHOT/osgi-tests-1.3.0-SNAPSHOT.pom
[JENKINS] Archiving <https://builds.apache.org/job/axiom-master/ws/testing/saaj-testsuite/pom.xml>
to org.apache.ws.commons.axiom/saaj-testsuite/1.3.0-SNAPSHOT/saaj-testsuite-1.3.0-SNAPSHOT.pom
[JENKINS] Archiving <https://builds.apache.org/job/axiom-master/ws/systests/cross-om-tests/pom.xml>
to org.apache.ws.commons.axiom/cross-om-tests/1.3.0-SNAPSHOT/cross-om-tests-1.3.0-SNAPSHOT.pom
[JENKINS] Archiving <https://builds.apache.org/job/axiom-master/ws/testing/spring-ws-testsuite/pom.xml>
to org.apache.ws.commons.axiom/spring-ws-testsuite/1.3.0-SNAPSHOT/spring-ws-testsuite-1.3.0-SNAPSHOT.pom
[JENKINS] Archiving <https://builds.apache.org/job/axiom-master/ws/aspects/dom-aspects/pom.xml>
to org.apache.ws.commons.axiom/dom-aspects/1.3.0-SNAPSHOT/dom-aspects-1.3.0-SNAPSHOT.pom
[JENKINS] Archiving <https://builds.apache.org/job/axiom-master/ws/implementations/axiom-dom/pom.xml>
to org.apache.ws.commons.axiom/axiom-dom/1.3.0-SNAPSHOT/axiom-dom-1.3.0-SNAPSHOT.pom
[JENKINS] Archiving <https://builds.apache.org/job/axiom-master/ws/components/base64-utils/pom.xml>
to org.apache.ws.commons.axiom/base64-utils/1.3.0-SNAPSHOT/base64-utils-1.3.0-SNAPSHOT.pom
[JENKINS] Archiving <https://builds.apache.org/job/axiom-master/ws/testing/jaxp-testsuite/pom.xml>
to org.apache.ws.commons.axiom/jaxp-testsuite/1.3.0-SNAPSHOT/jaxp-testsuite-1.3.0-SNAPSHOT.pom
[JENKINS] Archiving <https://builds.apache.org/job/axiom-master/ws/axiom-api/pom.xml>
to org.apache.ws.commons.axiom/axiom-api/1.3.0-SNAPSHOT/axiom-api-1.3.0-SNAPSHOT.pom
[JENKINS] Archiving <https://builds.apache.org/job/axiom-master/ws/systests/jaxws-tests/pom.xml>
to org.apache.ws.commons.axiom/jaxws-tests/1.3.0-SNAPSHOT/jaxws-tests-1.3.0-SNAPSHOT.pom
[JENKINS] Archiving <https://builds.apache.org/job/axiom-master/ws/systests/psychopath-tests/pom.xml>
to org.apache.ws.commons.axiom/psychopath-tests/1.3.0-SNAPSHOT/psychopath-tests-1.3.0-SNAPSHOT.pom
[JENKINS] Archiving <https://builds.apache.org/job/axiom-master/ws/testing/dom-testsuite/pom.xml>
to org.apache.ws.commons.axiom/dom-testsuite/1.3.0-SNAPSHOT/dom-testsuite-1.3.0-SNAPSHOT.pom
[JENKINS] Archiving <https://builds.apache.org/job/axiom-master/ws/implementations/axiom-impl/pom.xml>
to org.apache.ws.commons.axiom/axiom-impl/1.3.0-SNAPSHOT/axiom-impl-1.3.0-SNAPSHOT.pom
[JENKINS] Archiving <https://builds.apache.org/job/axiom-master/ws/systests/wildfly-tests/pom.xml>
to org.apache.ws.commons.axiom/wildfly-tests/1.3.0-SNAPSHOT/wildfly-tests-1.3.0-SNAPSHOT.pom
[JENKINS] Archiving <https://builds.apache.org/job/axiom-master/ws/components/core-streams/pom.xml>
to org.apache.ws.commons.axiom/core-streams/1.3.0-SNAPSHOT/core-streams-1.3.0-SNAPSHOT.pom
[JENKINS] Archiving <https://builds.apache.org/job/axiom-master/ws/testing/testutils/pom.xml>
to org.apache.ws.commons.axiom/testutils/1.3.0-SNAPSHOT/testutils-1.3.0-SNAPSHOT.pom
[JENKINS] Archiving <https://builds.apache.org/job/axiom-master/ws/testing/xml-truth/pom.xml>
to org.apache.ws.commons.axiom/xml-truth/1.3.0-SNAPSHOT/xml-truth-1.3.0-SNAPSHOT.pom
[JENKINS] Archiving <https://builds.apache.org/job/axiom-master/ws/apidocs/pom.xml>
to org.apache.ws.commons.axiom/apidocs/1.3.0-SNAPSHOT/apidocs-1.3.0-SNAPSHOT.pom
[JENKINS] Archiving <https://builds.apache.org/job/axiom-master/ws/testing/xml-testsuite/pom.xml>
to org.apache.ws.commons.axiom/xml-testsuite/1.3.0-SNAPSHOT/xml-testsuite-1.3.0-SNAPSHOT.pom
[JENKINS] Archiving <https://builds.apache.org/job/axiom-master/ws/systests/compat-tests/pom.xml>
to org.apache.ws.commons.axiom/compat-tests/1.3.0-SNAPSHOT/compat-tests-1.3.0-SNAPSHOT.pom
[JENKINS] Archiving <https://builds.apache.org/job/axiom-master/ws/samples/pom.xml>
to org.apache.ws.commons.axiom/samples/1.3.0-SNAPSHOT/samples-1.3.0-SNAPSHOT.pom
[JENKINS] Archiving <https://builds.apache.org/job/axiom-master/ws/buildutils/pom.xml>
to org.apache.ws.commons.axiom/buildutils/1.3.0-SNAPSHOT/buildutils-1.3.0-SNAPSHOT.pom
[JENKINS] Archiving <https://builds.apache.org/job/axiom-master/ws/axiom-all/pom.xml>
to org.apache.ws.commons.axiom/axiom-all/1.3.0-SNAPSHOT/axiom-all-1.3.0-SNAPSHOT.pom
[JENKINS] Archiving <https://builds.apache.org/job/axiom-master/ws/implementations/pom.xml>
to org.apache.ws.commons.axiom/implementations/1.3.0-SNAPSHOT/implementations-1.3.0-SNAPSHOT.pom
[JENKINS] Archiving <https://builds.apache.org/job/axiom-master/ws/systests/pom.xml>
to org.apache.ws.commons.axiom/systests/1.3.0-SNAPSHOT/systests-1.3.0-SNAPSHOT.pom
[JENKINS] Archiving <https://builds.apache.org/job/axiom-master/ws/distribution/pom.xml>
to org.apache.ws.commons.axiom/distribution/1.3.0-SNAPSHOT/distribution-1.3.0-SNAPSHOT.pom
[JENKINS] Archiving <https://builds.apache.org/job/axiom-master/ws/testing/axiom-truth/pom.xml>
to org.apache.ws.commons.axiom/axiom-truth/1.3.0-SNAPSHOT/axiom-truth-1.3.0-SNAPSHOT.pom
[JENKINS] Archiving <https://builds.apache.org/job/axiom-master/ws/buildutils/buildutils-maven-plugin/pom.xml>
to org.apache.ws.commons.axiom/buildutils-maven-plugin/1.3.0-SNAPSHOT/buildutils-maven-plugin-1.3.0-SNAPSHOT.pom
[JENKINS] Archiving <https://builds.apache.org/job/axiom-master/ws/systests/spring-ws-tests/pom.xml>
to org.apache.ws.commons.axiom/spring-ws-tests/1.3.0-SNAPSHOT/spring-ws-tests-1.3.0-SNAPSHOT.pom
[JENKINS] Archiving <https://builds.apache.org/job/axiom-master/ws/aspects/om-aspects/pom.xml>
to org.apache.ws.commons.axiom/om-aspects/1.3.0-SNAPSHOT/om-aspects-1.3.0-SNAPSHOT.pom
[JENKINS] Archiving <https://builds.apache.org/job/axiom-master/ws/testing/jaxen-testsuite/pom.xml>
to org.apache.ws.commons.axiom/jaxen-testsuite/1.3.0-SNAPSHOT/jaxen-testsuite-1.3.0-SNAPSHOT.pom
[JENKINS] Archiving <https://builds.apache.org/job/axiom-master/ws/systests/eclipse-tests/pom.xml>
to org.apache.ws.commons.axiom/eclipse-tests/1.3.0-SNAPSHOT/eclipse-tests-1.3.0-SNAPSHOT.pom
[JENKINS] Archiving <https://builds.apache.org/job/axiom-master/ws/aspects/shared-aspects/pom.xml>
to org.apache.ws.commons.axiom/shared-aspects/1.3.0-SNAPSHOT/shared-aspects-1.3.0-SNAPSHOT.pom
[JENKINS] Archiving <https://builds.apache.org/job/axiom-master/ws/buildutils/shade-axiom-xml/pom.xml>
to org.apache.ws.commons.axiom/shade-axiom-xml/1.3.0-SNAPSHOT/shade-axiom-xml-1.3.0-SNAPSHOT.pom
[JENKINS] Archiving <https://builds.apache.org/job/axiom-master/ws/axiom-jaxb/pom.xml>
to org.apache.ws.commons.axiom/axiom-jaxb/1.3.0-SNAPSHOT/axiom-jaxb-1.3.0-SNAPSHOT.pom
[JENKINS] Archiving <https://builds.apache.org/job/axiom-master/ws/testing/axiom-testsuite/pom.xml>
to org.apache.ws.commons.axiom/axiom-testsuite/1.3.0-SNAPSHOT/axiom-testsuite-1.3.0-SNAPSHOT.pom
[JENKINS] Archiving <https://builds.apache.org/job/axiom-master/ws/testing/multiton/pom.xml>
to org.apache.ws.commons.axiom/multiton/1.3.0-SNAPSHOT/multiton-1.3.0-SNAPSHOT.pom
[JENKINS] Archiving <https://builds.apache.org/job/axiom-master/ws/axiom-compat/pom.xml>
to org.apache.ws.commons.axiom/axiom-compat/1.3.0-SNAPSHOT/axiom-compat-1.3.0-SNAPSHOT.pom
[JENKINS] Archiving <https://builds.apache.org/job/axiom-master/ws/systests/old-tests/pom.xml>
to org.apache.ws.commons.axiom/old-tests/1.3.0-SNAPSHOT/old-tests-1.3.0-SNAPSHOT.pom
[JENKINS] Archiving <https://builds.apache.org/job/axiom-master/ws/components/pom.xml>
to org.apache.ws.commons.axiom/components/1.3.0-SNAPSHOT/components-1.3.0-SNAPSHOT.pom
[JENKINS] Archiving <https://builds.apache.org/job/axiom-master/ws/aspects/pom.xml>
to org.apache.ws.commons.axiom/aspects/1.3.0-SNAPSHOT/aspects-1.3.0-SNAPSHOT.pom
No mail will be sent out, as 'axiom-master » Core Aspects #3006' does not have a result
yet. Please make sure you set a proper result in case of pipeline/build scripts.
No mail will be sent out, as 'axiom-master » xml-utils #3006' does not have a result yet.
Please make sure you set a proper result in case of pipeline/build scripts.
No mail will be sent out, as 'axiom-master » WSS4J Tests #3006' does not have a result
yet. Please make sure you set a proper result in case of pipeline/build scripts.
Sending e-mails to: dev@ws.apache.org
No mail will be sent out, as 'axiom-master » SOAP Test Suite #3006' does not have a result
yet. Please make sure you set a proper result in case of pipeline/build scripts.
No mail will be sent out, as 'axiom-master » User Guide #3006' does not have a result yet.
Please make sure you set a proper result in case of pipeline/build scripts.
No mail will be sent out, as 'axiom-master » Developer Guide #3006' does not have a result
yet. Please make sure you set a proper result in case of pipeline/build scripts.
No mail will be sent out, as 'axiom-master » Testing #3006' does not have a result yet.
Please make sure you set a proper result in case of pipeline/build scripts.
No mail will be sent out, as 'axiom-master » Axiom OSGi Tests #3006' does not have a result
yet. Please make sure you set a proper result in case of pipeline/build scripts.
No mail will be sent out, as 'axiom-master » SAAJ Test Suite #3006' does not have a result
yet. Please make sure you set a proper result in case of pipeline/build scripts.
No mail will be sent out, as 'axiom-master » Cross OM Tests #3006' does not have a result
yet. Please make sure you set a proper result in case of pipeline/build scripts.
No mail will be sent out, as 'axiom-master » Spring-WS Test Suite #3006' does not have
a result yet. Please make sure you set a proper result in case of pipeline/build scripts.
No mail will be sent out, as 'axiom-master » DOM Aspects #3006' does not have a result
yet. Please make sure you set a proper result in case of pipeline/build scripts.
No mail will be sent out, as 'axiom-master » DOOM #3006' does not have a result yet. Please
make sure you set a proper result in case of pipeline/build scripts.
No mail will be sent out, as 'axiom-master » base64-utils #3006' does not have a result
yet. Please make sure you set a proper result in case of pipeline/build scripts.
No mail will be sent out, as 'axiom-master » jaxp-testsuite #3006' does not have a result
yet. Please make sure you set a proper result in case of pipeline/build scripts.
No mail will be sent out, as 'axiom-master » Axiom API #3006' does not have a result yet.
Please make sure you set a proper result in case of pipeline/build scripts.
No mail will be sent out, as 'axiom-master » JAX-WS Tests #3006' does not have a result
yet. Please make sure you set a proper result in case of pipeline/build scripts.
No mail will be sent out, as 'axiom-master » psychopath-tests #3006' does not have a result
yet. Please make sure you set a proper result in case of pipeline/build scripts.
No mail will be sent out, as 'axiom-master » DOM Test Suite #3006' does not have a result
yet. Please make sure you set a proper result in case of pipeline/build scripts.
No mail will be sent out, as 'axiom-master » LLOM #3006' does not have a result yet. Please
make sure you set a proper result in case of pipeline/build scripts.
No mail will be sent out, as 'axiom-master » Wildfly Tests #3006' does not have a result
yet. Please make sure you set a proper result in case of pipeline/build scripts.
No mail will be sent out, as 'axiom-master » core-streams #3006' does not have a result
yet. Please make sure you set a proper result in case of pipeline/build scripts.
No mail will be sent out, as 'axiom-master » Axiom Test Utilities #3006' does not have
a result yet. Please make sure you set a proper result in case of pipeline/build scripts.
No mail will be sent out, as 'axiom-master » Google Truth extension for XML #3006' does
not have a result yet. Please make sure you set a proper result in case of pipeline/build
scripts.
No mail will be sent out, as 'axiom-master » Javadoc #3006' does not have a result yet.
Please make sure you set a proper result in case of pipeline/build scripts.
No mail will be sent out, as 'axiom-master » XML Test Suite #3006' does not have a result
yet. Please make sure you set a proper result in case of pipeline/build scripts.
No mail will be sent out, as 'axiom-master » compat-tests #3006' does not have a result
yet. Please make sure you set a proper result in case of pipeline/build scripts.
No mail will be sent out, as 'axiom-master » Samples #3006' does not have a result yet.
Please make sure you set a proper result in case of pipeline/build scripts.
No mail will be sent out, as 'axiom-master » Build utilities #3006' does not have a result
yet. Please make sure you set a proper result in case of pipeline/build scripts.
No mail will be sent out, as 'axiom-master » Axiom Uber-JAR #3006' does not have a result
yet. Please make sure you set a proper result in case of pipeline/build scripts.
No mail will be sent out, as 'axiom-master » Implementations #3006' does not have a result
yet. Please make sure you set a proper result in case of pipeline/build scripts.
No mail will be sent out, as 'axiom-master » System Tests #3006' does not have a result
yet. Please make sure you set a proper result in case of pipeline/build scripts.
No mail will be sent out, as 'axiom-master » Distribution #3006' does not have a result
yet. Please make sure you set a proper result in case of pipeline/build scripts.
No mail will be sent out, as 'axiom-master » Google Truth extension for Axiom #3006' does
not have a result yet. Please make sure you set a proper result in case of pipeline/build
scripts.
No mail will be sent out, as 'axiom-master » buildutils-maven-plugin #3006' does not have
a result yet. Please make sure you set a proper result in case of pipeline/build scripts.
No mail will be sent out, as 'axiom-master » Spring WS Tests #3006' does not have a result
yet. Please make sure you set a proper result in case of pipeline/build scripts.
No mail will be sent out, as 'axiom-master » OM Aspects #3006' does not have a result yet.
Please make sure you set a proper result in case of pipeline/build scripts.
No mail will be sent out, as 'axiom-master » Jaxen Test Suite #3006' does not have a result
yet. Please make sure you set a proper result in case of pipeline/build scripts.
No mail will be sent out, as 'axiom-master » Eclipse Tests #3006' does not have a result
yet. Please make sure you set a proper result in case of pipeline/build scripts.
No mail will be sent out, as 'axiom-master » Shared Aspects #3006' does not have a result
yet. Please make sure you set a proper result in case of pipeline/build scripts.
No mail will be sent out, as 'axiom-master » Resource Transformer for META-INF/axiom.xml
files #3006' does not have a result yet. Please make sure you set a proper result in case
of pipeline/build scripts.
No mail will be sent out, as 'axiom-master » Axiom JAXB Integration #3006' does not have
a result yet. Please make sure you set a proper result in case of pipeline/build scripts.
No mail will be sent out, as 'axiom-master » Axiom Implementation Test Suite #3006' does
not have a result yet. Please make sure you set a proper result in case of pipeline/build
scripts.
No mail will be sent out, as 'axiom-master » Multiton pattern implementation #3006' does
not have a result yet. Please make sure you set a proper result in case of pipeline/build
scripts.
No mail will be sent out, as 'axiom-master » Axiom Compatibility Classes #3006' does not
have a result yet. Please make sure you set a proper result in case of pipeline/build scripts.
No mail will be sent out, as 'axiom-master » Axiom Test Suite (old) #3006' does not have
a result yet. Please make sure you set a proper result in case of pipeline/build scripts.
No mail will be sent out, as 'axiom-master » components #3006' does not have a result yet.
Please make sure you set a proper result in case of pipeline/build scripts.
No mail will be sent out, as 'axiom-master » Aspects #3006' does not have a result yet.
Please make sure you set a proper result in case of pipeline/build scripts.
channel stopped

---------------------------------------------------------------------
To unsubscribe, e-mail: dev-unsubscribe@ws.apache.org
For additional commands, e-mail: dev-help@ws.apache.org


Mime
View raw message