ws-dev mailing list archives

Site index · List index
Message view « Date » · « Thread »
Top « Date » · « Thread »
From Apache Jenkins Server <jenk...@builds.apache.org>
Subject Build failed in Jenkins: xmlschema-master #347
Date Fri, 03 Jan 2020 15:40:45 GMT
See <https://builds.apache.org/job/xmlschema-master/347/display/redirect?page=changes>

Changes:

[coheigea] [maven-release-plugin] prepare release xmlschema-2.2.5


------------------------------------------
Started by an SCM change
Running as SYSTEM
[EnvInject] - Loading node environment variables.
Building remotely on H22 (ubuntu) in workspace <https://builds.apache.org/job/xmlschema-master/ws/>
No credentials specified
 > git rev-parse --is-inside-work-tree # timeout=10
Fetching changes from the remote Git repository
 > git config remote.origin.url https://gitbox.apache.org/repos/asf/ws-xmlschema.git #
timeout=10
Fetching upstream changes from https://gitbox.apache.org/repos/asf/ws-xmlschema.git
 > git --version # timeout=10
 > git fetch --tags --progress -- https://gitbox.apache.org/repos/asf/ws-xmlschema.git
+refs/heads/*:refs/remotes/origin/*
 > git rev-parse refs/remotes/origin/master^{commit} # timeout=10
 > git rev-parse refs/remotes/origin/origin/master^{commit} # timeout=10
Checking out Revision e2be6f3222f932d77f96ac1c3204decb0e268fbb (refs/remotes/origin/master)
 > git config core.sparsecheckout # timeout=10
 > git checkout -f e2be6f3222f932d77f96ac1c3204decb0e268fbb
Commit message: "[maven-release-plugin] prepare release xmlschema-2.2.5"
 > git rev-list --no-walk 4204d4c2483add94f1ab1b9c8c618f69a4119580 # timeout=10
Parsing POMs
Modules changed, recalculating dependency graph
Established TCP socket on 40395
maven35-agent.jar already up to date
maven35-interceptor.jar already up to date
maven3-interceptor-commons.jar already up to date
[xmlschema-master] $ /home/jenkins/tools/java/latest1.8/bin/java -Xmx4g -Xms4g -cp /home/jenkins/jenkins-slave/maven35-agent.jar:/home/jenkins/tools/maven/latest3/boot/plexus-classworlds-2.6.0.jar:/home/jenkins/tools/maven/latest3/conf/logging
jenkins.maven3.agent.Maven35Main /home/jenkins/tools/maven/latest3/ /home/jenkins/jenkins-slave/remoting.jar
/home/jenkins/jenkins-slave/maven35-interceptor.jar /home/jenkins/jenkins-slave/maven3-interceptor-commons.jar
40395
<===[JENKINS REMOTING CAPACITY]===>   channel started
Executing Maven:  -B -f <https://builds.apache.org/job/xmlschema-master/ws/pom.xml>
-Dmaven.repo.local=<https://builds.apache.org/job/xmlschema-master/ws/.repository> deploy
-Papache-release -Dgpg.skip=true
[INFO] Scanning for projects...
[WARNING] The project org.apache.ws.xmlschema:xmlschema:pom:2.2.5 uses prerequisites which
is only intended for maven-plugin projects but not for non maven-plugin projects. For such
purposes you should use the maven-enforcer-plugin. See https://maven.apache.org/enforcer/enforcer-rules/requireMavenVersion.html
[INFO] ------------------------------------------------------------------------
[INFO] Reactor Build Order:
[INFO] 
[INFO] XmlSchema                                                          [pom]
[INFO] XmlSchema Core                                                  [bundle]
[INFO] xmlschema-walker                                                [bundle]
[INFO] XmlSchema OSGi bundle test                                         [jar]
[INFO] XmlSchema W3C tests                                                [jar]
[INFO] 
[INFO] -----------------< org.apache.ws.xmlschema:xmlschema >------------------
[INFO] Building XmlSchema 2.2.5                                           [1/5]
[INFO] --------------------------------[ pom ]---------------------------------
[INFO] 
[INFO] --- maven-enforcer-plugin:1.4.1:enforce (enforce-maven-version) @ xmlschema ---
[INFO] 
[INFO] --- maven-checkstyle-plugin:2.12.1:checkstyle (validate) @ xmlschema ---
[INFO] Starting audit...
Audit done.

[INFO] 
[INFO] >>> maven-pmd-plugin:2.5:check (validate) > :pmd @ xmlschema >>>
[INFO] 
[INFO] --- maven-pmd-plugin:2.5:pmd (pmd) @ xmlschema ---
[INFO] 
[INFO] <<< maven-pmd-plugin:2.5:check (validate) < :pmd @ xmlschema <<<
[INFO] 
[INFO] 
[INFO] --- maven-pmd-plugin:2.5:check (validate) @ xmlschema ---
[INFO] 
[INFO] --- maven-remote-resources-plugin:1.5:process (process-resource-bundles) @ xmlschema
---
[INFO] 
[INFO] --- maven-site-plugin:3.4:attach-descriptor (attach-descriptor) @ xmlschema ---
[INFO] 
[INFO] --- maven-assembly-plugin:2.4.1:single (source-release-assembly) @ xmlschema ---
[INFO] Building zip: <https://builds.apache.org/job/xmlschema-master/ws/target/xmlschema-2.2.5-source-release.zip>
[INFO] 
[INFO] >>> maven-source-plugin:3.0.1:jar (default) > generate-sources @ xmlschema
>>>
[INFO] 
[INFO] --- maven-enforcer-plugin:1.4.1:enforce (enforce-maven-version) @ xmlschema ---
[INFO] 
[INFO] --- maven-checkstyle-plugin:2.12.1:checkstyle (validate) @ xmlschema ---
[INFO] Starting audit...
Audit done.

[INFO] 
[INFO] >>> maven-pmd-plugin:2.5:check (validate) > :pmd @ xmlschema >>>
[INFO] 
[INFO] --- maven-pmd-plugin:2.5:pmd (pmd) @ xmlschema ---
[INFO] 
[INFO] <<< maven-pmd-plugin:2.5:check (validate) < :pmd @ xmlschema <<<
[INFO] 
[INFO] 
[INFO] --- maven-pmd-plugin:2.5:check (validate) @ xmlschema ---
[WARNING] Failed to getClass for org.apache.maven.plugins.source.SourceJarMojo
[INFO] 
[INFO] <<< maven-source-plugin:3.0.1:jar (default) < generate-sources @ xmlschema
<<<
[INFO] 
[INFO] 
[INFO] --- maven-source-plugin:3.0.1:jar (default) @ xmlschema ---
[INFO] 
[INFO] --- maven-source-plugin:3.0.1:jar-no-fork (attach-sources) @ xmlschema ---
[INFO] 
[INFO] --- maven-javadoc-plugin:2.10.4:jar (attach-javadocs) @ xmlschema ---
[INFO] Not executing Javadoc as the project is not a Java classpath-capable package
[INFO] 
[INFO] --- maven-gpg-plugin:1.6:sign (sign-release-artifacts) @ xmlschema ---
[INFO] 
[INFO] --- checksum-maven-plugin:1.7:files (source-release-checksum) @ xmlschema ---
[INFO] xmlschema-2.2.5-source-release.zip - SHA-512 : 344925c23d55b1aee17ed6a429f0794a49b7f62f2b5f3fcf08a6ab181ddb556727e79a37592bd92fbc66c0dc20d2068290d5c214fbe14236fe5d4218aac9d2e7
[INFO] 
[INFO] --- maven-install-plugin:2.5.2:install (default-install) @ xmlschema ---
[INFO] Installing <https://builds.apache.org/job/xmlschema-master/ws/pom.xml> to <https://builds.apache.org/job/xmlschema-master/ws/.repository/org/apache/ws/xmlschema/xmlschema/2.2.5/xmlschema-2.2.5.pom>
[INFO] Installing <https://builds.apache.org/job/xmlschema-master/ws/target/xmlschema-2.2.5-site.xml>
to <https://builds.apache.org/job/xmlschema-master/ws/.repository/org/apache/ws/xmlschema/xmlschema/2.2.5/xmlschema-2.2.5-site.xml>
[INFO] Installing <https://builds.apache.org/job/xmlschema-master/ws/target/xmlschema-2.2.5-source-release.zip>
to <https://builds.apache.org/job/xmlschema-master/ws/.repository/org/apache/ws/xmlschema/xmlschema/2.2.5/xmlschema-2.2.5-source-release.zip>
[INFO] 
[INFO] --- maven-deploy-plugin:2.8.2:deploy (default-deploy) @ xmlschema ---
[INFO] Uploading to apache.releases.https: https://repository.apache.org/service/local/staging/deploy/maven2/org/apache/ws/xmlschema/xmlschema/2.2.5/xmlschema-2.2.5.pom
[JENKINS] Archiving disabled
[JENKINS] Archiving disabled
[JENKINS] Archiving disabled
[JENKINS] Archiving disabled
[JENKINS] Archiving disabled
[JENKINS] Archiving disabled
[INFO] ------------------------------------------------------------------------
[INFO] Reactor Summary for XmlSchema 2.2.5:
[INFO] 
[INFO] XmlSchema .......................................... FAILURE [ 21.379 s]
[INFO] XmlSchema Core ..................................... SKIPPED
[INFO] xmlschema-walker ................................... SKIPPED
[INFO] XmlSchema OSGi bundle test ......................... SKIPPED
[INFO] XmlSchema W3C tests ................................ SKIPPED
[INFO] ------------------------------------------------------------------------
[INFO] BUILD FAILURE
[INFO] ------------------------------------------------------------------------
[INFO] Total time:  34.316 s
[INFO] Finished at: 2020-01-03T15:40:35Z
[INFO] ------------------------------------------------------------------------
Waiting for Jenkins to finish collecting data
[ERROR] Failed to execute goal org.apache.maven.plugins:maven-deploy-plugin:2.8.2:deploy (default-deploy)
on project xmlschema: Failed to deploy artifacts: Could not transfer artifact org.apache.ws.xmlschema:xmlschema:pom:2.2.5
from/to apache.releases.https (https://repository.apache.org/service/local/staging/deploy/maven2):
Failed to transfer file https://repository.apache.org/service/local/staging/deploy/maven2/org/apache/ws/xmlschema/xmlschema/2.2.5/xmlschema-2.2.5.pom
with status code 401 -> [Help 1]
[ERROR] 
[ERROR] To see the full stack trace of the errors, re-run Maven with the -e switch.
[ERROR] Re-run Maven using the -X switch to enable full debug logging.
[ERROR] 
[ERROR] For more information about the errors and possible solutions, please read the following
articles:
[ERROR] [Help 1] http://cwiki.apache.org/confluence/display/MAVEN/MojoExecutionException
No mail will be sent out, as 'xmlschema-master » XmlSchema Core #347' does not have a result
yet. Please make sure you set a proper result in case of pipeline/build scripts.
No mail will be sent out, as 'xmlschema-master » xmlschema-walker #347' does not have a
result yet. Please make sure you set a proper result in case of pipeline/build scripts.
No mail will be sent out, as 'xmlschema-master » XmlSchema OSGi bundle test #347' does
not have a result yet. Please make sure you set a proper result in case of pipeline/build
scripts.
Sending e-mails to: dev@ws.apache.org
No mail will be sent out, as 'xmlschema-master » XmlSchema W3C tests #347' does not have
a result yet. Please make sure you set a proper result in case of pipeline/build scripts.
channel stopped

---------------------------------------------------------------------
To unsubscribe, e-mail: dev-unsubscribe@ws.apache.org
For additional commands, e-mail: dev-help@ws.apache.org


Mime
View raw message