activemq-commits mailing list archives

Site index · List index
Message view « Date » · « Thread »
Top « Date » · « Thread »
From Apache Jenkins Server <jenk...@builds.apache.org>
Subject Build failed in Jenkins: ActiveMQ-Artemis-Master #1298
Date Fri, 01 Sep 2017 19:08:47 GMT
See <https://builds.apache.org/job/ActiveMQ-Artemis-Master/1298/display/redirect?page=changes>

Changes:

[clebertsuconic] [maven-release-plugin] prepare release 2.3.0

[clebertsuconic] [maven-release-plugin] prepare for next development iteration

------------------------------------------
Started by an SCM change
[EnvInject] - Loading node environment variables.
Building remotely on qnode2 (ubuntu) in workspace <https://builds.apache.org/job/ActiveMQ-Artemis-Master/ws/>
 > git rev-parse --is-inside-work-tree # timeout=10
Fetching changes from the remote Git repository
 > git config remote.origin.url https://git-wip-us.apache.org/repos/asf/activemq-artemis.git
# timeout=10
Cleaning workspace
 > git rev-parse --verify HEAD # timeout=10
Resetting working tree
 > git reset --hard # timeout=10
 > git clean -fdx # timeout=10
Fetching upstream changes from https://git-wip-us.apache.org/repos/asf/activemq-artemis.git
 > git --version # timeout=10
 > git fetch --tags --progress https://git-wip-us.apache.org/repos/asf/activemq-artemis.git
+refs/heads/*:refs/remotes/origin/*
 > git rev-parse origin/master^{commit} # timeout=10
Checking out Revision 04979a6571df556564fff6615b62b12208e45e2e (origin/master)
Commit message: "[maven-release-plugin] prepare for next development iteration"
 > git config core.sparsecheckout # timeout=10
 > git checkout -f 04979a6571df556564fff6615b62b12208e45e2e
 > git rev-list f060f49cf116ab40da816d8fcdc2052b5eabf6c0 # timeout=10
[ActiveMQ-Artemis-Master] $ /home/jenkins/tools/maven/apache-maven-3.2.5/bin/mvn -Pfast-tests
-Pextra-tests install
[INFO] Scanning for projects...
[ERROR] The build could not read 1 project -> [Help 1]
[ERROR]   
[ERROR]   The project org.apache.activemq.tests:extra-tests:[unknown-version] (<https://builds.apache.org/job/ActiveMQ-Artemis-Master/ws/tests/extra-tests/pom.xml)>
has 1 error
[ERROR]     Non-resolvable parent POM: Could not find artifact org.apache.activemq.tests:artemis-tests-pom:pom:2.4.0-SNAPSHOT
and 'parent.relativePath' points at wrong local POM @ line 25, column 12 -> [Help 2]
[ERROR] 
[ERROR] To see the full stack trace of the errors, re-run Maven with the -e switch.
[ERROR] Re-run Maven using the -X switch to enable full debug logging.
[ERROR] 
[ERROR] For more information about the errors and possible solutions, please read the following
articles:
[ERROR] [Help 1] http://cwiki.apache.org/confluence/display/MAVEN/ProjectBuildingException
[ERROR] [Help 2] http://cwiki.apache.org/confluence/display/MAVEN/UnresolvableModelException
Build step 'Invoke top-level Maven targets' marked build as failure
Performing Post build task...
Could not match :Too many files with unapproved license  : False
Logical operation result is FALSE
Skipping script  : cat ratReport.txt
END OF POST BUILD TASK 	: 0
Recording test results
ERROR: Step ‘Publish JUnit test result report’ failed: No test report files were found.
Configuration error?


Mime
View raw message