activemq-commits mailing list archives

Site index · List index
Message view « Date » · « Thread »
Top « Date » · « Thread »
From Apache Jenkins Server <jenk...@builds.apache.org>
Subject Build failed in Jenkins: ActiveMQ-Artemis-Master #1365
Date Mon, 02 Oct 2017 17:49:56 GMT
See <https://builds.apache.org/job/ActiveMQ-Artemis-Master/1365/display/redirect?page=changes>

Changes:

[jbertram] NO-JIRA fix groupID URL doc

------------------------------------------
[...truncated 1.89 MB...]
[main] 17:49:11,441 INFO  [org.apache.activemq.artemis.core.server] #*#*# Starting test: testRemoveTail1()...
#test testRemoveTail1
[main] 17:49:11,450 INFO  [org.apache.activemq.artemis.core.server] #*#*# Finished test: testRemoveTail1()...
[main] 17:49:11,454 INFO  [org.apache.activemq.artemis.core.server] #*#*# Starting test: testRemoveTail2()...
#test testRemoveTail2
[main] 17:49:11,467 INFO  [org.apache.activemq.artemis.core.server] #*#*# Finished test: testRemoveTail2()...
[main] 17:49:11,468 INFO  [org.apache.activemq.artemis.core.server] #*#*# Starting test: testRemoveTail3()...
#test testRemoveTail3
[main] 17:49:11,476 INFO  [org.apache.activemq.artemis.core.server] #*#*# Finished test: testRemoveTail3()...
[main] 17:49:11,477 INFO  [org.apache.activemq.artemis.core.server] #*#*# Starting test: testRemoveInTurn()...
#test testRemoveInTurn
[main] 17:49:11,487 INFO  [org.apache.activemq.artemis.core.server] #*#*# Finished test: testRemoveInTurn()...
[main] 17:49:11,488 INFO  [org.apache.activemq.artemis.core.server] #*#*# Starting test: testRemoveMiddle()...
#test testRemoveMiddle
[main] 17:49:11,500 INFO  [org.apache.activemq.artemis.core.server] #*#*# Finished test: testRemoveMiddle()...
[main] 17:49:11,502 INFO  [org.apache.activemq.artemis.core.server] #*#*# Starting test: testAddHeadAndRemove()...
#test testAddHeadAndRemove
Jumping 500
[main] 17:49:11,508 INFO  [org.apache.activemq.artemis.utils.ThreadLeakCheckRule] #test forceGC
[main] 17:49:11,932 INFO  [org.apache.activemq.artemis.utils.ThreadLeakCheckRule] #test forceGC
Done 
[main] 17:49:11,937 INFO  [org.apache.activemq.artemis.core.server] #*#*# Finished test: testAddHeadAndRemove()...
[main] 17:49:11,938 INFO  [org.apache.activemq.artemis.core.server] #*#*# Starting test: testMultipleIterators1()...
#test testMultipleIterators1
[main] 17:49:11,948 INFO  [org.apache.activemq.artemis.core.server] #*#*# Finished test: testMultipleIterators1()...
[main] 17:49:11,949 INFO  [org.apache.activemq.artemis.core.server] #*#*# Starting test: testMultipleIterators2()...
#test testMultipleIterators2
[main] 17:49:11,961 INFO  [org.apache.activemq.artemis.core.server] #*#*# Finished test: testMultipleIterators2()...
[main] 17:49:11,962 INFO  [org.apache.activemq.artemis.core.server] #*#*# Starting test: testResizing()...
#test testResizing
[main] 17:49:11,987 INFO  [org.apache.activemq.artemis.core.server] #*#*# Finished test: testResizing()...
[main] 17:49:11,988 INFO  [org.apache.activemq.artemis.core.server] #*#*# Starting test: testRepeatAndRemove()...
#test testRepeatAndRemove
[main] 17:49:12,002 INFO  [org.apache.activemq.artemis.core.server] #*#*# Finished test: testRepeatAndRemove()...
[main] 17:49:12,003 INFO  [org.apache.activemq.artemis.core.server] #*#*# Starting test: testIterateNoElements()...
#test testIterateNoElements
[main] 17:49:12,011 INFO  [org.apache.activemq.artemis.core.server] #*#*# Finished test: testIterateNoElements()...
[main] 17:49:12,011 INFO  [org.apache.activemq.artemis.core.server] #*#*# Starting test: testAddAndRemove()...
#test testAddAndRemove
[main] 17:49:12,021 INFO  [org.apache.activemq.artemis.utils.ThreadLeakCheckRule] #test forceGC
[main] 17:49:12,155 INFO  [org.apache.activemq.artemis.utils.ThreadLeakCheckRule] #test forceGC
Done 
[main] 17:49:12,532 INFO  [org.apache.activemq.artemis.utils.ThreadLeakCheckRule] #test forceGC
[main] 17:49:13,724 INFO  [org.apache.activemq.artemis.utils.ThreadLeakCheckRule] #test forceGC
Done 
[main] 17:49:13,724 INFO  [org.apache.activemq.artemis.utils.ThreadLeakCheckRule] #test forceGC
[main] 17:49:13,834 INFO  [org.apache.activemq.artemis.utils.ThreadLeakCheckRule] #test forceGC
Done 
[main] 17:49:13,834 INFO  [org.apache.activemq.artemis.utils.ThreadLeakCheckRule] #test forceGC
[main] 17:49:13,888 INFO  [org.apache.activemq.artemis.utils.ThreadLeakCheckRule] #test forceGC
Done 
[main] 17:49:14,104 INFO  [org.apache.activemq.artemis.utils.ThreadLeakCheckRule] #test forceGC
[main] 17:49:14,663 INFO  [org.apache.activemq.artemis.utils.ThreadLeakCheckRule] #test forceGC
Done 
[main] 17:49:14,663 INFO  [org.apache.activemq.artemis.utils.ThreadLeakCheckRule] #test forceGC
[main] 17:49:14,799 INFO  [org.apache.activemq.artemis.utils.ThreadLeakCheckRule] #test forceGC
Done 
[main] 17:49:14,799 INFO  [org.apache.activemq.artemis.utils.ThreadLeakCheckRule] #test forceGC
[main] 17:49:14,903 INFO  [org.apache.activemq.artemis.utils.ThreadLeakCheckRule] #test forceGC
Done 
[main] 17:49:15,182 INFO  [org.apache.activemq.artemis.utils.ThreadLeakCheckRule] #test forceGC
[main] 17:49:15,863 INFO  [org.apache.activemq.artemis.utils.ThreadLeakCheckRule] #test forceGC
Done 
[main] 17:49:15,863 INFO  [org.apache.activemq.artemis.utils.ThreadLeakCheckRule] #test forceGC
[main] 17:49:15,983 INFO  [org.apache.activemq.artemis.utils.ThreadLeakCheckRule] #test forceGC
Done 
[main] 17:49:16,257 INFO  [org.apache.activemq.artemis.utils.ThreadLeakCheckRule] #test forceGC
[main] 17:49:16,742 INFO  [org.apache.activemq.artemis.utils.ThreadLeakCheckRule] #test forceGC
Done 
[main] 17:49:16,742 INFO  [org.apache.activemq.artemis.utils.ThreadLeakCheckRule] #test forceGC
[main] 17:49:16,916 INFO  [org.apache.activemq.artemis.utils.ThreadLeakCheckRule] #test forceGC
Done 
[main] 17:49:16,916 INFO  [org.apache.activemq.artemis.utils.ThreadLeakCheckRule] #test forceGC
[main] 17:49:17,074 INFO  [org.apache.activemq.artemis.utils.ThreadLeakCheckRule] #test forceGC
Done 
[main] 17:49:17,400 INFO  [org.apache.activemq.artemis.utils.ThreadLeakCheckRule] #test forceGC
[main] 17:49:17,906 INFO  [org.apache.activemq.artemis.utils.ThreadLeakCheckRule] #test forceGC
Done 
[main] 17:49:17,906 INFO  [org.apache.activemq.artemis.utils.ThreadLeakCheckRule] #test forceGC
[main] 17:49:18,093 INFO  [org.apache.activemq.artemis.utils.ThreadLeakCheckRule] #test forceGC
Done 
[main] 17:49:18,093 INFO  [org.apache.activemq.artemis.utils.ThreadLeakCheckRule] #test forceGC
[main] 17:49:18,155 INFO  [org.apache.activemq.artemis.utils.ThreadLeakCheckRule] #test forceGC
Done 
[main] 17:49:18,156 INFO  [org.apache.activemq.artemis.utils.ThreadLeakCheckRule] #test forceGC
[main] 17:49:18,237 INFO  [org.apache.activemq.artemis.utils.ThreadLeakCheckRule] #test forceGC
Done 
[main] 17:49:18,240 INFO  [org.apache.activemq.artemis.core.server] #*#*# Finished test: testAddAndRemove()...
[main] 17:49:18,240 INFO  [org.apache.activemq.artemis.core.server] #*#*# Starting test: testRemoveHeadAndTail1()...
#test testRemoveHeadAndTail1
[main] 17:49:18,244 INFO  [org.apache.activemq.artemis.core.server] #*#*# Finished test: testRemoveHeadAndTail1()...
[main] 17:49:18,245 INFO  [org.apache.activemq.artemis.core.server] #*#*# Starting test: testRemoveHeadAndTail2()...
#test testRemoveHeadAndTail2
[main] 17:49:18,249 INFO  [org.apache.activemq.artemis.core.server] #*#*# Finished test: testRemoveHeadAndTail2()...
[main] 17:49:18,250 INFO  [org.apache.activemq.artemis.core.server] #*#*# Starting test: testRemoveHeadAndTail3()...
#test testRemoveHeadAndTail3
[main] 17:49:18,253 INFO  [org.apache.activemq.artemis.core.server] #*#*# Finished test: testRemoveHeadAndTail3()...
[main] 17:49:18,253 INFO  [org.apache.activemq.artemis.core.server] #*#*# Starting test: testRepeat()...
#test testRepeat
[main] 17:49:18,258 INFO  [org.apache.activemq.artemis.core.server] #*#*# Finished test: testRepeat()...
[main] 17:49:18,259 INFO  [org.apache.activemq.artemis.core.server] #*#*# Starting test: testCreateIteratorBeforeAddElements()...
#test testCreateIteratorBeforeAddElements
[main] 17:49:18,267 INFO  [org.apache.activemq.artemis.core.server] #*#*# Finished test: testCreateIteratorBeforeAddElements()...
[main] 17:49:18,268 INFO  [org.apache.activemq.artemis.core.server] #*#*# Starting test: testRemoveAll()...
#test testRemoveAll
[main] 17:49:18,272 INFO  [org.apache.activemq.artemis.core.server] #*#*# Finished test: testRemoveAll()...
[main] 17:49:18,273 INFO  [org.apache.activemq.artemis.core.server] #*#*# Starting test: testRemoveOdd()...
#test testRemoveOdd
[main] 17:49:18,278 INFO  [org.apache.activemq.artemis.core.server] #*#*# Finished test: testRemoveOdd()...
[main] 17:49:18,279 INFO  [org.apache.activemq.artemis.core.server] #*#*# Starting test: testIterateThenAddMoreAndIterateAgain()...
#test testIterateThenAddMoreAndIterateAgain
[main] 17:49:18,302 INFO  [org.apache.activemq.artemis.core.server] #*#*# Finished test: testIterateThenAddMoreAndIterateAgain()...
Tests run: 29, Failures: 0, Errors: 0, Skipped: 0, Time elapsed: 6.962 sec - in org.apache.activemq.artemis.tests.unit.util.LinkedListTest
Running org.apache.activemq.artemis.tests.unit.util.MemorySizeTest
[main] 17:49:26,784 WARN  [org.apache.activemq.artemis.core.client] AMQ212047: Warning: JVM
allocated more data what would make results invalid 1,568,669,696:1,569,193,984
[main] 17:49:26,785 INFO  [org.apache.activemq.artemis.tests.unit] Server message size is
1216
[main] 17:49:35,477 WARN  [org.apache.activemq.artemis.core.client] AMQ212047: Warning: JVM
allocated more data what would make results invalid 1,562,902,528:1,566,048,256
[main] 17:49:35,477 INFO  [org.apache.activemq.artemis.tests.unit] Message reference size
is 64
Tests run: 1, Failures: 0, Errors: 0, Skipped: 0, Time elapsed: 17.168 sec - in org.apache.activemq.artemis.tests.unit.util.MemorySizeTest
Running org.apache.activemq.artemis.tests.unit.util.ObjectInputStreamWithClassLoaderTest
[main] 17:49:35,480 INFO  [org.apache.activemq.artemis.core.server] #*#*# Starting test: testClassLoaderIsolationWithProxy()...
#test testClassLoaderIsolationWithProxy
Deserialized Object org.apache.activemq.artemis.tests.unit.util.ObjectInputStreamWithClassLoaderTest$AnObjectImpl@6b63d445
[main] 17:49:35,537 INFO  [org.apache.activemq.artemis.core.server] #*#*# Finished test: testClassLoaderIsolationWithProxy()...
[main] 17:49:35,541 INFO  [org.apache.activemq.artemis.core.server] #*#*# Starting test: testWhiteBlackListAgainstListObject()...
#test testWhiteBlackListAgainstListObject
[main] 17:49:35,552 INFO  [org.apache.activemq.artemis.core.server] #*#*# Finished test: testWhiteBlackListAgainstListObject()...
[main] 17:49:35,553 INFO  [org.apache.activemq.artemis.core.server] #*#*# Starting test: testWhiteBlackListAgainstArrayObject()...
#test testWhiteBlackListAgainstArrayObject
[main] 17:49:35,557 INFO  [org.apache.activemq.artemis.core.server] #*#*# Finished test: testWhiteBlackListAgainstArrayObject()...
[main] 17:49:35,558 INFO  [org.apache.activemq.artemis.core.server] #*#*# Starting test: testWhiteBlackListAnonymousObject()...
#test testWhiteBlackListAnonymousObject
[main] 17:49:35,566 INFO  [org.apache.activemq.artemis.core.server] #*#*# Finished test: testWhiteBlackListAnonymousObject()...
[main] 17:49:35,566 INFO  [org.apache.activemq.artemis.core.server] #*#*# Starting test: testWhiteBlackListLocalObject()...
#test testWhiteBlackListLocalObject
[main] 17:49:35,572 INFO  [org.apache.activemq.artemis.core.server] #*#*# Finished test: testWhiteBlackListLocalObject()...
[main] 17:49:35,572 INFO  [org.apache.activemq.artemis.core.server] #*#*# Starting test: testWhiteBlackListSystemProperty()...
#test testWhiteBlackListSystemProperty
[main] 17:49:35,576 INFO  [org.apache.activemq.artemis.core.server] #*#*# Finished test: testWhiteBlackListSystemProperty()...
[main] 17:49:35,576 INFO  [org.apache.activemq.artemis.core.server] #*#*# Starting test: testClassLoaderIsolation()...
#test testClassLoaderIsolation
[main] 17:49:35,621 INFO  [org.apache.activemq.artemis.core.server] #*#*# Finished test: testClassLoaderIsolation()...
[main] 17:49:35,621 INFO  [org.apache.activemq.artemis.core.server] #*#*# Starting test: testWhiteBlackList()...
#test testWhiteBlackList
[main] 17:49:35,627 INFO  [org.apache.activemq.artemis.core.server] #*#*# Finished test: testWhiteBlackList()...
[main] 17:49:35,628 INFO  [org.apache.activemq.artemis.core.server] #*#*# Starting test: testWhiteBlackListAgainstListMapObject()...
#test testWhiteBlackListAgainstListMapObject
[main] 17:49:35,639 INFO  [org.apache.activemq.artemis.core.server] #*#*# Finished test: testWhiteBlackListAgainstListMapObject()...
Tests run: 9, Failures: 0, Errors: 0, Skipped: 0, Time elapsed: 0.157 sec - in org.apache.activemq.artemis.tests.unit.util.ObjectInputStreamWithClassLoaderTest
Running org.apache.activemq.artemis.tests.unit.util.ReusableLatchTest
[main] 17:49:35,641 INFO  [org.apache.activemq.artemis.core.server] #*#*# Starting test: testLatchWithParameterizedDown()...
#test testLatchWithParameterizedDown
[main] 17:49:35,644 INFO  [org.apache.activemq.artemis.core.server] #*#*# Finished test: testLatchWithParameterizedDown()...
[main] 17:49:35,645 INFO  [org.apache.activemq.artemis.core.server] #*#*# Starting test: testLatchOnSingleThread()...
#test testLatchOnSingleThread
[main] 17:49:35,648 INFO  [org.apache.activemq.artemis.core.server] #*#*# Finished test: testLatchOnSingleThread()...
[main] 17:49:35,649 INFO  [org.apache.activemq.artemis.core.server] #*#*# Starting test: testReuseLatch()...
#test testReuseLatch
[main] 17:49:35,654 INFO  [org.apache.activemq.artemis.core.server] #*#*# Finished test: testReuseLatch()...
[main] 17:49:35,654 INFO  [org.apache.activemq.artemis.core.server] #*#*# Starting test: testLatchOnMultiThread()...
#test testLatchOnMultiThread
[main] 17:49:35,888 INFO  [org.apache.activemq.artemis.core.server] #*#*# Finished test: testLatchOnMultiThread()...
Tests run: 4, Failures: 0, Errors: 0, Skipped: 0, Time elapsed: 0.249 sec - in org.apache.activemq.artemis.tests.unit.util.ReusableLatchTest
Running org.apache.activemq.artemis.tests.unit.util.SoftValueMapTest
[main] 17:49:35,889 INFO  [org.apache.activemq.artemis.core.server] #*#*# Starting test: testEvictionsLeastUsed()...
#test testEvictionsLeastUsed
[main] 17:49:35,891 INFO  [org.apache.activemq.artemis.utils.ThreadLeakCheckRule] #test forceGC
[main] 17:49:36,014 INFO  [org.apache.activemq.artemis.utils.ThreadLeakCheckRule] #test forceGC
Done 
SoftCache.size 200
Soft cache has 200 elements
[main] 17:49:36,019 INFO  [org.apache.activemq.artemis.core.server] #*#*# Finished test: testEvictionsLeastUsed()...
[main] 17:49:36,020 INFO  [org.apache.activemq.artemis.core.server] #*#*# Starting test: testEvictions()...
#test testEvictions
[main] 17:49:36,021 INFO  [org.apache.activemq.artemis.utils.ThreadLeakCheckRule] #test forceGC
[main] 17:49:36,064 INFO  [org.apache.activemq.artemis.utils.ThreadLeakCheckRule] #test forceGC
Done 
SUREFIRE-859: Java HotSpot(TM) 64-Bit Server VM warning: INFO: os::commit_memory(0x000000071fc80000,
611319808, 0) failed; error='Cannot allocate memory' (errno=12)
#
# There is insufficient memory for the Java Runtime Environment to continue.
# Native memory allocation (mmap) failed to map 611319808 bytes for committing reserved memory.
# An error report file with more information is saved as:
# <https://builds.apache.org/job/ActiveMQ-Artemis-Master/ws/tests/unit-tests/hs_err_pid19699.log>

Results :

Tests run: 603, Failures: 0, Errors: 0, Skipped: 0

[INFO] ------------------------------------------------------------------------
[INFO] Reactor Summary:
[INFO] 
[INFO] ActiveMQ Artemis Parent ............................ SUCCESS [  9.747 s]
[INFO] ActiveMQ Artemis Commons ........................... SUCCESS [ 22.179 s]
[INFO] ActiveMQ Artemis Core Client ....................... SUCCESS [ 13.670 s]
[INFO] ActiveMQ Artemis Selector Implementation ........... SUCCESS [  4.873 s]
[INFO] ActiveMQ Artemis JMS Client ........................ SUCCESS [  4.369 s]
[INFO] ActiveMQ Artemis Native POM ........................ SUCCESS [  7.026 s]
[INFO] ActiveMQ Artemis Journal ........................... SUCCESS [  4.562 s]
[INFO] ActiveMQ Artemis JDBC Store ........................ SUCCESS [  9.970 s]
[INFO] ActiveMQ Artemis Server ............................ SUCCESS [ 59.148 s]
[INFO] ActiveMQ Artemis Protocols ......................... SUCCESS [  0.233 s]
[INFO] ActiveMQ Artemis AMQP Protocol ..................... SUCCESS [  7.729 s]
[INFO] ActiveMQ Artemis STOMP Protocol .................... SUCCESS [  3.338 s]
[INFO] ActiveMQ Artemis OpenWire Protocol ................. SUCCESS [  2.893 s]
[INFO] ActiveMQ Artemis HQClient Protocol ................. SUCCESS [  1.069 s]
[INFO] ActiveMQ Artemis HornetQ Protocol .................. SUCCESS [  1.118 s]
[INFO] ActiveMQ Artemis MQTT Protocol ..................... SUCCESS [  2.260 s]
[INFO] ActiveMQ Artemis DTO ............................... SUCCESS [  3.339 s]
[INFO] ActiveMQ Artemis Service Extensions ................ SUCCESS [  2.403 s]
[INFO] ActiveMQ Artemis JMS Server ........................ SUCCESS [  2.138 s]
[INFO] ActiveMQ Artemis CDI Integration ................... SUCCESS [  6.610 s]
[INFO] ActiveMQ Artemis Boot .............................. SUCCESS [  0.290 s]
[INFO] ActiveMQ Artemis Tools ............................. SUCCESS [  1.326 s]
[INFO] ActiveMQ Artemis CLI ............................... SUCCESS [ 32.630 s]
[INFO] ActiveMQ Artemis Web ............................... SUCCESS [  6.114 s]
[INFO] ActiveMQ Artemis Web ............................... SUCCESS [01:23 min]
[INFO] ActiveMQ Artemis Core Client All ................... SUCCESS [ 18.018 s]
[INFO] ActiveMQ Artemis JUnit Rules ....................... SUCCESS [ 20.011 s]
[INFO] ActiveMQ Artemis JMS Client All .................... SUCCESS [ 14.804 s]
[INFO] ActiveMQ Artemis RAR POM ........................... SUCCESS [  3.194 s]
[INFO] ActiveMQ Artemis REST Interface Implementation ..... SUCCESS [01:34 min]
[INFO] ActiveMQ Artemis Maven Plugin ...................... SUCCESS [  3.536 s]
[INFO] ActiveMQ Artemis Server OSGi ....................... SUCCESS [ 11.603 s]
[INFO] ActiveMQ Artemis Cons .............................. SUCCESS [  0.128 s]
[INFO] ActiveMQ Artemis HawtIO Branding ................... SUCCESS [  7.194 s]
[INFO] ActiveMQ Artemis HawtIO Plugin ..................... SUCCESS [  0.999 s]
[INFO] ActiveMQ Artemis Console ........................... SUCCESS [  6.102 s]
[INFO] ActiveMQ Artemis Spring Integration ................ SUCCESS [  1.260 s]
[INFO] Apache ActiveMQ Artemis Distribution ............... SUCCESS [ 29.324 s]
[INFO] ActiveMQ Artemis Tests POM ......................... SUCCESS [  0.732 s]
[INFO] ActiveMQ Artemis Unit Tests ........................ FAILURE [02:25 min]
[INFO] ActiveMQ Artemis Joram Tests ....................... SKIPPED
[INFO] ActiveMQ Artemis timing Tests ...................... SKIPPED
[INFO] ActiveMQ Artemis JMS Tests ......................... SKIPPED
[INFO] ActiveMQ Artemis Features .......................... SKIPPED
[INFO] ActiveMQ Artemis Test Support ...................... SKIPPED
[INFO] ActiveMQ Artemis Integration Tests ................. SKIPPED
[INFO] ActiveMQ Artemis soak Tests ........................ SKIPPED
[INFO] ActiveMQ Artemis stress Tests ...................... SKIPPED
[INFO] ActiveMQ Artemis performance Tests ................. SKIPPED
[INFO] Smoke Tests ........................................ SKIPPED
[INFO] ActiveMQ Artemis Extra Tests ....................... SKIPPED
[INFO] ------------------------------------------------------------------------
[INFO] BUILD FAILURE
[INFO] ------------------------------------------------------------------------
[INFO] Total time: 10:53 min
[INFO] Finished at: 2017-10-02T17:49:39+00:00
[INFO] Final Memory: 260M/1633M
[INFO] ------------------------------------------------------------------------
[ERROR] Failed to execute goal org.apache.maven.plugins:maven-surefire-plugin:2.18.1:test
(default-test) on project unit-tests: Execution default-test of goal org.apache.maven.plugins:maven-surefire-plugin:2.18.1:test
failed: The forked VM terminated without properly saying goodbye. VM crash or System.exit
called?
[ERROR] Command was /bin/sh -c cd <https://builds.apache.org/job/ActiveMQ-Artemis-Master/ws/tests/unit-tests>
&& /usr/local/asfpackages/java/jdk1.8.0_144/jre/bin/java -Djava.util.logging.manager=org.jboss.logmanager.LogManager
-Dlogging.configuration=<https://builds.apache.org/job/ActiveMQ-Artemis-Master/ws/tests/unit-tests/../../tests/config/logging.properties>
-Djava.library.path=<https://builds.apache.org/job/ActiveMQ-Artemis-Master/ws/tests/unit-tests/../../artemis-native/bin>
-Djgroups.bind_addr=localhost -Dorg.apache.activemq.artemis.api.core.UDPBroadcastEndpointFactory.localBindAddress=localhost
-Djava.net.preferIPv4Stack=true -Dbasedir=<https://builds.apache.org/job/ActiveMQ-Artemis-Master/ws/tests/unit-tests>
-jar <https://builds.apache.org/job/ActiveMQ-Artemis-Master/ws/tests/unit-tests/target/surefire/surefirebooter7752889756196452012.jar>
<https://builds.apache.org/job/ActiveMQ-Artemis-Master/ws/tests/unit-tests/target/surefire/surefire6956165716123310207tmp>
<https://builds.apache.org/job/ActiveMQ-Artemis-Master/ws/tests/unit-tests/target/surefire/surefire_167803035466755075217tmp>
[ERROR] -> [Help 1]
[ERROR] 
[ERROR] To see the full stack trace of the errors, re-run Maven with the -e switch.
[ERROR] Re-run Maven using the -X switch to enable full debug logging.
[ERROR] 
[ERROR] For more information about the errors and possible solutions, please read the following
articles:
[ERROR] [Help 1] http://cwiki.apache.org/confluence/display/MAVEN/PluginExecutionException
[ERROR] 
[ERROR] After correcting the problems, you can resume the build with the command
[ERROR]   mvn <goals> -rf :unit-tests
Build step 'Invoke top-level Maven targets' marked build as failure
Performing Post build task...
Could not match :Too many files with unapproved license  : False
Logical operation result is FALSE
Skipping script  : cat ratReport.txt
END OF POST BUILD TASK 	: 0
Recording test results

Mime
View raw message