activemq-commits mailing list archives

Site index · List index
Message view « Date » · « Thread »
Top « Date » · « Thread »
From Apache Jenkins Server <jenk...@builds.apache.org>
Subject Build failed in Jenkins: ActiveMQ-Artemis-Master #1805
Date Sun, 06 May 2018 23:35:48 GMT
See <https://builds.apache.org/job/ActiveMQ-Artemis-Master/1805/display/redirect?page=changes>

Changes:

[clebertsuconic] NO-JIRA fixing race on a test

------------------------------------------
[...truncated 1.60 MB...]
[INFO] 3 resources included (use -debug for more details)
[INFO] Rat check: Summary over all files. Unapproved: 0, unknown: 0, generated: 0, approved:
3 licenses.
[INFO] 
[INFO] --- maven-site-plugin:3.3:attach-descriptor (attach-descriptor) @ artemis-features
---
[INFO] 
[INFO] >>> maven-source-plugin:2.2.1:jar (attach-sources) > generate-sources @
artemis-features >>>
[INFO] 
[INFO] --- maven-enforcer-plugin:1.4:enforce (enforce-maven) @ artemis-features ---
[INFO] 
[INFO] --- maven-enforcer-plugin:1.4:enforce (enforce-java) @ artemis-features ---
[INFO] 
[INFO] <<< maven-source-plugin:2.2.1:jar (attach-sources) < generate-sources @
artemis-features <<<
[INFO] 
[INFO] --- maven-source-plugin:2.2.1:jar (attach-sources) @ artemis-features ---
[INFO] 
[INFO] --- build-helper-maven-plugin:1.8:attach-artifact (attach-artifacts) @ artemis-features
---
[INFO] 
[INFO] >>> maven-source-plugin:2.2.1:jar (default) > generate-sources @ artemis-features
>>>
[INFO] 
[INFO] --- maven-enforcer-plugin:1.4:enforce (enforce-maven) @ artemis-features ---
[INFO] 
[INFO] --- maven-enforcer-plugin:1.4:enforce (enforce-java) @ artemis-features ---
[INFO] 
[INFO] <<< maven-source-plugin:2.2.1:jar (default) < generate-sources @ artemis-features
<<<
[INFO] 
[INFO] --- maven-source-plugin:2.2.1:jar (default) @ artemis-features ---
[INFO] 
[INFO] --- dependency-check-maven:1.4.3:check (default) @ artemis-features ---
[INFO] Skipping dependency-check
[INFO] 
[INFO] --- maven-install-plugin:2.4:install (default-install) @ artemis-features ---
[INFO] Installing <https://builds.apache.org/job/ActiveMQ-Artemis-Master/ws/artemis-features/pom.xml>
to /home/jenkins/.m2/repository/org/apache/activemq/artemis-features/2.6.0-SNAPSHOT/artemis-features-2.6.0-SNAPSHOT.pom
[INFO] Installing <https://builds.apache.org/job/ActiveMQ-Artemis-Master/ws/artemis-features/target/classes/features.xml>
to /home/jenkins/.m2/repository/org/apache/activemq/artemis-features/2.6.0-SNAPSHOT/artemis-features-2.6.0-SNAPSHOT-features.xml
[INFO] Installing <https://builds.apache.org/job/ActiveMQ-Artemis-Master/ws/artemis-features/target/classes/artemis.xml>
to /home/jenkins/.m2/repository/org/apache/activemq/artemis-features/2.6.0-SNAPSHOT/artemis-features-2.6.0-SNAPSHOT-artemis.xml
[INFO] Installing <https://builds.apache.org/job/ActiveMQ-Artemis-Master/ws/artemis-features/target/classes/org.apache.activemq.artemis.cfg>
to /home/jenkins/.m2/repository/org/apache/activemq/artemis-features/2.6.0-SNAPSHOT/artemis-features-2.6.0-SNAPSHOT.cfg
[INFO] 
[INFO] --- karaf-maven-plugin:4.1.1:verify (verify) @ artemis-features ---
[INFO] Using repositories: http://repository.apache.org/snapshots@id=Nexus@noreleases@snapshots,https://repo.maven.apache.org/maven2@id=central
[INFO] Verification of feature transaction-api/1.2.0 succeeded
[INFO] Verification of feature transaction-manager-geronimo/1.3.2 succeeded
[INFO] Verification of feature transaction-manager-narayana/5.5.2.Final succeeded
[INFO] Verification of feature transaction/2.0.0 succeeded
[INFO] Verification of feature [transaction/2.0.0, aries-blueprint] succeeded
[INFO] Verification of feature connector/3.1.1 succeeded
[INFO] Verification of feature jpa/2.6.0 succeeded
[INFO] Verification of feature [jpa/2.6.0, aries-blueprint] succeeded
[INFO] Verification of feature openjpa/2.4.1 succeeded
[INFO] Verification of feature hibernate/5.2.8.Final succeeded
[INFO] Verification of feature eclipselink/2.6.4 succeeded
[INFO] Verification of feature jndi/4.1.1 succeeded
[INFO] Verification of feature jdbc/4.1.1 succeeded
[INFO] Verification of feature jms/4.1.1 succeeded
[INFO] Verification of feature application-without-isolation/1.0.0 succeeded
[INFO] Verification of feature subsystems/2.0.8 succeeded
[INFO] Verification of feature [subsystems/2.0.8, shell] succeeded
[INFO] Verification of feature artemis/2.6.0.SNAPSHOT succeeded
[INFO] Verification of feature netty-core/4.1.24.Final succeeded
[INFO] Verification of feature artemis-common/2.6.0.SNAPSHOT succeeded
[INFO] Verification of feature artemis-core/2.6.0.SNAPSHOT succeeded
[INFO] Verification of feature artemis-core-client/2.6.0.SNAPSHOT succeeded
[INFO] Verification of feature artemis-jms-client/2.6.0.SNAPSHOT succeeded
[INFO] Verification of feature artemis-amqp-client/2.6.0.SNAPSHOT succeeded
[INFO] Verification of feature artemis-amqp/2.6.0.SNAPSHOT succeeded
[INFO] Verification of feature artemis-stomp/2.6.0.SNAPSHOT succeeded
[INFO] Verification of feature artemis-mqtt/2.6.0.SNAPSHOT succeeded
[INFO] Verification of feature artemis-hornetq/2.6.0.SNAPSHOT succeeded
[INFO] Verification of feature artemis-openwire/2.6.0.SNAPSHOT succeeded
[INFO] Verification of feature artemis-openwire-client/2.6.0.SNAPSHOT succeeded
[INFO] Verification of feature framework/4.1.1 succeeded
[INFO] Verification of feature framework-logback/4.1.1 succeeded
[INFO]                                                                         
[INFO] ------------------------------------------------------------------------
[INFO] Building ActiveMQ Artemis Integration Tests 2.6.0-SNAPSHOT
[INFO] ------------------------------------------------------------------------
[INFO] 
[INFO] --- maven-enforcer-plugin:1.4:enforce (enforce-maven) @ integration-tests ---
[INFO] 
[INFO] --- maven-enforcer-plugin:1.4:enforce (enforce-java) @ integration-tests ---
[INFO] 
[INFO] --- maven-remote-resources-plugin:1.5:process (process-resource-bundles) @ integration-tests
---
[INFO] 
[INFO] --- depends-maven-plugin:1.2:generate-depends-file (generate-depends-file) @ integration-tests
---
[INFO] Created: <https://builds.apache.org/job/ActiveMQ-Artemis-Master/ws/tests/integration-tests/target/classes/META-INF/maven/dependencies.properties>
[INFO] 
[INFO] --- maven-resources-plugin:2.6:resources (default-resources) @ integration-tests ---
[INFO] Using 'UTF-8' encoding to copy filtered resources.
[INFO] skip non existing resourceDirectory <https://builds.apache.org/job/ActiveMQ-Artemis-Master/ws/tests/integration-tests/src/main/resources>
[INFO] Copying 3 resources
[INFO] 
[INFO] --- maven-compiler-plugin:3.1:compile (default-compile) @ integration-tests ---
[INFO] No sources to compile
[INFO] 
[INFO] --- maven-checkstyle-plugin:2.17:check (default) @ integration-tests ---
[INFO] Starting audit...
Audit done.
[INFO] 
[INFO] --- apache-rat-plugin:0.12:check (default) @ integration-tests ---
[INFO] Enabled default license matchers.
[INFO] Will parse SCM ignores for exclusions...
[INFO] Finished adding exclusions from SCM ignore files.
[INFO] 61 implicit excludes (use -debug for more details).
[INFO] Exclude: .travis.yml
[INFO] Exclude: **/footer.html
[INFO] Exclude: **/*.txt
[INFO] Exclude: **/*.md
[INFO] Exclude: etc/ide-settings/**
[INFO] Exclude: docs/**/*.json
[INFO] Exclude: docs/**/_book/
[INFO] Exclude: **/target/
[INFO] Exclude: **/META-INF/services/*
[INFO] Exclude: **/META-INF/MANIFEST.MF
[INFO] Exclude: **/*.iml
[INFO] Exclude: **/*.jceks
[INFO] Exclude: **/*.jks
[INFO] Exclude: **/xml.xsd
[INFO] Exclude: **/org/apache/activemq/artemis/utils/json/**
[INFO] Exclude: **/org/apache/activemq/artemis/utils/Base64.java
[INFO] Exclude: **/.settings/**
[INFO] Exclude: **/.project
[INFO] Exclude: **/.classpath
[INFO] Exclude: **/.editorconfig
[INFO] Exclude: **/.checkstyle
[INFO] Exclude: **/.factorypath
[INFO] Exclude: **/org.apache.activemq.artemis.cfg
[INFO] Exclude: **/nb-configuration.xml
[INFO] Exclude: **/*.data
[INFO] Exclude: **/*.bin
[INFO] Exclude: **/src/test/resources/keystore
[INFO] Exclude: **/*.log
[INFO] Exclude: **/*.redo
[INFO] Exclude: **/node/**
[INFO] Exclude: **/node_modules/**
[INFO] Exclude: **/package.json
[INFO] Exclude: **/npm-shrinkwrap.json
[INFO] Exclude: **/overlays/**
[INFO] Exclude: **/CMakeFiles/
[INFO] Exclude: **/Makefile
[INFO] Exclude: **/cmake_install.cmake
[INFO] Exclude: artemis-native/src/main/c/org_apache_activemq_artemis_jlibaio_LibaioContext.h
[INFO] Exclude: **/dependency-reduced-pom.xml
[INFO] 749 resources included (use -debug for more details)
[INFO] Rat check: Summary over all files. Unapproved: 0, unknown: 0, generated: 0, approved:
748 licenses.
[INFO] 
[INFO] --- maven-resources-plugin:2.6:testResources (default-testResources) @ integration-tests
---
[INFO] Using 'UTF-8' encoding to copy filtered resources.
[INFO] Copying 48 resources
[INFO] Copying 3 resources
[INFO] 
[INFO] --- maven-compiler-plugin:3.1:testCompile (default-testCompile) @ integration-tests
---
[INFO] Changes detected - recompiling the module!
[INFO] Compiling 705 source files to <https://builds.apache.org/job/ActiveMQ-Artemis-Master/ws/tests/integration-tests/target/test-classes>
<https://builds.apache.org/job/ActiveMQ-Artemis-Master/ws/tests/integration-tests/src/test/java/org/apache/activemq/artemis/tests/integration/persistence/SyncSendTest.java>:157:
warning: non-varargs call of varargs method with inexact argument type for last parameter;
      jms.createQueue(true, "queue", null, true, null);
                                                 ^
  cast to String for a varargs call
  cast to String[] for a non-varargs call and to suppress this warning
<https://builds.apache.org/job/ActiveMQ-Artemis-Master/ws/tests/integration-tests/src/test/java/org/apache/activemq/artemis/tests/integration/clientcrash/ClientCrashTest.java>:69:
error: [MissingOverride] tearDown overrides method in ActiveMQTestBase; expected @Override
   public void tearDown() throws Exception {
               ^
    (see http://errorprone.info/bugpattern/MissingOverride)
  Did you mean '@Override @After'?
Note: Some input files use or override a deprecated API.
Note: Recompile with -Xlint:deprecation for details.
Note: Some input files use unchecked or unsafe operations.
Note: Recompile with -Xlint:unchecked for details.
1 error
1 warning
[INFO] ------------------------------------------------------------------------
[INFO] Reactor Summary:
[INFO] 
[INFO] ActiveMQ Artemis Parent ............................ SUCCESS [  5.996 s]
[INFO] ActiveMQ Artemis Commons ........................... SUCCESS [ 20.714 s]
[INFO] ActiveMQ Artemis Core Client ....................... SUCCESS [ 12.261 s]
[INFO] ActiveMQ Artemis Selector Implementation ........... SUCCESS [  4.807 s]
[INFO] ActiveMQ Artemis JMS Client ........................ SUCCESS [  4.656 s]
[INFO] ActiveMQ Artemis Native POM ........................ SUCCESS [  6.953 s]
[INFO] ActiveMQ Artemis Journal ........................... SUCCESS [  3.810 s]
[INFO] ActiveMQ Artemis JDBC Store ........................ SUCCESS [ 26.865 s]
[INFO] ActiveMQ Artemis Server ............................ SUCCESS [05:29 min]
[INFO] ActiveMQ Artemis Protocols ......................... SUCCESS [  0.160 s]
[INFO] ActiveMQ Artemis AMQP Protocol ..................... SUCCESS [  5.328 s]
[INFO] ActiveMQ Artemis STOMP Protocol .................... SUCCESS [  2.295 s]
[INFO] ActiveMQ Artemis OpenWire Protocol ................. SUCCESS [  2.795 s]
[INFO] ActiveMQ Artemis HQClient Protocol ................. SUCCESS [  0.792 s]
[INFO] ActiveMQ Artemis HornetQ Protocol .................. SUCCESS [  1.165 s]
[INFO] ActiveMQ Artemis MQTT Protocol ..................... SUCCESS [  2.256 s]
[INFO] ActiveMQ Artemis DTO ............................... SUCCESS [  2.687 s]
[INFO] ActiveMQ Artemis Service Extensions ................ SUCCESS [  2.055 s]
[INFO] ActiveMQ Artemis JMS Server ........................ SUCCESS [  2.012 s]
[INFO] ActiveMQ Artemis CDI Integration ................... SUCCESS [  6.115 s]
[INFO] ActiveMQ Artemis Boot .............................. SUCCESS [  0.316 s]
[INFO] ActiveMQ Artemis Tools ............................. SUCCESS [  0.951 s]
[INFO] ActiveMQ Artemis CLI ............................... SUCCESS [ 47.714 s]
[INFO] ActiveMQ Artemis Web ............................... SUCCESS [  6.784 s]
[INFO] ActiveMQ Artemis Web ............................... SUCCESS [01:18 min]
[INFO] ActiveMQ Artemis Core Client All ................... SUCCESS [ 15.878 s]
[INFO] ActiveMQ Artemis Client OSGi ....................... SUCCESS [  1.571 s]
[INFO] ActiveMQ Artemis JUnit Rules ....................... SUCCESS [  7.399 s]
[INFO] ActiveMQ Artemis JMS Client All .................... SUCCESS [ 13.804 s]
[INFO] ActiveMQ Artemis JMS Client OSGi ................... SUCCESS [  1.466 s]
[INFO] ActiveMQ Artemis RAR POM ........................... SUCCESS [  2.521 s]
[INFO] ActiveMQ Artemis REST Interface Implementation ..... SUCCESS [  4.135 s]
[INFO] ActiveMQ Artemis Maven Plugin ...................... SUCCESS [  3.859 s]
[INFO] ActiveMQ Artemis Server OSGi ....................... SUCCESS [ 11.192 s]
[INFO] ActiveMQ Artemis Cons .............................. SUCCESS [  0.144 s]
[INFO] ActiveMQ Artemis HawtIO Branding ................... SUCCESS [  5.452 s]
[INFO] ActiveMQ Artemis HawtIO Plugin ..................... SUCCESS [  0.707 s]
[INFO] ActiveMQ Artemis Console ........................... SUCCESS [  4.843 s]
[INFO] ActiveMQ Artemis Spring Integration ................ SUCCESS [  0.974 s]
[INFO] Apache ActiveMQ Artemis Distribution ............... SUCCESS [ 30.055 s]
[INFO] ActiveMQ Artemis Tests POM ......................... SUCCESS [  0.525 s]
[INFO] ActiveMQ Artemis Test Support ...................... SUCCESS [  1.659 s]
[INFO] ActiveMQ Artemis Unit Tests ........................ SUCCESS [03:39 min]
[INFO] ActiveMQ Artemis Joram Tests ....................... SUCCESS [ 46.819 s]
[INFO] ActiveMQ Artemis timing Tests ...................... SUCCESS [  0.892 s]
[INFO] ActiveMQ Artemis JMS Tests ......................... SUCCESS [05:47 min]
[INFO] ActiveMQ Artemis Features .......................... SUCCESS [ 23.431 s]
[INFO] ActiveMQ Artemis Integration Tests ................. FAILURE [ 24.720 s]
[INFO] ActiveMQ Artemis Client Integration Tests .......... SKIPPED
[INFO] ActiveMQ Artemis Compatibility Tests ............... SKIPPED
[INFO] ActiveMQ Artemis soak Tests ........................ SKIPPED
[INFO] ActiveMQ Artemis stress Tests ...................... SKIPPED
[INFO] ActiveMQ Artemis performance Tests ................. SKIPPED
[INFO] Smoke Tests ........................................ SKIPPED
[INFO] ActiveMQ Artemis Extra Tests ....................... SKIPPED
[INFO] ------------------------------------------------------------------------
[INFO] BUILD FAILURE
[INFO] ------------------------------------------------------------------------
[INFO] Total time: 22:28 min
[INFO] Finished at: 2018-05-06T23:35:43+00:00
[INFO] Final Memory: 338M/7276M
[INFO] ------------------------------------------------------------------------
[ERROR] Failed to execute goal org.apache.maven.plugins:maven-compiler-plugin:3.1:testCompile
(default-testCompile) on project integration-tests: Compilation failure -> [Help 1]
[ERROR] 
[ERROR] To see the full stack trace of the errors, re-run Maven with the -e switch.
[ERROR] Re-run Maven using the -X switch to enable full debug logging.
[ERROR] 
[ERROR] For more information about the errors and possible solutions, please read the following
articles:
[ERROR] [Help 1] http://cwiki.apache.org/confluence/display/MAVEN/MojoFailureException
[ERROR] 
[ERROR] After correcting the problems, you can resume the build with the command
[ERROR]   mvn <goals> -rf :integration-tests
Build step 'Invoke top-level Maven targets' marked build as failure
Performing Post build task...
Could not match :Too many files with unapproved license  : False
Logical operation result is FALSE
Skipping script  : cat ratReport.txt
END OF POST BUILD TASK 	: 0
Recording test results

Mime
View raw message