activemq-commits mailing list archives

Site index · List index
Message view « Date » · « Thread »
Top « Date » · « Thread »
From Apache Jenkins Server <jenk...@builds.apache.org>
Subject Build failed in Jenkins: ActiveMQ-Artemis-Master #2501
Date Wed, 04 Sep 2019 06:07:28 GMT
See <https://builds.apache.org/job/ActiveMQ-Artemis-Master/2501/display/redirect?page=changes>

Changes:

[wy96fyw] ARTEMIS-2380 Fix delivering message in the case of consume close

------------------------------------------
[...truncated 292.24 KB...]
[main] 06:01:06,613 INFO  [org.apache.activemq.artemis.core.server] **** start #test testPageReadMessageBeyondPage()
***
[main] 06:01:06,631 INFO  [org.apache.activemq.artemis.core.server] **** end #test testPageReadMessageBeyondPage()
***
[main] 06:01:06,633 INFO  [org.apache.activemq.artemis.core.server] **** start #test testPageReadMessageKeepOpen()
***
[main] 06:01:06,643 INFO  [org.apache.activemq.artemis.core.server] **** end #test testPageReadMessageKeepOpen()
***
[main] 06:01:06,645 INFO  [org.apache.activemq.artemis.core.server] **** start #test testPageReadMessage()
***
[main] 06:01:06,712 INFO  [org.apache.activemq.artemis.core.server] **** end #test testPageReadMessage()
***
Tests run: 3, Failures: 0, Errors: 0, Skipped: 0, Time elapsed: 0.114 sec - in org.apache.activemq.artemis.core.paging.cursor.impl.PageReaderTest
Running org.apache.activemq.artemis.core.persistence.impl.journal.JournalStorageManagerTest
[main] 06:01:06,733 INFO  [org.apache.activemq.artemis.core.server] **** start #test testAddBytesToLargeMessageNotLeakingByteBuffer[journal
type=NIO]() ***
[main] 06:01:07,225 INFO  [org.apache.activemq.artemis.core.server] **** end #test testAddBytesToLargeMessageNotLeakingByteBuffer[journal
type=NIO]() ***
[main] 06:01:07,227 INFO  [org.apache.activemq.artemis.core.server] **** start #test testStopReplicationDoesNotDeadlockWhileStopping[journal
type=NIO]() ***
[main] 06:01:08,257 INFO  [org.apache.activemq.artemis.core.server] **** end #test testStopReplicationDoesNotDeadlockWhileStopping[journal
type=NIO]() ***
[main] 06:01:08,259 INFO  [org.apache.activemq.artemis.core.server] **** start #test testFixJournalFileSize[journal
type=NIO]() ***
[main] 06:01:08,261 INFO  [org.apache.activemq.artemis.core.server] AMQ221058: resetting Journal
File size from 4,098 to 4,096 to fit with alignment of 4,096
[main] 06:01:08,263 INFO  [org.apache.activemq.artemis.core.server] **** end #test testFixJournalFileSize[journal
type=NIO]() ***
[main] 06:01:08,263 INFO  [org.apache.activemq.artemis.core.server] **** start #test testAddBytesToLargeMessageNotLeakingByteBuffer[journal
type=ASYNCIO]() ***
[main] 06:01:08,385 INFO  [org.apache.activemq.artemis.core.server] **** end #test testAddBytesToLargeMessageNotLeakingByteBuffer[journal
type=ASYNCIO]() ***
[main] 06:01:08,386 INFO  [org.apache.activemq.artemis.core.server] **** start #test testStopReplicationDoesNotDeadlockWhileStopping[journal
type=ASYNCIO]() ***
[main] 06:01:09,000 INFO  [org.apache.activemq.artemis.core.server] **** end #test testStopReplicationDoesNotDeadlockWhileStopping[journal
type=ASYNCIO]() ***
[main] 06:01:09,001 INFO  [org.apache.activemq.artemis.core.server] **** start #test testFixJournalFileSize[journal
type=ASYNCIO]() ***
[main] 06:01:09,004 INFO  [org.apache.activemq.artemis.core.server] AMQ221058: resetting Journal
File size from 4,098 to 4,096 to fit with alignment of 4,096
[main] 06:01:09,006 INFO  [org.apache.activemq.artemis.core.server] **** end #test testFixJournalFileSize[journal
type=ASYNCIO]() ***
[main] 06:01:09,007 INFO  [org.apache.activemq.artemis.core.server] **** start #test testAddBytesToLargeMessageNotLeakingByteBuffer[journal
type=MAPPED]() ***
[main] 06:01:09,062 INFO  [org.apache.activemq.artemis.core.server] **** end #test testAddBytesToLargeMessageNotLeakingByteBuffer[journal
type=MAPPED]() ***
[main] 06:01:09,063 INFO  [org.apache.activemq.artemis.core.server] **** start #test testStopReplicationDoesNotDeadlockWhileStopping[journal
type=MAPPED]() ***
[main] 06:01:09,620 INFO  [org.apache.activemq.artemis.core.server] **** end #test testStopReplicationDoesNotDeadlockWhileStopping[journal
type=MAPPED]() ***
[main] 06:01:09,621 INFO  [org.apache.activemq.artemis.core.server] **** start #test testFixJournalFileSize[journal
type=MAPPED]() ***
[main] 06:01:09,622 INFO  [org.apache.activemq.artemis.core.server] AMQ221058: resetting Journal
File size from 4,098 to 4,096 to fit with alignment of 4,096
[main] 06:01:09,624 INFO  [org.apache.activemq.artemis.core.server] **** end #test testFixJournalFileSize[journal
type=MAPPED]() ***
Tests run: 9, Failures: 0, Errors: 0, Skipped: 0, Time elapsed: 2.914 sec - in org.apache.activemq.artemis.core.persistence.impl.journal.JournalStorageManagerTest
Running org.apache.activemq.artemis.core.persistence.impl.journal.QueueBindingEncodingTest
Tests run: 1, Failures: 0, Errors: 0, Skipped: 0, Time elapsed: 0.002 sec - in org.apache.activemq.artemis.core.persistence.impl.journal.QueueBindingEncodingTest
Running org.apache.activemq.artemis.core.protocol.core.impl.wireformat.ReplicationSyncFileMessageTest
[main] 06:01:09,635 INFO  [org.apache.activemq.artemis.core.server] **** start #test testInVMConnectionEncodeMessage()
***
[main] 06:01:09,689 INFO  [org.apache.activemq.artemis.core.server] **** end #test testInVMConnectionEncodeMessage()
***
[main] 06:01:09,690 INFO  [org.apache.activemq.artemis.core.server] **** start #test testNettyConnectionEncodeMessage()
***
[main] 06:01:09,782 INFO  [org.apache.activemq.artemis.core.server] **** end #test testNettyConnectionEncodeMessage()
***
Tests run: 2, Failures: 0, Errors: 0, Skipped: 0, Time elapsed: 0.151 sec - in org.apache.activemq.artemis.core.protocol.core.impl.wireformat.ReplicationSyncFileMessageTest
Running org.apache.activemq.artemis.core.reload.LoggingConfigurationFileReloaderTest
[main] 06:01:09,787 INFO  [org.apache.activemq.artemis.core.server] AMQ221056: Reloading configuration:
logging
Tests run: 1, Failures: 0, Errors: 0, Skipped: 0, Time elapsed: 0.013 sec - in org.apache.activemq.artemis.core.reload.LoggingConfigurationFileReloaderTest
Running org.apache.activemq.artemis.core.reload.ReloadManagerTest
Tests run: 2, Failures: 0, Errors: 0, Skipped: 0, Time elapsed: 2.021 sec - in org.apache.activemq.artemis.core.reload.ReloadManagerTest
Running org.apache.activemq.artemis.core.security.RoleTest
Tests run: 5, Failures: 0, Errors: 0, Skipped: 0, Time elapsed: 0.004 sec - in org.apache.activemq.artemis.core.security.RoleTest
Running org.apache.activemq.artemis.core.security.jaas.CertificateLoginModuleTest
Tests run: 3, Failures: 0, Errors: 0, Skipped: 0, Time elapsed: 0.008 sec - in org.apache.activemq.artemis.core.security.jaas.CertificateLoginModuleTest
Running org.apache.activemq.artemis.core.security.jaas.GuestLoginModuleTest
Tests run: 2, Failures: 0, Errors: 0, Skipped: 0, Time elapsed: 0.011 sec - in org.apache.activemq.artemis.core.security.jaas.GuestLoginModuleTest
Running org.apache.activemq.artemis.core.security.jaas.JAASSecurityManagerTest
loader: sun.misc.Launcher$AppClassLoader@42a57993
loader: sun.misc.Launcher$AppClassLoader@42a57993
Tests run: 2, Failures: 0, Errors: 0, Skipped: 0, Time elapsed: 0.009 sec - in org.apache.activemq.artemis.core.security.jaas.JAASSecurityManagerTest
Running org.apache.activemq.artemis.core.security.jaas.LDAPLoginModuleMaskPasswordTest
Tests run: 5, Failures: 0, Errors: 0, Skipped: 0, Time elapsed: 15.781 sec - in org.apache.activemq.artemis.core.security.jaas.LDAPLoginModuleMaskPasswordTest
Running org.apache.activemq.artemis.core.security.jaas.LDAPLoginModuleTest
Tests run: 8, Failures: 0, Errors: 0, Skipped: 0, Time elapsed: 11.984 sec - in org.apache.activemq.artemis.core.security.jaas.LDAPLoginModuleTest
Running org.apache.activemq.artemis.core.security.jaas.LDAPModuleRoleExpansionTest
Tests run: 2, Failures: 0, Errors: 0, Skipped: 0, Time elapsed: 19.057 sec - in org.apache.activemq.artemis.core.security.jaas.LDAPModuleRoleExpansionTest
Running org.apache.activemq.artemis.core.security.jaas.PropertiesLoginModuleRaceConditionTest
Tests run: 1, Failures: 0, Errors: 0, Skipped: 0, Time elapsed: 72.713 sec - in org.apache.activemq.artemis.core.security.jaas.PropertiesLoginModuleRaceConditionTest
Running org.apache.activemq.artemis.core.security.jaas.PropertiesLoginModuleTest
Tests run: 5, Failures: 0, Errors: 0, Skipped: 0, Time elapsed: 1.045 sec - in org.apache.activemq.artemis.core.security.jaas.PropertiesLoginModuleTest
Running org.apache.activemq.artemis.core.security.jaas.RolePrincipalTest
Tests run: 3, Failures: 0, Errors: 0, Skipped: 0, Time elapsed: 0.001 sec - in org.apache.activemq.artemis.core.security.jaas.RolePrincipalTest
Running org.apache.activemq.artemis.core.security.jaas.TextFileCertificateLoginModuleTest
Tests run: 3, Failures: 0, Errors: 0, Skipped: 0, Time elapsed: 0.79 sec - in org.apache.activemq.artemis.core.security.jaas.TextFileCertificateLoginModuleTest
Running org.apache.activemq.artemis.core.security.jaas.UserPrincipalTest
Tests run: 3, Failures: 0, Errors: 0, Skipped: 0, Time elapsed: 0.004 sec - in org.apache.activemq.artemis.core.security.jaas.UserPrincipalTest
Running org.apache.activemq.artemis.core.server.QueueConfigTest
Tests run: 4, Failures: 0, Errors: 0, Skipped: 0, Time elapsed: 0.002 sec - in org.apache.activemq.artemis.core.server.QueueConfigTest
Running org.apache.activemq.artemis.core.server.cluster.impl.BroadcastGroupImplTest
Tests run: 1, Failures: 0, Errors: 0, Skipped: 0, Time elapsed: 0.009 sec - in org.apache.activemq.artemis.core.server.cluster.impl.BroadcastGroupImplTest
Running org.apache.activemq.artemis.core.server.files.FileMoveManagerTest
Tests run: 9, Failures: 0, Errors: 0, Skipped: 0, Time elapsed: 10.319 sec - in org.apache.activemq.artemis.core.server.files.FileMoveManagerTest
Running org.apache.activemq.artemis.core.server.files.FileStoreMonitorTest
tick:: / (/dev/sda3) usage::0.1614251352328233
under:: / (/dev/sda3) usage::0.1614251352328233
tick:: / (/dev/sda3) usage::1.0
over:: / (/dev/sda3) usage::1.0
TickS::0.16142513419213933
TickS::0.16142513419213933
TickS::0.16142513419213933
TickS::0.16142513419213933
TickS::0.16142513419213933
Tests run: 2, Failures: 0, Errors: 0, Skipped: 0, Time elapsed: 0.224 sec - in org.apache.activemq.artemis.core.server.files.FileStoreMonitorTest
Running org.apache.activemq.artemis.core.server.group.impl.ClusteredResetMockTest
Tests run: 1, Failures: 0, Errors: 0, Skipped: 0, Time elapsed: 0.087 sec - in org.apache.activemq.artemis.core.server.group.impl.ClusteredResetMockTest
Running org.apache.activemq.artemis.core.server.impl.ActiveMQServerImplTest
Tests run: 1, Failures: 0, Errors: 0, Skipped: 0, Time elapsed: 0.389 sec - in org.apache.activemq.artemis.core.server.impl.ActiveMQServerImplTest
Running org.apache.activemq.artemis.core.server.impl.BucketMessageGroupsTest
Tests run: 7, Failures: 0, Errors: 0, Skipped: 0, Time elapsed: 0.025 sec - in org.apache.activemq.artemis.core.server.impl.BucketMessageGroupsTest
Running org.apache.activemq.artemis.core.server.impl.CompositeAddressTest
Tests run: 1, Failures: 0, Errors: 0, Skipped: 0, Time elapsed: 0 sec - in org.apache.activemq.artemis.core.server.impl.CompositeAddressTest
Running org.apache.activemq.artemis.core.server.impl.EmbeddedServerTest
Tests run: 2, Failures: 0, Errors: 0, Skipped: 0, Time elapsed: 0.06 sec - in org.apache.activemq.artemis.core.server.impl.EmbeddedServerTest
Running org.apache.activemq.artemis.core.server.impl.QueueConsumersImplTest
Tests run: 3, Failures: 0, Errors: 0, Skipped: 0, Time elapsed: 0.003 sec - in org.apache.activemq.artemis.core.server.impl.QueueConsumersImplTest
Running org.apache.activemq.artemis.core.server.impl.ScheduledDeliveryHandlerTest
Tests run: 6, Failures: 0, Errors: 0, Skipped: 0, Time elapsed: 1.688 sec - in org.apache.activemq.artemis.core.server.impl.ScheduledDeliveryHandlerTest
Running org.apache.activemq.artemis.core.server.impl.jdbc.JdbcLeaseLockTest
Tests run: 20, Failures: 0, Errors: 0, Skipped: 0, Time elapsed: 202.218 sec - in org.apache.activemq.artemis.core.server.impl.jdbc.JdbcLeaseLockTest
Running org.apache.activemq.artemis.core.server.impl.jdbc.JdbcSharedStateManagerTest
Tests run: 4, Failures: 0, Errors: 1, Skipped: 0, Time elapsed: 41.856 sec <<< FAILURE!
- in org.apache.activemq.artemis.core.server.impl.jdbc.JdbcSharedStateManagerTest
shouldStartIfTableNotExist(org.apache.activemq.artemis.core.server.impl.jdbc.JdbcSharedStateManagerTest)
 Time elapsed: 11.125 sec  <<< ERROR!
java.lang.Exception: test timed out after 10000 milliseconds
	at org.apache.derby.impl.store.raw.log.LogCounter.hashCode(Unknown Source)
	at java.util.Hashtable.put(Hashtable.java:465)
	at org.apache.derby.impl.store.raw.data.BaseDataFileFactory.stubFileToRemoveAfterCheckPoint(Unknown
Source)
	at org.apache.derby.impl.store.raw.data.RAFContainer.run(Unknown Source)
	at java.security.AccessController.doPrivileged(Native Method)
	at org.apache.derby.impl.store.raw.data.RAFContainer.stubbify(Unknown Source)
	at org.apache.derby.impl.store.raw.data.RAFContainer.removeContainer(Unknown Source)
	at org.apache.derby.impl.store.raw.data.BaseContainerHandle.removeContainer(Unknown Source)
	at org.apache.derby.impl.store.raw.data.ContainerOperation.doMe(Unknown Source)
	at org.apache.derby.impl.store.raw.log.FileLogger.logAndDo(Unknown Source)
	at org.apache.derby.impl.store.raw.xact.Xact.logAndDo(Unknown Source)
	at org.apache.derby.impl.store.raw.data.ReclaimSpaceHelper.reclaimContainer(Unknown Source)
	at org.apache.derby.impl.store.raw.data.ReclaimSpaceHelper.reclaimSpace(Unknown Source)
	at org.apache.derby.impl.store.raw.data.BaseDataFileFactory.reclaimSpace(Unknown Source)
	at org.apache.derby.impl.store.raw.data.ReclaimSpace.performWork(Unknown Source)
	at org.apache.derby.impl.store.raw.xact.Xact.postTermination(Unknown Source)
	at org.apache.derby.impl.store.raw.xact.Xact.completeCommit(Unknown Source)
	at org.apache.derby.impl.store.raw.xact.Xact.commit(Unknown Source)
	at org.apache.derby.impl.store.raw.xact.Xact.commit(Unknown Source)
	at org.apache.derby.impl.store.access.RAMTransaction.commit(Unknown Source)
	at org.apache.derby.impl.sql.conn.GenericLanguageConnectionContext.doCommit(Unknown Source)
	at org.apache.derby.impl.sql.conn.GenericLanguageConnectionContext.userCommit(Unknown Source)
	at org.apache.derby.impl.jdbc.TransactionResourceImpl.commit(Unknown Source)
	at org.apache.derby.impl.jdbc.EmbedConnection.commit(Unknown Source)
	at org.apache.activemq.artemis.jdbc.store.drivers.AbstractJDBCDriver.destroy(AbstractJDBCDriver.java:193)
	at org.apache.activemq.artemis.core.server.impl.jdbc.JdbcSharedStateManagerTest.shouldStartIfTableNotExist(JdbcSharedStateManagerTest.java:64)

Running org.apache.activemq.artemis.core.server.journal.JournalStorageManagerConstantTest
Tests run: 1, Failures: 0, Errors: 0, Skipped: 0, Time elapsed: 0.001 sec - in org.apache.activemq.artemis.core.server.journal.JournalStorageManagerConstantTest
Running org.apache.activemq.artemis.core.server.management.JMXAccessControlListTest
Tests run: 14, Failures: 0, Errors: 0, Skipped: 0, Time elapsed: 0.005 sec - in org.apache.activemq.artemis.core.server.management.JMXAccessControlListTest
Running org.apache.activemq.artemis.core.settings.AddressSettingsTest
Tests run: 4, Failures: 0, Errors: 0, Skipped: 0, Time elapsed: 0.008 sec - in org.apache.activemq.artemis.core.settings.AddressSettingsTest
Running org.apache.activemq.artemis.core.settings.RepositoryTest
Tests run: 11, Failures: 0, Errors: 0, Skipped: 0, Time elapsed: 0.028 sec - in org.apache.activemq.artemis.core.settings.RepositoryTest
Running org.apache.activemq.artemis.core.transaction.impl.TransactionImplTest
rollback...
rollback...
Tests run: 2, Failures: 0, Errors: 0, Skipped: 0, Time elapsed: 0.011 sec - in org.apache.activemq.artemis.core.transaction.impl.TransactionImplTest
Running org.apache.activemq.artemis.core.version.impl.VersionImplTest
Tests run: 3, Failures: 0, Errors: 0, Skipped: 0, Time elapsed: 0.002 sec - in org.apache.activemq.artemis.core.version.impl.VersionImplTest
Running org.apache.activemq.artemis.spi.core.security.jaas.Krb5LoginModuleTest
Tests run: 2, Failures: 0, Errors: 0, Skipped: 0, Time elapsed: 0.002 sec - in org.apache.activemq.artemis.spi.core.security.jaas.Krb5LoginModuleTest
Running org.apache.activemq.artemis.tests.util.SimpleStringTest
Tests run: 20, Failures: 0, Errors: 0, Skipped: 0, Time elapsed: 0.509 sec - in org.apache.activemq.artemis.tests.util.SimpleStringTest
Running org.apache.activemq.artemis.uri.AcceptorParserTest
config:TransportConfiguration(name=test, factory=org-apache-activemq-artemis-core-remoting-impl-netty-NettyAcceptorFactory)
?tcpReceiveBufferSize=1048576&port=8080&host=localhost&protocols=openwire&tcpSendBufferSize=1048576&banana=x
config:TransportConfiguration(name=test, factory=org-apache-activemq-artemis-core-remoting-impl-netty-NettyAcceptorFactory)
?tcpReceiveBufferSize=1048576&port=5672&host=0-0-0-0&tcpSendBufferSize=1048576&virtualTopicConsumerWildcards=Consumer-*->;2
Consumer.*.>;2
Tests run: 3, Failures: 0, Errors: 0, Skipped: 0, Time elapsed: 0.007 sec - in org.apache.activemq.artemis.uri.AcceptorParserTest
Running org.apache.activemq.artemis.uri.ClusterConnectionConfigurationTest
Tests run: 5, Failures: 0, Errors: 0, Skipped: 0, Time elapsed: 0.007 sec - in org.apache.activemq.artemis.uri.ClusterConnectionConfigurationTest

Results :

Tests in error: 
  JdbcSharedStateManagerTest.shouldStartIfTableNotExist:64 ยป  test timed out aft...

Tests run: 323, Failures: 0, Errors: 1, Skipped: 0

[INFO] ------------------------------------------------------------------------
[INFO] Reactor Summary:
[INFO] 
[INFO] ActiveMQ Artemis Parent 2.11.0-SNAPSHOT ............ SUCCESS [  3.826 s]
[INFO] ActiveMQ Artemis Commons ........................... SUCCESS [ 28.243 s]
[INFO] ActiveMQ Artemis Core Client ....................... SUCCESS [ 23.642 s]
[INFO] ActiveMQ Artemis Selector Implementation ........... SUCCESS [  3.237 s]
[INFO] ActiveMQ Artemis JMS Client ........................ SUCCESS [  5.348 s]
[INFO] ActiveMQ Artemis Journal ........................... SUCCESS [  3.542 s]
[INFO] ActiveMQ Artemis JDBC Store ........................ SUCCESS [ 47.116 s]
[INFO] ActiveMQ Artemis Server ............................ FAILURE [07:14 min]
[INFO] ActiveMQ Artemis Protocols ......................... SKIPPED
[INFO] ActiveMQ Artemis AMQP Protocol ..................... SKIPPED
[INFO] ActiveMQ Artemis STOMP Protocol .................... SKIPPED
[INFO] ActiveMQ Artemis OpenWire Protocol ................. SKIPPED
[INFO] ActiveMQ Artemis HQClient Protocol ................. SKIPPED
[INFO] ActiveMQ Artemis HornetQ Protocol .................. SKIPPED
[INFO] ActiveMQ Artemis MQTT Protocol ..................... SKIPPED
[INFO] ActiveMQ Artemis DTO ............................... SKIPPED
[INFO] ActiveMQ Artemis Service Extensions ................ SKIPPED
[INFO] ActiveMQ Artemis JMS Server ........................ SKIPPED
[INFO] ActiveMQ Artemis CDI Integration ................... SKIPPED
[INFO] ActiveMQ Artemis Boot .............................. SKIPPED
[INFO] ActiveMQ Artemis Tools ............................. SKIPPED
[INFO] ActiveMQ Artemis JUnit Rules ....................... SKIPPED
[INFO] ActiveMQ Artemis CLI ............................... SKIPPED
[INFO] ActiveMQ Artemis Web ............................... SKIPPED
[INFO] ActiveMQ Artemis Web ............................... SKIPPED
[INFO] ActiveMQ Artemis Core Client All ................... SKIPPED
[INFO] ActiveMQ Artemis Client OSGi ....................... SKIPPED
[INFO] ActiveMQ Artemis JMS Client All .................... SKIPPED
[INFO] ActiveMQ Artemis JMS Client OSGi ................... SKIPPED
[INFO] ActiveMQ Artemis RAR POM ........................... SKIPPED
[INFO] ActiveMQ Artemis REST Interface Implementation ..... SKIPPED
[INFO] ActiveMQ Artemis Maven Plugin ...................... SKIPPED
[INFO] ActiveMQ Artemis Server OSGi ....................... SKIPPED
[INFO] ActiveMQ Artemis Cons .............................. SKIPPED
[INFO] ActiveMQ Artemis HawtIO Branding ................... SKIPPED
[INFO] ActiveMQ Artemis HawtIO Plugin ..................... SKIPPED
[INFO] ActiveMQ Artemis Console ........................... SKIPPED
[INFO] ActiveMQ Artemis Spring Integration ................ SKIPPED
[INFO] Apache ActiveMQ Artemis Distribution ............... SKIPPED
[INFO] ActiveMQ Artemis Tests POM ......................... SKIPPED
[INFO] ActiveMQ Artemis Test Support ...................... SKIPPED
[INFO] ActiveMQ Artemis Unit Tests ........................ SKIPPED
[INFO] ActiveMQ Artemis Joram Tests ....................... SKIPPED
[INFO] ActiveMQ Artemis timing Tests ...................... SKIPPED
[INFO] ActiveMQ Artemis JMS Tests ......................... SKIPPED
[INFO] ActiveMQ Artemis Features .......................... SKIPPED
[INFO] ActiveMQ Artemis Integration Tests ................. SKIPPED
[INFO] ActiveMQ Artemis Client Integration Tests .......... SKIPPED
[INFO] ActiveMQ Artemis Compatibility Tests ............... SKIPPED
[INFO] ActiveMQ Artemis soak Tests ........................ SKIPPED
[INFO] ActiveMQ Artemis stress Tests ...................... SKIPPED
[INFO] ActiveMQ Artemis performance Tests ................. SKIPPED
[INFO] Smoke Tests ........................................ SKIPPED
[INFO] ActiveMQ Artemis Extra Tests 2.11.0-SNAPSHOT ....... SKIPPED
[INFO] ------------------------------------------------------------------------
[INFO] BUILD FAILURE
[INFO] ------------------------------------------------------------------------
[INFO] Total time: 09:12 min
[INFO] Finished at: 2019-09-04T06:07:30Z
[INFO] ------------------------------------------------------------------------
[ERROR] Failed to execute goal org.apache.maven.plugins:maven-surefire-plugin:2.18.1:test
(default-test) on project artemis-server: There are test failures.
[ERROR] 
[ERROR] Please refer to <https://builds.apache.org/job/ActiveMQ-Artemis-Master/ws/artemis-server/target/surefire-reports>
for the individual test results.
[ERROR] -> [Help 1]
[ERROR] 
[ERROR] To see the full stack trace of the errors, re-run Maven with the -e switch.
[ERROR] Re-run Maven using the -X switch to enable full debug logging.
[ERROR] 
[ERROR] For more information about the errors and possible solutions, please read the following
articles:
[ERROR] [Help 1] http://cwiki.apache.org/confluence/display/MAVEN/MojoFailureException
[ERROR] 
[ERROR] After correcting the problems, you can resume the build with the command
[ERROR]   mvn <goals> -rf :artemis-server
Build step 'Invoke top-level Maven targets' marked build as failure
Performing Post build task...
Could not match :Too many files with unapproved license  : False
Logical operation result is FALSE
Skipping script  : cat ratReport.txt
END OF POST BUILD TASK 	: 0
Recording test results

Mime
View raw message