ambari-dev mailing list archives

Site index · List index
Message view « Date » · « Thread »
Top « Date » · « Thread »
From Scott Creeley <scree...@redhat.com>
Subject Build Error - Any Ideas
Date Thu, 26 Mar 2015 14:14:29 GMT
Hi Everyone,
Been a few months and I haven't build latest 2.0.0 trunk yet, did something change or anyone
else run into this?


[INFO] BUILD FAILURE
[INFO] ------------------------------------------------------------------------
[INFO] Total time: 1:06.240s
[INFO] Finished at: Thu Mar 26 08:59:33 GMT-05:00 2015
[INFO] Final Memory: 41M/1262M
[INFO] ------------------------------------------------------------------------
[ERROR] Failed to execute goal on project ambari-server: Could not resolve dependencies for
project org.apache.ambari:ambari-server:jar:2.0.0-1: Could not find artifact org.apache.ambari:ambari-metrics-common:jar:2.0.0-1
in oss.sonatype.org (https://oss.sonatype.org/content/groups/staging) -> [Help 1]
[ERROR] 


I can run previous builds fine...so I'm only affected on 2.0.0

thanks,
Scott

Mime
View raw message