aries-dev mailing list archives

Site index · List index
Message view « Date » · « Thread »
Top « Date » · « Thread »
From Apache Hudson Server <hud...@hudson.zones.apache.org>
Subject Build failed in Hudson: Aries #60
Date Mon, 21 Dec 2009 11:53:26 GMT
See <http://hudson.zones.apache.org/hudson/job/Aries/60/changes>

Changes:

[mnuttall] ARIES-89: Implement application support: initial refactor

------------------------------------------
[...truncated 938 lines...]
 <http://hudson.zones.apache.org/hudson/job/Aries/ws/aries/transaction/target/sources>
with Includes null and excludes:null
[INFO] Unpacking /home/hudson/.m2/repository/org/objectweb/howl/howl/1.0.1-1/howl-1.0.1-1-sources.jarto
 <http://hudson.zones.apache.org/hudson/job/Aries/ws/aries/transaction/target/sources>
with Includes null and excludes:null
[INFO] [antrun:run {execution: default}]
[INFO] Executing tasks
     [copy] Copying 4 files to <http://hudson.zones.apache.org/hudson/job/Aries/ws/aries/transaction/target/sources>
[INFO] Executed tasks
[INFO] [remote-resources:process {execution: default}]
[INFO] [resources:resources {execution: default-resources}]
[INFO] Using 'UTF-8' encoding to copy filtered resources.
[INFO] Copying 0 resource
[INFO] skip non existing resourceDirectory <http://hudson.zones.apache.org/hudson/job/Aries/ws/aries/transaction/src/main/filtered-resources>
[INFO] Copying 3 resources
[INFO] [compiler:compile {execution: default-compile}]
[INFO] Compiling 4 source files to <http://hudson.zones.apache.org/hudson/job/Aries/ws/aries/transaction/target/classes>
[INFO] [resources:testResources {execution: default-testResources}]
[INFO] Using 'UTF-8' encoding to copy filtered resources.
[INFO] skip non existing resourceDirectory <http://hudson.zones.apache.org/hudson/job/Aries/ws/aries/transaction/src/test/resources>
[INFO] skip non existing resourceDirectory <http://hudson.zones.apache.org/hudson/job/Aries/ws/aries/transaction/src/test/filtered-resources>
[INFO] Copying 3 resources
[INFO] [compiler:testCompile {execution: default-testCompile}]
[INFO] No sources to compile
[INFO] [surefire:test {execution: default-test}]
[INFO] Surefire report directory: <http://hudson.zones.apache.org/hudson/job/Aries/ws/aries/transaction/target/surefire-reports>

-------------------------------------------------------
 T E S T S
-------------------------------------------------------
There are no tests to run.

Results :

Tests run: 0, Failures: 0, Errors: 0, Skipped: 0

[HUDSON] Recording test results[INFO] [bundle:bundle {execution: default-bundle}]

[INFO] Preparing source:jar
[WARNING] Removing: jar from forked lifecycle, to prevent recursive invocation.
[HUDSON] Archiving <http://hudson.zones.apache.org/hudson/job/Aries/ws/aries/transaction/pom.xml>
to /export/home/hudson/hudson/jobs/Aries/modules/org.apache.aries.transaction$org.apache.aries.transaction/builds/2009-12-21_11-51-14/archive/org.apache.aries.transaction/org.apache.aries.transaction/1.0.0-incubating-SNAPSHOT/pom.xml
[HUDSON] Archiving <http://hudson.zones.apache.org/hudson/job/Aries/ws/aries/transaction/target/org.apache.aries.transaction-1.0.0-incubating-SNAPSHOT.jar>
to /export/home/hudson/hudson/jobs/Aries/modules/org.apache.aries.transaction$org.apache.aries.transaction/builds/2009-12-21_11-51-14/archive/org.apache.aries.transaction/org.apache.aries.transaction/1.0.0-incubating-SNAPSHOT/org.apache.aries.transaction-1.0.0-incubating-SNAPSHOT.jar
[INFO] [enforcer:enforce {execution: default}]
[INFO] [dependency:unpack {execution: unpack-sources}]
[INFO] Configured Artifact: org.apache.geronimo.components:geronimo-transaction:sources:?:jar
[INFO] Configured Artifact: org.objectweb.howl:howl:sources:?:jar
[INFO] geronimo-transaction-2.1.2-sources.jar already unpacked.
[INFO] howl-1.0.1-1-sources.jar already unpacked.
[INFO] [antrun:run {execution: default}]
[INFO] Executing tasks
[INFO] Executed tasks
[INFO] [source:jar {execution: attach-sources}]
[INFO] Building jar: <http://hudson.zones.apache.org/hudson/job/Aries/ws/aries/transaction/target/org.apache.aries.transaction-1.0.0-incubating-SNAPSHOT-sources.jar>
[INFO] [shade:shade {execution: default}]
[INFO] Including org.apache.geronimo.components:geronimo-transaction:jar:2.1.2 in the shaded
jar.
[INFO] Excluding org.slf4j:slf4j-api:jar:1.4.3 from the shaded jar.
[INFO] Excluding org.apache.geronimo.specs:geronimo-jta_1.1_spec:jar:1.1.1 from the shaded
jar.
[INFO] Excluding org.apache.geronimo.specs:geronimo-j2ee-connector_1.5_spec:jar:2.0.0 from
the shaded jar.
[INFO] Including org.objectweb.howl:howl:jar:1.0.1-1 in the shaded jar.
[INFO] Excluding org.springframework:spring-tx:jar:2.5.6 from the shaded jar.
[INFO] Excluding commons-logging:commons-logging:jar:1.1.1 from the shaded jar.
[INFO] Excluding org.springframework:spring-beans:jar:2.5.6 from the shaded jar.
[INFO] Excluding org.springframework:spring-core:jar:2.5.6 from the shaded jar.
[INFO] Excluding org.springframework:spring-context:jar:2.5.6 from the shaded jar.
[INFO] Excluding aopalliance:aopalliance:jar:1.0 from the shaded jar.
[INFO] Replacing original artifact with shaded artifact.
[INFO] Replacing <http://hudson.zones.apache.org/hudson/job/Aries/ws/aries/transaction/target/org.apache.aries.transaction-1.0.0-incubating-SNAPSHOT.jar>
with <http://hudson.zones.apache.org/hudson/job/Aries/ws/aries/transaction/target/org.apache.aries.transaction-1.0.0-incubating-SNAPSHOT-shaded.jar>
[INFO] Replacing <http://hudson.zones.apache.org/hudson/job/Aries/ws/aries/transaction/target/org.apache.aries.transaction-1.0.0-incubating-SNAPSHOT-sources.jar>
with <http://hudson.zones.apache.org/hudson/job/Aries/ws/aries/transaction/target/org.apache.aries.transaction-1.0.0-incubating-SNAPSHOT-shaded-sources.jar>
[INFO] [ianal:verify-legal-files {execution: default}]
[INFO] Checking legal files in: org.apache.aries.transaction-1.0.0-incubating-SNAPSHOT.jar
[INFO] Checking legal files in: org.apache.aries.transaction-1.0.0-incubating-SNAPSHOT-sources.jar
[INFO] Checking legal files in: org.apache.aries.transaction-1.0.0-incubating-SNAPSHOT-sources.jar
[INFO] [install:install {execution: default-install}]
[INFO] Installing <http://hudson.zones.apache.org/hudson/job/Aries/ws/aries/transaction/target/org.apache.aries.transaction-1.0.0-incubating-SNAPSHOT.jar>
to /home/hudson/.m2/repository/org/apache/aries/transaction/org.apache.aries.transaction/1.0.0-incubating-SNAPSHOT/org.apache.aries.transaction-1.0.0-incubating-SNAPSHOT.jar
[INFO] Installing <http://hudson.zones.apache.org/hudson/job/Aries/ws/aries/transaction/target/org.apache.aries.transaction-1.0.0-incubating-SNAPSHOT-sources.jar>
to /home/hudson/.m2/repository/org/apache/aries/transaction/org.apache.aries.transaction/1.0.0-incubating-SNAPSHOT/org.apache.aries.transaction-1.0.0-incubating-SNAPSHOT-sources.jar
[INFO] Installing <http://hudson.zones.apache.org/hudson/job/Aries/ws/aries/transaction/target/org.apache.aries.transaction-1.0.0-incubating-SNAPSHOT-sources.jar>
to /home/hudson/.m2/repository/org/apache/aries/transaction/org.apache.aries.transaction/1.0.0-incubating-SNAPSHOT/org.apache.aries.transaction-1.0.0-incubating-SNAPSHOT-sources.jar
[INFO] [bundle:install {execution: default-install}]
[INFO] Parsing file:/home/hudson/.m2/repository/repository.xml
[INFO] Installing org/apache/aries/transaction/org.apache.aries.transaction/1.0.0-incubating-SNAPSHOT/org.apache.aries.transaction-1.0.0-incubating-SNAPSHOT.jar
[INFO] Installing org/apache/aries/transaction/org.apache.aries.transaction/1.0.0-incubating-SNAPSHOT/org.apache.aries.transaction-1.0.0-incubating-SNAPSHOT-sources.jar
[INFO] Writing OBR metadata
[HUDSON] Archiving <http://hudson.zones.apache.org/hudson/job/Aries/ws/aries/transaction/dependency-reduced-pom.xml>
to /export/home/hudson/hudson/jobs/Aries/modules/org.apache.aries.transaction$org.apache.aries.transaction/builds/2009-12-21_11-51-14/archive/org.apache.aries.transaction/org.apache.aries.transaction/1.0.0-incubating-SNAPSHOT/dependency-reduced-pom.xml
[HUDSON] Re-archiving <http://hudson.zones.apache.org/hudson/job/Aries/ws/aries/transaction/target/org.apache.aries.transaction-1.0.0-incubating-SNAPSHOT.jar>
[HUDSON] Archiving <http://hudson.zones.apache.org/hudson/job/Aries/ws/aries/transaction/target/org.apache.aries.transaction-1.0.0-incubating-SNAPSHOT-sources.jar>
to /export/home/hudson/hudson/jobs/Aries/modules/org.apache.aries.transaction$org.apache.aries.transaction/builds/2009-12-21_11-51-14/archive/org.apache.aries.transaction/org.apache.aries.transaction/1.0.0-incubating-SNAPSHOT/org.apache.aries.transaction-1.0.0-incubating-SNAPSHOT-sources.jar
[INFO] ------------------------------------------------------------------------
[INFO] Building Apache Aries Application
[INFO]    task-segment: [clean, install]
[INFO] ------------------------------------------------------------------------
[INFO] [clean:clean {execution: default-clean}]
[INFO] Deleting file set: <http://hudson.zones.apache.org/hudson/job/Aries/ws/aries/application/target>
(included: [**], excluded: [])
[INFO] [enforcer:enforce {execution: default}]
[INFO] [remote-resources:process {execution: default}]
[INFO] [site:attach-descriptor {execution: default-attach-descriptor}]
[INFO] [ianal:verify-legal-files {execution: default}]
[INFO] [install:install {execution: default-install}]
[INFO] Installing <http://hudson.zones.apache.org/hudson/job/Aries/ws/aries/application/pom.xml>
to /home/hudson/.m2/repository/org/apache/aries/application/application/1.0.0-incubating-SNAPSHOT/application-1.0.0-incubating-SNAPSHOT.pom
[HUDSON] Archiving <http://hudson.zones.apache.org/hudson/job/Aries/ws/aries/application/pom.xml>
to /export/home/hudson/hudson/jobs/Aries/modules/org.apache.aries.application$application/builds/2009-12-21_11-51-14/archive/org.apache.aries.application/application/1.0.0-incubating-SNAPSHOT/pom.xml
[HUDSON] Archiving /home/hudson/.m2/repository/org/apache/aries/application/application/1.0.0-incubating-SNAPSHOT/application-1.0.0-incubating-SNAPSHOT.pom
to /export/home/hudson/hudson/jobs/Aries/modules/org.apache.aries.application$application/builds/2009-12-21_11-51-14/archive/org.apache.aries.application/application/1.0.0-incubating-SNAPSHOT/application-1.0.0-incubating-SNAPSHOT.pom
[INFO] ------------------------------------------------------------------------
[INFO] Building Apache Aries Application Utils
[INFO]    task-segment: [clean, install]
[INFO] ------------------------------------------------------------------------
[INFO] [clean:clean {execution: default-clean}]
[INFO] Deleting file set: <http://hudson.zones.apache.org/hudson/job/Aries/ws/aries/application/application-utils/target>
(included: [**], excluded: [])
[INFO] snapshot org.apache.aries.application:org.apache.aries.application.api:1.0.0-incubating-SNAPSHOT:
checking for updates from codehaus.snapshots
[INFO] snapshot org.apache.aries.application:org.apache.aries.application.api:1.0.0-incubating-SNAPSHOT:
checking for updates from apache.snapshots
Downloading: http://snapshots.repository.codehaus.org/org/apache/aries/application/org.apache.aries.application.api/1.0.0-incubating-SNAPSHOT/org.apache.aries.application.api-1.0.0-incubating-SNAPSHOT.pom
[INFO] Unable to find resource 'org.apache.aries.application:org.apache.aries.application.api:pom:1.0.0-incubating-SNAPSHOT'
in repository codehaus.snapshots (http://snapshots.repository.codehaus.org)
Downloading: http://repository.apache.org/snapshots/org/apache/aries/application/org.apache.aries.application.api/1.0.0-incubating-SNAPSHOT/org.apache.aries.application.api-1.0.0-incubating-SNAPSHOT.pom
[INFO] Unable to find resource 'org.apache.aries.application:org.apache.aries.application.api:pom:1.0.0-incubating-SNAPSHOT'
in repository apache.snapshots (http://repository.apache.org/snapshots)
Downloading: http://snapshots.repository.codehaus.org/org/apache/aries/application/org.apache.aries.application.api/1.0.0-incubating-SNAPSHOT/org.apache.aries.application.api-1.0.0-incubating-SNAPSHOT.jar
[INFO] Unable to find resource 'org.apache.aries.application:org.apache.aries.application.api:jar:1.0.0-incubating-SNAPSHOT'
in repository codehaus.snapshots (http://snapshots.repository.codehaus.org)
Downloading: http://repository.apache.org/snapshots/org/apache/aries/application/org.apache.aries.application.api/1.0.0-incubating-SNAPSHOT/org.apache.aries.application.api-1.0.0-incubating-SNAPSHOT.jar
[INFO] Unable to find resource 'org.apache.aries.application:org.apache.aries.application.api:jar:1.0.0-incubating-SNAPSHOT'
in repository apache.snapshots (http://repository.apache.org/snapshots)
[HUDSON] Archiving <http://hudson.zones.apache.org/hudson/job/Aries/ws/aries/application/application-utils/pom.xml>
to /export/home/hudson/hudson/jobs/Aries/modules/org.apache.aries.application$org.apache.aries.application.utils/builds/2009-12-21_11-51-14/archive/org.apache.aries.application/org.apache.aries.application.utils/1.0.0-incubating-SNAPSHOT/pom.xml
[INFO] ------------------------------------------------------------------------
[ERROR] BUILD ERROR
[INFO] ------------------------------------------------------------------------
[INFO] Failed to resolve artifact.

Missing:
----------
1) org.apache.aries.application:org.apache.aries.application.api:jar:1.0.0-incubating-SNAPSHOT

  Try downloading the file manually from the project website.

  Then, install it using the command: 
      mvn install:install-file -DgroupId=org.apache.aries.application -DartifactId=org.apache.aries.application.api
-Dversion=1.0.0-incubating-SNAPSHOT -Dpackaging=jar -Dfile=/path/to/file

  Alternatively, if you host your own repository you can deploy the file there: 
      mvn deploy:deploy-file -DgroupId=org.apache.aries.application -DartifactId=org.apache.aries.application.api
-Dversion=1.0.0-incubating-SNAPSHOT -Dpackaging=jar -Dfile=/path/to/file -Durl=[url] -DrepositoryId=[id]

  Path to dependency: 
  	1) org.apache.aries.application:org.apache.aries.application.utils:bundle:1.0.0-incubating-SNAPSHOT
  	2) org.apache.aries.application:org.apache.aries.application.api:jar:1.0.0-incubating-SNAPSHOT

----------
1 required artifact is missing.

for artifact: 
  org.apache.aries.application:org.apache.aries.application.utils:bundle:1.0.0-incubating-SNAPSHOT

from the specified remote repositories:
  codehaus.snapshots (http://snapshots.repository.codehaus.org),
  central (http://repo1.maven.org/maven2),
  Nexus (http://repository.apache.org/snapshots)



[INFO] ------------------------------------------------------------------------
[INFO] Trace
org.apache.maven.lifecycle.LifecycleExecutionException: Missing:
----------
1) org.apache.aries.application:org.apache.aries.application.api:jar:1.0.0-incubating-SNAPSHOT

  Try downloading the file manually from the project website.

  Then, install it using the command: 
      mvn install:install-file -DgroupId=org.apache.aries.application -DartifactId=org.apache.aries.application.api
-Dversion=1.0.0-incubating-SNAPSHOT -Dpackaging=jar -Dfile=/path/to/file

  Alternatively, if you host your own repository you can deploy the file there: 
      mvn deploy:deploy-file -DgroupId=org.apache.aries.application -DartifactId=org.apache.aries.application.api
-Dversion=1.0.0-incubating-SNAPSHOT -Dpackaging=jar -Dfile=/path/to/file -Durl=[url] -DrepositoryId=[id]

  Path to dependency: 
  	1) org.apache.aries.application:org.apache.aries.application.utils:bundle:1.0.0-incubating-SNAPSHOT
  	2) org.apache.aries.application:org.apache.aries.application.api:jar:1.0.0-incubating-SNAPSHOT

----------
1 required artifact is missing.

for artifact: 
  org.apache.aries.application:org.apache.aries.application.utils:bundle:1.0.0-incubating-SNAPSHOT

from the specified remote repositories:
  codehaus.snapshots (http://snapshots.repository.codehaus.org),
  central (http://repo1.maven.org/maven2),
  Nexus (http://repository.apache.org/snapshots)


	at org.apache.maven.lifecycle.DefaultLifecycleExecutor.executeGoals(DefaultLifecycleExecutor.java:711)
	at org.apache.maven.lifecycle.DefaultLifecycleExecutor.executeGoalWithLifecycle(DefaultLifecycleExecutor.java:556)
	at org.apache.maven.lifecycle.DefaultLifecycleExecutor.executeGoal(DefaultLifecycleExecutor.java:535)
	at org.apache.maven.lifecycle.DefaultLifecycleExecutor.executeGoalAndHandleFailures(DefaultLifecycleExecutor.java:387)
	at org.apache.maven.lifecycle.DefaultLifecycleExecutor.executeTaskSegments(DefaultLifecycleExecutor.java:348)
	at org.apache.maven.lifecycle.DefaultLifecycleExecutor.execute(DefaultLifecycleExecutor.java:180)
	at org.apache.maven.lifecycle.LifecycleExecutorInterceptor.execute(LifecycleExecutorInterceptor.java:65)
	at org.apache.maven.DefaultMaven.doExecute(DefaultMaven.java:328)
	at org.apache.maven.DefaultMaven.execute(DefaultMaven.java:138)
	at org.apache.maven.cli.MavenCli.main(MavenCli.java:362)
	at sun.reflect.NativeMethodAccessorImpl.invoke0(Native Method)
	at sun.reflect.NativeMethodAccessorImpl.invoke(NativeMethodAccessorImpl.java:39)
	at sun.reflect.DelegatingMethodAccessorImpl.invoke(DelegatingMethodAccessorImpl.java:25)
	at java.lang.reflect.Method.invoke(Method.java:597)
	at org.codehaus.classworlds.Launcher.launchEnhanced(Launcher.java:315)
	at org.codehaus.classworlds.Launcher.launch(Launcher.java:255)
	at hudson.maven.agent.Main.launch(Main.java:165)
	at hudson.maven.MavenBuilder.call(MavenBuilder.java:159)
	at hudson.maven.MavenModuleSetBuild$Builder.call(MavenModuleSetBuild.java:687)
	at hudson.maven.MavenModuleSetBuild$Builder.call(MavenModuleSetBuild.java:633)
	at hudson.remoting.UserRequest.perform(UserRequest.java:104)
	at hudson.remoting.UserRequest.perform(UserRequest.java:48)
	at hudson.remoting.Request$2.run(Request.java:236)
	at java.util.concurrent.Executors$RunnableAdapter.call(Executors.java:441)
	at java.util.concurrent.FutureTask$Sync.innerRun(FutureTask.java:303)
	at java.util.concurrent.FutureTask.run(FutureTask.java:138)
	at java.util.concurrent.ThreadPoolExecutor$Worker.runTask(ThreadPoolExecutor.java:886)
	at java.util.concurrent.ThreadPoolExecutor$Worker.run(ThreadPoolExecutor.java:908)
	at java.lang.Thread.run(Thread.java:619)
Caused by: org.apache.maven.artifact.resolver.MultipleArtifactsNotFoundException: Missing:
----------
1) org.apache.aries.application:org.apache.aries.application.api:jar:1.0.0-incubating-SNAPSHOT

  Try downloading the file manually from the project website.

  Then, install it using the command: 
      mvn install:install-file -DgroupId=org.apache.aries.application -DartifactId=org.apache.aries.application.api
-Dversion=1.0.0-incubating-SNAPSHOT -Dpackaging=jar -Dfile=/path/to/file

  Alternatively, if you host your own repository you can deploy the file there: 
      mvn deploy:deploy-file -DgroupId=org.apache.aries.application -DartifactId=org.apache.aries.application.api
-Dversion=1.0.0-incubating-SNAPSHOT -Dpackaging=jar -Dfile=/path/to/file -Durl=[url] -DrepositoryId=[id]

  Path to dependency: 
  	1) org.apache.aries.application:org.apache.aries.application.utils:bundle:1.0.0-incubating-SNAPSHOT
  	2) org.apache.aries.application:org.apache.aries.application.api:jar:1.0.0-incubating-SNAPSHOT

----------
1 required artifact is missing.

for artifact: 
  org.apache.aries.application:org.apache.aries.application.utils:bundle:1.0.0-incubating-SNAPSHOT

from the specified remote repositories:
  codehaus.snapshots (http://snapshots.repository.codehaus.org),
  central (http://repo1.maven.org/maven2),
  Nexus (http://repository.apache.org/snapshots)


	at org.apache.maven.artifact.resolver.DefaultArtifactResolver.resolveTransitively(DefaultArtifactResolver.java:360)
	at org.apache.maven.artifact.resolver.DefaultArtifactResolver.resolveTransitively(DefaultArtifactResolver.java:304)
	at org.apache.maven.plugin.DefaultPluginManager.resolveTransitiveDependencies(DefaultPluginManager.java:1499)
	at org.apache.maven.plugin.DefaultPluginManager.executeMojo(DefaultPluginManager.java:442)
	at hudson.maven.agent.PluginManagerInterceptor.executeMojo(PluginManagerInterceptor.java:182)
	at org.apache.maven.lifecycle.DefaultLifecycleExecutor.executeGoals(DefaultLifecycleExecutor.java:694)
	... 28 more
[INFO] ------------------------------------------------------------------------
[INFO] Total time: 2 minutes 3 seconds
[INFO] Finished at: Mon Dec 21 11:57:27 UTC 2009
[INFO] Final Memory: 104M/228M
[INFO] ------------------------------------------------------------------------
channel stopped


Mime
View raw message