aries-dev mailing list archives

Site index · List index
Message view « Date » · « Thread »
Top « Date » · « Thread »
From Apache Hudson Server <hud...@hudson.zones.apache.org>
Subject Build failed in Hudson: Aries » Apache Aries Web integration tests #147
Date Sun, 17 Jan 2010 13:57:23 GMT
See <http://hudson.zones.apache.org/hudson/job/Aries/org.apache.aries.web$org.apache.aries.web.itests/147/>

------------------------------------------
[INFO] ------------------------------------------------------------------------
[INFO] Building Apache Aries Web integration tests
[INFO]    task-segment: [clean, install]
[INFO] ------------------------------------------------------------------------
[INFO] [clean:clean {execution: default-clean}]
Downloading: http://repository.ops4j.org/mvn-3rdparty/com/sun/jdmk/jmxtools/1.2.1/jmxtools-1.2.1.pom
[INFO] Unable to find resource 'com.sun.jdmk:jmxtools:pom:1.2.1' in repository ops4j.3rdparty
(http://repository.ops4j.org/mvn-3rdparty)
Downloading: https://maven-repository.dev.java.net/nonav/repository/com.sun.jdmk/poms/jmxtools-1.2.1.pom
357b downloaded  (jmxtools-1.2.1.pom)
[WARNING] *** CHECKSUM FAILED - Checksum failed on download: local = 'b662aa01d49d8a571aa79f67a1d4a92a7d9c6359';
remote = '<!DOCTYPE' - RETRYING
Downloading: https://maven-repository.dev.java.net/nonav/repository/com.sun.jdmk/poms/jmxtools-1.2.1.pom
357b downloaded  (jmxtools-1.2.1.pom)
[WARNING] *** CHECKSUM FAILED - Checksum failed on download: local = 'b662aa01d49d8a571aa79f67a1d4a92a7d9c6359';
remote = '<!DOCTYPE' - IGNORING
[WARNING] POM for 'com.sun.jdmk:jmxtools:pom:1.2.1:test' is invalid.

Its dependencies (if any) will NOT be available to the current build.
Downloading: http://repository.ops4j.org/mvn-3rdparty/com/sun/jmx/jmxri/1.2.1/jmxri-1.2.1.pom
[INFO] Unable to find resource 'com.sun.jmx:jmxri:pom:1.2.1' in repository ops4j.3rdparty
(http://repository.ops4j.org/mvn-3rdparty)
Downloading: https://maven-repository.dev.java.net/nonav/repository/com.sun.jmx/poms/jmxri-1.2.1.pom
353b downloaded  (jmxri-1.2.1.pom)
[WARNING] *** CHECKSUM FAILED - Checksum failed on download: local = 'de02d09af9d9fd6ebe64712281899f4765ff4bd7';
remote = '<!DOCTYPE' - RETRYING
Downloading: https://maven-repository.dev.java.net/nonav/repository/com.sun.jmx/poms/jmxri-1.2.1.pom
353b downloaded  (jmxri-1.2.1.pom)
[WARNING] *** CHECKSUM FAILED - Checksum failed on download: local = 'de02d09af9d9fd6ebe64712281899f4765ff4bd7';
remote = '<!DOCTYPE' - IGNORING
[WARNING] POM for 'com.sun.jmx:jmxri:pom:1.2.1:test' is invalid.

Its dependencies (if any) will NOT be available to the current build.
Downloading: http://repository.ops4j.org/mvn-3rdparty/com/sun/jdmk/jmxtools/1.2.1/jmxtools-1.2.1.jar
Downloading: http://repository.ops4j.org/mvn-3rdparty/com/sun/jmx/jmxri/1.2.1/jmxri-1.2.1.jar
[INFO] snapshot org.apache.aries.web:org.apache.aries.web.urlhandler:1.0.0-incubating-SNAPSHOT:
checking for updates from codehaus.snapshots
[INFO] snapshot org.apache.aries.web:org.apache.aries.web.urlhandler:1.0.0-incubating-SNAPSHOT:
checking for updates from apache.snapshots
[INFO] Unable to find resource 'com.sun.jdmk:jmxtools:jar:1.2.1' in repository ops4j.3rdparty
(http://repository.ops4j.org/mvn-3rdparty)
[INFO] Unable to find resource 'com.sun.jmx:jmxri:jar:1.2.1' in repository ops4j.3rdparty
(http://repository.ops4j.org/mvn-3rdparty)
Downloading: https://maven-repository.dev.java.net/nonav/repository/com.sun.jdmk/jars/jmxtools-1.2.1.jar
Downloading: https://maven-repository.dev.java.net/nonav/repository/com.sun.jmx/jars/jmxri-1.2.1.jar
357b downloaded  (jmxtools-1.2.1.jar)
[WARNING] *** CHECKSUM FAILED - Checksum failed on download: local = '9e1dae7682d2b60d5b17b7d47e20d99d70ba65cf';
remote = '<!DOCTYPE' - RETRYING
Downloading: https://maven-repository.dev.java.net/nonav/repository/com.sun.jdmk/jars/jmxtools-1.2.1.jar
357b downloaded  (jmxtools-1.2.1.jar)
[WARNING] *** CHECKSUM FAILED - Checksum failed on download: local = '9e1dae7682d2b60d5b17b7d47e20d99d70ba65cf';
remote = '<!DOCTYPE' - IGNORING
353b downloaded  (jmxri-1.2.1.jar)
[WARNING] *** CHECKSUM FAILED - Checksum failed on download: local = 'a55ce8e95c9bb027e78557acc9e2b973fe3c611e';
remote = '<!DOCTYPE' - RETRYING
Downloading: https://maven-repository.dev.java.net/nonav/repository/com.sun.jmx/jars/jmxri-1.2.1.jar
353b downloaded  (jmxri-1.2.1.jar)
[WARNING] *** CHECKSUM FAILED - Checksum failed on download: local = 'a55ce8e95c9bb027e78557acc9e2b973fe3c611e';
remote = '<!DOCTYPE' - IGNORING
[INFO] [enforcer:enforce {execution: default}]
[INFO] [remote-resources:process {execution: default}]
[INFO] [depends:generate-depends-file {execution: generate-depends-file}]
[INFO] Created: <http://hudson.zones.apache.org/hudson/job/Aries/org.apache.aries.web$org.apache.aries.web.itests/ws/target/classes/META-INF/maven/dependencies.properties>
[INFO] [resources:resources {execution: default-resources}]
[INFO] Using 'UTF-8' encoding to copy filtered resources.
[INFO] Copying 0 resource
[INFO] skip non existing resourceDirectory <http://hudson.zones.apache.org/hudson/job/Aries/org.apache.aries.web$org.apache.aries.web.itests/ws/src/main/filtered-resources>
[INFO] Copying 3 resources
[INFO] [compiler:compile {execution: default-compile}]
[INFO] Nothing to compile - all classes are up to date
[INFO] [resources:testResources {execution: default-testResources}]
[INFO] Using 'UTF-8' encoding to copy filtered resources.
[INFO] Copying 0 resource
[INFO] skip non existing resourceDirectory <http://hudson.zones.apache.org/hudson/job/Aries/org.apache.aries.web$org.apache.aries.web.itests/ws/src/test/filtered-resources>
[INFO] Copying 3 resources
[INFO] [compiler:testCompile {execution: default-testCompile}]
[INFO] Compiling 2 source files to <http://hudson.zones.apache.org/hudson/job/Aries/org.apache.aries.web$org.apache.aries.web.itests/ws/target/test-classes>
[HUDSON] Archiving <http://hudson.zones.apache.org/hudson/job/Aries/org.apache.aries.web$org.apache.aries.web.itests/ws/pom.xml>
to /export/home/hudson/hudson/jobs/Aries/modules/org.apache.aries.web$org.apache.aries.web.itests/builds/2010-01-17_13-53-50/archive/org.apache.aries.web/org.apache.aries.web.itests/1.0.0-incubating-SNAPSHOT/pom.xml
[INFO] ------------------------------------------------------------------------
[ERROR] BUILD FAILURE
[INFO] ------------------------------------------------------------------------
[INFO] Compilation failure

error: error reading /home/hudson/.m2/repository/com/sun/jdmk/jmxtools/1.2.1/jmxtools-1.2.1.jar;
error in opening zip file
error: error reading /home/hudson/.m2/repository/com/sun/jmx/jmxri/1.2.1/jmxri-1.2.1.jar;
error in opening zip file

[INFO] ------------------------------------------------------------------------
[INFO] Trace
org.apache.maven.BuildFailureException: Compilation failure
	at org.apache.maven.lifecycle.DefaultLifecycleExecutor.executeGoals(DefaultLifecycleExecutor.java:715)
	at org.apache.maven.lifecycle.DefaultLifecycleExecutor.executeGoalWithLifecycle(DefaultLifecycleExecutor.java:556)
	at org.apache.maven.lifecycle.DefaultLifecycleExecutor.executeGoal(DefaultLifecycleExecutor.java:535)
	at org.apache.maven.lifecycle.DefaultLifecycleExecutor.executeGoalAndHandleFailures(DefaultLifecycleExecutor.java:387)
	at org.apache.maven.lifecycle.DefaultLifecycleExecutor.executeTaskSegments(DefaultLifecycleExecutor.java:348)
	at org.apache.maven.lifecycle.DefaultLifecycleExecutor.execute(DefaultLifecycleExecutor.java:180)
	at org.apache.maven.lifecycle.LifecycleExecutorInterceptor.execute(LifecycleExecutorInterceptor.java:65)
	at org.apache.maven.DefaultMaven.doExecute(DefaultMaven.java:328)
	at org.apache.maven.DefaultMaven.execute(DefaultMaven.java:138)
	at org.apache.maven.cli.MavenCli.main(MavenCli.java:362)
	at sun.reflect.NativeMethodAccessorImpl.invoke0(Native Method)
	at sun.reflect.NativeMethodAccessorImpl.invoke(NativeMethodAccessorImpl.java:39)
	at sun.reflect.DelegatingMethodAccessorImpl.invoke(DelegatingMethodAccessorImpl.java:25)
	at java.lang.reflect.Method.invoke(Method.java:597)
	at org.codehaus.classworlds.Launcher.launchEnhanced(Launcher.java:315)
	at org.codehaus.classworlds.Launcher.launch(Launcher.java:255)
	at hudson.maven.agent.Main.launch(Main.java:165)
	at hudson.maven.MavenBuilder.call(MavenBuilder.java:159)
	at hudson.maven.MavenModuleSetBuild$Builder.call(MavenModuleSetBuild.java:688)
	at hudson.maven.MavenModuleSetBuild$Builder.call(MavenModuleSetBuild.java:632)
	at hudson.remoting.UserRequest.perform(UserRequest.java:104)
	at hudson.remoting.UserRequest.perform(UserRequest.java:48)
	at hudson.remoting.Request$2.run(Request.java:236)
	at java.util.concurrent.Executors$RunnableAdapter.call(Executors.java:441)
	at java.util.concurrent.FutureTask$Sync.innerRun(FutureTask.java:303)
	at java.util.concurrent.FutureTask.run(FutureTask.java:138)
	at java.util.concurrent.ThreadPoolExecutor$Worker.runTask(ThreadPoolExecutor.java:886)
	at java.util.concurrent.ThreadPoolExecutor$Worker.run(ThreadPoolExecutor.java:908)
	at java.lang.Thread.run(Thread.java:619)
Caused by: org.apache.maven.plugin.CompilationFailureException: Compilation failure
	at org.apache.maven.plugin.AbstractCompilerMojo.execute(AbstractCompilerMojo.java:516)
	at org.apache.maven.plugin.TestCompilerMojo.execute(TestCompilerMojo.java:102)
	at org.apache.maven.plugin.DefaultPluginManager.executeMojo(DefaultPluginManager.java:490)
	at hudson.maven.agent.PluginManagerInterceptor.executeMojo(PluginManagerInterceptor.java:182)
	at org.apache.maven.lifecycle.DefaultLifecycleExecutor.executeGoals(DefaultLifecycleExecutor.java:694)
	... 28 more
[INFO] ------------------------------------------------------------------------
[INFO] Total time: 2 minutes 47 seconds
[INFO] Finished at: Sun Jan 17 14:04:10 UTC 2010
[INFO] Final Memory: 112M/220M
[INFO] ------------------------------------------------------------------------
Waiting for Hudson to finish collecting data


Mime
View raw message