aries-dev mailing list archives

Site index · List index
Message view « Date » · « Thread »
Top « Date » · « Thread »
From Apache Hudson Server <hud...@hudson.zones.apache.org>
Subject Build failed in Hudson: Aries #102
Date Wed, 06 Jan 2010 15:59:06 GMT
See <http://hudson.zones.apache.org/hudson/job/Aries/102/changes>

Changes:

[mnuttall] ARIES-89: Implement application support: AriesApplicationManager.createApplication
now functional enough for some initial unit tests.

[mnuttall] ARIES-89: Implement application support: AriesApplicationManager.createApplication
now functional enough for some initial unit tests.

------------------------------------------
[...truncated 1029 lines...]

-------------------------------------------------------
 T E S T S
-------------------------------------------------------
There are no tests to run.

Results :

Tests run: 0, Failures: 0, Errors: 0, Skipped: 0

[HUDSON] Recording test results[INFO] [bundle:bundle {execution: default-bundle}]

[INFO] [ianal:verify-legal-files {execution: default}]
[INFO] Checking legal files in: org.apache.aries.application.api-1.0.0-incubating-SNAPSHOT.jar
[INFO] [install:install {execution: default-install}]
[INFO] Installing <http://hudson.zones.apache.org/hudson/job/Aries/ws/aries/application/application-api/target/org.apache.aries.application.api-1.0.0-incubating-SNAPSHOT.jar>
to /home/hudson/.m2/repository/org/apache/aries/application/org.apache.aries.application.api/1.0.0-incubating-SNAPSHOT/org.apache.aries.application.api-1.0.0-incubating-SNAPSHOT.jar
[INFO] [bundle:install {execution: default-install}]
[INFO] Parsing file:/home/hudson/.m2/repository/repository.xml
[INFO] Installing org/apache/aries/application/org.apache.aries.application.api/1.0.0-incubating-SNAPSHOT/org.apache.aries.application.api-1.0.0-incubating-SNAPSHOT.jar
[INFO] Writing OBR metadata
[HUDSON] Archiving <http://hudson.zones.apache.org/hudson/job/Aries/ws/aries/application/application-api/pom.xml>
to /export/home/hudson/hudson/jobs/Aries/modules/org.apache.aries.application$org.apache.aries.application.api/builds/2010-01-06_15-56-16/archive/org.apache.aries.application/org.apache.aries.application.api/1.0.0-incubating-SNAPSHOT/pom.xml
[HUDSON] Archiving <http://hudson.zones.apache.org/hudson/job/Aries/ws/aries/application/application-api/target/org.apache.aries.application.api-1.0.0-incubating-SNAPSHOT.jar>
to /export/home/hudson/hudson/jobs/Aries/modules/org.apache.aries.application$org.apache.aries.application.api/builds/2010-01-06_15-56-16/archive/org.apache.aries.application/org.apache.aries.application.api/1.0.0-incubating-SNAPSHOT/org.apache.aries.application.api-1.0.0-incubating-SNAPSHOT.jar
[INFO] ------------------------------------------------------------------------
[INFO] Building Apache Aries Application Utils
[INFO]    task-segment: [clean, install]
[INFO] ------------------------------------------------------------------------
[INFO] [clean:clean {execution: default-clean}]
[INFO] Deleting file set: <http://hudson.zones.apache.org/hudson/job/Aries/ws/aries/application/application-utils/target>
(included: [**], excluded: [])
[INFO] snapshot org.apache.aries.application:org.apache.aries.application.api:1.0.0-incubating-SNAPSHOT:
checking for updates from codehaus.snapshots
[INFO] snapshot org.apache.aries.application:org.apache.aries.application.api:1.0.0-incubating-SNAPSHOT:
checking for updates from apache.snapshots
[INFO] [enforcer:enforce {execution: default}]
[INFO] [remote-resources:process {execution: default}]
[INFO] [resources:resources {execution: default-resources}]
[INFO] Using 'UTF-8' encoding to copy filtered resources.
[INFO] Copying 1 resource to OSGI-INF/blueprint
[INFO] Copying 1 resource
[INFO] Copying 3 resources
[INFO] [compiler:compile {execution: default-compile}]
[INFO] Compiling 21 source files to <http://hudson.zones.apache.org/hudson/job/Aries/ws/aries/application/application-utils/target/classes>
[WARNING] <http://hudson.zones.apache.org/hudson/job/Aries/ws/aries/application/application-utils/src/main/java/org/apache/aries/application/utils/filesystem/impl/FileImpl.java>:[115,21]
[deprecation] toURL() in java.io.File has been deprecated

[WARNING] <http://hudson.zones.apache.org/hudson/job/Aries/ws/aries/application/application-utils/src/main/java/org/apache/aries/application/utils/filesystem/impl/ZipFileImpl.java>:[98,12]
[deprecation] toURL() in java.io.File has been deprecated

[INFO] [resources:testResources {execution: default-testResources}]
[INFO] Using 'UTF-8' encoding to copy filtered resources.
[INFO] Copying 9 resources
[INFO] skip non existing resourceDirectory <http://hudson.zones.apache.org/hudson/job/Aries/ws/aries/application/application-utils/src/test/filtered-resources>
[INFO] Copying 3 resources
[INFO] [compiler:testCompile {execution: default-testCompile}]
[INFO] Compiling 8 source files to <http://hudson.zones.apache.org/hudson/job/Aries/ws/aries/application/application-utils/target/test-classes>
[WARNING] <http://hudson.zones.apache.org/hudson/job/Aries/ws/aries/application/application-utils/src/test/java/org/apache/aries/application/utils/filesystem/IOUtilsTest.java>:[31,14]
[deprecation] java.io.StringBufferInputStream in java.io has been deprecated

[WARNING] <http://hudson.zones.apache.org/hudson/job/Aries/ws/aries/application/application-utils/src/test/java/org/apache/aries/application/utils/filesystem/IOUtilsTest.java>:[70,47]
[deprecation] java.io.StringBufferInputStream in java.io has been deprecated

[WARNING] <http://hudson.zones.apache.org/hudson/job/Aries/ws/aries/application/application-utils/src/test/java/org/apache/aries/application/utils/filesystem/IOUtilsTest.java>:[71,72]
[deprecation] java.io.StringBufferInputStream in java.io has been deprecated

[WARNING] <http://hudson.zones.apache.org/hudson/job/Aries/ws/aries/application/application-utils/src/test/java/org/apache/aries/application/utils/filesystem/IOUtilsTest.java>:[72,73]
[deprecation] java.io.StringBufferInputStream in java.io has been deprecated

[INFO] [surefire:test {execution: default-test}]
[INFO] Surefire report directory: <http://hudson.zones.apache.org/hudson/job/Aries/ws/aries/application/application-utils/target/surefire-reports>

-------------------------------------------------------
 T E S T S
-------------------------------------------------------
Running org.apache.aries.application.impl.VersionRangeTest
Tests run: 4, Failures: 0, Errors: 0, Skipped: 0, Time elapsed: 0.049 sec
Running org.apache.aries.application.utils.manifest.BundleManifestTest
Tests run: 2, Failures: 0, Errors: 0, Skipped: 0, Time elapsed: 0.026 sec
Running org.apache.aries.application.impl.ApplicationMetadataImplTest
Tests run: 1, Failures: 0, Errors: 0, Skipped: 0, Time elapsed: 0.023 sec
Running org.apache.aries.application.utils.filesystem.FileSystemTest
Tests run: 4, Failures: 0, Errors: 0, Skipped: 0, Time elapsed: 0.041 sec
Running org.apache.aries.application.utils.filesystem.IOUtilsTest
Tests run: 2, Failures: 0, Errors: 0, Skipped: 0, Time elapsed: 0.039 sec
Running org.apache.aries.application.utils.manifest.ManifestProcessorTest
Tests run: 4, Failures: 0, Errors: 0, Skipped: 0, Time elapsed: 0.01 sec
Running org.apache.aries.application.utils.manifest.ManifestHeaderProcessorTest
Tests run: 11, Failures: 0, Errors: 0, Skipped: 0, Time elapsed: 0.018 sec
Running org.apache.aries.application.impl.DeploymentContentImplTest
Tests run: 3, Failures: 0, Errors: 0, Skipped: 0, Time elapsed: 0.007 sec

Results :

Tests run: 31, Failures: 0, Errors: 0, Skipped: 0

[HUDSON] Recording test results
[INFO] [bundle:bundle {execution: default-bundle}]
[INFO] [ianal:verify-legal-files {execution: default}]
[INFO] Checking legal files in: org.apache.aries.application.utils-1.0.0-incubating-SNAPSHOT.jar
[INFO] [install:install {execution: default-install}]
[INFO] Installing <http://hudson.zones.apache.org/hudson/job/Aries/ws/aries/application/application-utils/target/org.apache.aries.application.utils-1.0.0-incubating-SNAPSHOT.jar>
to /home/hudson/.m2/repository/org/apache/aries/application/org.apache.aries.application.utils/1.0.0-incubating-SNAPSHOT/org.apache.aries.application.utils-1.0.0-incubating-SNAPSHOT.jar
[INFO] [bundle:install {execution: default-install}]
[INFO] Parsing file:/home/hudson/.m2/repository/repository.xml
[INFO] Installing org/apache/aries/application/org.apache.aries.application.utils/1.0.0-incubating-SNAPSHOT/org.apache.aries.application.utils-1.0.0-incubating-SNAPSHOT.jar
[INFO] Writing OBR metadata
[HUDSON] Archiving <http://hudson.zones.apache.org/hudson/job/Aries/ws/aries/application/application-utils/pom.xml>
to /export/home/hudson/hudson/jobs/Aries/modules/org.apache.aries.application$org.apache.aries.application.utils/builds/2010-01-06_15-56-16/archive/org.apache.aries.application/org.apache.aries.application.utils/1.0.0-incubating-SNAPSHOT/pom.xml
[HUDSON] Archiving <http://hudson.zones.apache.org/hudson/job/Aries/ws/aries/application/application-utils/target/org.apache.aries.application.utils-1.0.0-incubating-SNAPSHOT.jar>
to /export/home/hudson/hudson/jobs/Aries/modules/org.apache.aries.application$org.apache.aries.application.utils/builds/2010-01-06_15-56-16/archive/org.apache.aries.application/org.apache.aries.application.utils/1.0.0-incubating-SNAPSHOT/org.apache.aries.application.utils-1.0.0-incubating-SNAPSHOT.jar
[INFO] ------------------------------------------------------------------------
[INFO] Building Apache Aries application management
[INFO]    task-segment: [clean, install]
[INFO] ------------------------------------------------------------------------
[INFO] [clean:clean {execution: default-clean}]
[INFO] snapshot org.apache.aries.application:org.apache.aries.application.utils:1.0.0-incubating-SNAPSHOT:
checking for updates from codehaus.snapshots
[INFO] snapshot org.apache.aries.application:org.apache.aries.application.utils:1.0.0-incubating-SNAPSHOT:
checking for updates from apache.snapshots
[INFO] [enforcer:enforce {execution: default}]
[INFO] [remote-resources:process {execution: default}]
[INFO] [resources:resources {execution: default-resources}]
[INFO] Using 'UTF-8' encoding to copy filtered resources.
[INFO] Copying 1 resource
[INFO] skip non existing resourceDirectory <http://hudson.zones.apache.org/hudson/job/Aries/ws/aries/application/application-management/src/main/filtered-resources>
[INFO] Copying 3 resources
[INFO] [compiler:compile {execution: default-compile}]
[INFO] No sources to compile
[INFO] [resources:testResources {execution: default-testResources}]
[INFO] Using 'UTF-8' encoding to copy filtered resources.
[INFO] Copying 4 resources
[INFO] skip non existing resourceDirectory <http://hudson.zones.apache.org/hudson/job/Aries/ws/aries/application/application-management/src/test/filtered-resources>
[INFO] Copying 3 resources
[INFO] [compiler:testCompile {execution: default-testCompile}]
[INFO] Compiling 2 source files to <http://hudson.zones.apache.org/hudson/job/Aries/ws/aries/application/application-management/target/test-classes>
[HUDSON] Archiving <http://hudson.zones.apache.org/hudson/job/Aries/ws/aries/application/application-management/pom.xml>
to /export/home/hudson/hudson/jobs/Aries/modules/org.apache.aries.application.management$org.apache.aries.application.management/builds/2010-01-06_15-56-16/archive/org.apache.aries.application.management/org.apache.aries.application.management/1.0.0-incubating-SNAPSHOT/pom.xml
[INFO] ------------------------------------------------------------------------
[ERROR] BUILD FAILURE
[INFO] ------------------------------------------------------------------------
[INFO] Compilation failure

<http://hudson.zones.apache.org/hudson/job/Aries/ws/aries/application/application-management/src/test/java/org/apache/aries/application/management/impl/AriesApplicationManagerImplTest.java>:[22,23]
package org.junit does not exist

<http://hudson.zones.apache.org/hudson/job/Aries/ws/aries/application/application-management/src/test/java/org/apache/aries/application/management/impl/AriesApplicationManagerImplTest.java>:[22,0]
static import only from classes and interfaces

<http://hudson.zones.apache.org/hudson/job/Aries/ws/aries/application/application-management/src/test/java/org/apache/aries/application/management/impl/AriesApplicationManagerImplTest.java>:[23,23]
package org.junit does not exist

<http://hudson.zones.apache.org/hudson/job/Aries/ws/aries/application/application-management/src/test/java/org/apache/aries/application/management/impl/AriesApplicationManagerImplTest.java>:[23,0]
static import only from classes and interfaces

<http://hudson.zones.apache.org/hudson/job/Aries/ws/aries/application/application-management/src/test/java/org/apache/aries/application/management/impl/AriesApplicationManagerImplTest.java>:[51,16]
package org.junit does not exist

<http://hudson.zones.apache.org/hudson/job/Aries/ws/aries/application/application-management/src/test/java/org/apache/aries/application/management/impl/AriesApplicationManagerImplTest.java>:[52,16]
package org.junit does not exist

<http://hudson.zones.apache.org/hudson/job/Aries/ws/aries/application/application-management/src/test/java/org/apache/aries/application/management/impl/AriesApplicationManagerImplTest.java>:[72,3]
cannot find symbol
symbol  : class BeforeClass
location: class org.apache.aries.application.management.impl.AriesApplicationManagerImplTest

<http://hudson.zones.apache.org/hudson/job/Aries/ws/aries/application/application-management/src/test/java/org/apache/aries/application/management/impl/AriesApplicationManagerImplTest.java>:[80,3]
cannot find symbol
symbol  : class Test
location: class org.apache.aries.application.management.impl.AriesApplicationManagerImplTest

<http://hudson.zones.apache.org/hudson/job/Aries/ws/aries/application/application-management/src/test/java/org/apache/aries/application/management/impl/AriesApplicationManagerImplTest.java>:[82,4]
cannot find symbol
symbol  : class AriesApplicationManagerImpl
location: class org.apache.aries.application.management.impl.AriesApplicationManagerImplTest

<http://hudson.zones.apache.org/hudson/job/Aries/ws/aries/application/application-management/src/test/java/org/apache/aries/application/management/impl/AriesApplicationManagerImplTest.java>:[82,45]
cannot find symbol
symbol  : class AriesApplicationManagerImpl
location: class org.apache.aries.application.management.impl.AriesApplicationManagerImplTest

<http://hudson.zones.apache.org/hudson/job/Aries/ws/aries/application/application-management/src/test/java/org/apache/aries/application/management/impl/AriesApplicationManagerImplTest.java>:[101,48]
cannot find symbol
symbol  : class BundleInfoImpl
location: class org.apache.aries.application.management.impl.AriesApplicationManagerImplTest

<http://hudson.zones.apache.org/hudson/job/Aries/ws/aries/application/application-management/src/test/java/org/apache/aries/application/management/impl/AriesApplicationManagerImplTest.java>:[102,14]
cannot find symbol
symbol  : class BundleInfoImpl
location: class org.apache.aries.application.management.impl.AriesApplicationManagerImplTest

<http://hudson.zones.apache.org/hudson/job/Aries/ws/aries/application/application-management/src/test/java/org/apache/aries/application/management/impl/AriesApplicationManagerImplTest.java>:[112,4]
cannot find symbol
symbol  : method assertEquals(java.lang.String,java.lang.String)
location: class org.apache.aries.application.management.impl.AriesApplicationManagerImplTest

<http://hudson.zones.apache.org/hudson/job/Aries/ws/aries/application/application-management/src/test/java/org/apache/aries/application/management/impl/AriesApplicationManagerImplTest.java>:[113,4]
cannot find symbol
symbol  : method assertEquals(java.lang.String,java.lang.String)
location: class org.apache.aries.application.management.impl.AriesApplicationManagerImplTest

<http://hudson.zones.apache.org/hudson/job/Aries/ws/aries/application/application-management/src/test/java/org/apache/aries/application/management/impl/AriesApplicationManagerImplTest.java>:[114,4]
cannot find symbol
symbol  : method assertEquals(org.osgi.framework.Version,org.osgi.framework.Version)
location: class org.apache.aries.application.management.impl.AriesApplicationManagerImplTest

<http://hudson.zones.apache.org/hudson/job/Aries/ws/aries/application/application-management/src/test/java/org/apache/aries/application/management/impl/AriesApplicationManagerImplTest.java>:[116,4]
cannot find symbol
symbol  : method assertEquals(int,int)
location: class org.apache.aries.application.management.impl.AriesApplicationManagerImplTest

<http://hudson.zones.apache.org/hudson/job/Aries/ws/aries/application/application-management/src/test/java/org/apache/aries/application/management/impl/AriesApplicationManagerImplTest.java>:[119,4]
cannot find symbol
symbol  : method assertTrue(boolean)
location: class org.apache.aries.application.management.impl.AriesApplicationManagerImplTest

<http://hudson.zones.apache.org/hudson/job/Aries/ws/aries/application/application-management/src/test/java/org/apache/aries/application/management/impl/AriesApplicationManagerImplTest.java>:[120,4]
cannot find symbol
symbol  : method assertTrue(boolean)
location: class org.apache.aries.application.management.impl.AriesApplicationManagerImplTest

<http://hudson.zones.apache.org/hudson/job/Aries/ws/aries/application/application-management/src/test/java/org/apache/aries/application/management/impl/AriesApplicationManagerImplTest.java>:[125,4]
cannot find symbol
symbol  : method assertEquals(int,int)
location: class org.apache.aries.application.management.impl.AriesApplicationManagerImplTest

<http://hudson.zones.apache.org/hudson/job/Aries/ws/aries/application/application-management/src/test/java/org/apache/aries/application/management/impl/AriesApplicationManagerImplTest.java>:[129,4]
cannot find symbol
symbol  : method assertTrue(boolean)
location: class org.apache.aries.application.management.impl.AriesApplicationManagerImplTest

<http://hudson.zones.apache.org/hudson/job/Aries/ws/aries/application/application-management/src/test/java/org/apache/aries/application/management/impl/AriesApplicationManagerImplTest.java>:[130,4]
cannot find symbol
symbol  : method assertTrue(boolean)
location: class org.apache.aries.application.management.impl.AriesApplicationManagerImplTest

<http://hudson.zones.apache.org/hudson/job/Aries/ws/aries/application/application-management/src/test/java/org/apache/aries/application/management/impl/AriesApplicationManagerImplTest.java>:[131,4]
cannot find symbol
symbol  : method assertTrue(boolean)
location: class org.apache.aries.application.management.impl.AriesApplicationManagerImplTest


[INFO] ------------------------------------------------------------------------
[INFO] Trace
org.apache.maven.BuildFailureException: Compilation failure
	at org.apache.maven.lifecycle.DefaultLifecycleExecutor.executeGoals(DefaultLifecycleExecutor.java:715)
	at org.apache.maven.lifecycle.DefaultLifecycleExecutor.executeGoalWithLifecycle(DefaultLifecycleExecutor.java:556)
	at org.apache.maven.lifecycle.DefaultLifecycleExecutor.executeGoal(DefaultLifecycleExecutor.java:535)
	at org.apache.maven.lifecycle.DefaultLifecycleExecutor.executeGoalAndHandleFailures(DefaultLifecycleExecutor.java:387)
	at org.apache.maven.lifecycle.DefaultLifecycleExecutor.executeTaskSegments(DefaultLifecycleExecutor.java:348)
	at org.apache.maven.lifecycle.DefaultLifecycleExecutor.execute(DefaultLifecycleExecutor.java:180)
	at org.apache.maven.lifecycle.LifecycleExecutorInterceptor.execute(LifecycleExecutorInterceptor.java:65)
	at org.apache.maven.DefaultMaven.doExecute(DefaultMaven.java:328)
	at org.apache.maven.DefaultMaven.execute(DefaultMaven.java:138)
	at org.apache.maven.cli.MavenCli.main(MavenCli.java:362)
	at sun.reflect.NativeMethodAccessorImpl.invoke0(Native Method)
	at sun.reflect.NativeMethodAccessorImpl.invoke(NativeMethodAccessorImpl.java:39)
	at sun.reflect.DelegatingMethodAccessorImpl.invoke(DelegatingMethodAccessorImpl.java:25)
	at java.lang.reflect.Method.invoke(Method.java:597)
	at org.codehaus.classworlds.Launcher.launchEnhanced(Launcher.java:315)
	at org.codehaus.classworlds.Launcher.launch(Launcher.java:255)
	at hudson.maven.agent.Main.launch(Main.java:165)
	at hudson.maven.MavenBuilder.call(MavenBuilder.java:159)
	at hudson.maven.MavenModuleSetBuild$Builder.call(MavenModuleSetBuild.java:688)
	at hudson.maven.MavenModuleSetBuild$Builder.call(MavenModuleSetBuild.java:632)
	at hudson.remoting.UserRequest.perform(UserRequest.java:104)
	at hudson.remoting.UserRequest.perform(UserRequest.java:48)
	at hudson.remoting.Request$2.run(Request.java:236)
	at java.util.concurrent.Executors$RunnableAdapter.call(Executors.java:441)
	at java.util.concurrent.FutureTask$Sync.innerRun(FutureTask.java:303)
	at java.util.concurrent.FutureTask.run(FutureTask.java:138)
	at java.util.concurrent.ThreadPoolExecutor$Worker.runTask(ThreadPoolExecutor.java:886)
	at java.util.concurrent.ThreadPoolExecutor$Worker.run(ThreadPoolExecutor.java:908)
	at java.lang.Thread.run(Thread.java:619)
Caused by: org.apache.maven.plugin.CompilationFailureException: Compilation failure
	at org.apache.maven.plugin.AbstractCompilerMojo.execute(AbstractCompilerMojo.java:516)
	at org.apache.maven.plugin.TestCompilerMojo.execute(TestCompilerMojo.java:102)
	at org.apache.maven.plugin.DefaultPluginManager.executeMojo(DefaultPluginManager.java:490)
	at hudson.maven.agent.PluginManagerInterceptor.executeMojo(PluginManagerInterceptor.java:182)
	at org.apache.maven.lifecycle.DefaultLifecycleExecutor.executeGoals(DefaultLifecycleExecutor.java:694)
	... 28 more
[INFO] ------------------------------------------------------------------------
[INFO] Total time: 2 minutes 30 seconds
[INFO] Finished at: Wed Jan 06 16:00:14 UTC 2010
[INFO] Final Memory: 113M/211M
[INFO] ------------------------------------------------------------------------
Sending e-mails to: aries-dev@incubator.apache.org
channel stopped


Mime
View raw message