aries-dev mailing list archives

Site index · List index
Message view « Date » · « Thread »
Top « Date » · « Thread »
From Apache Hudson Server <hud...@hudson.zones.apache.org>
Subject Build failed in Hudson: Aries #109
Date Thu, 07 Jan 2010 19:54:47 GMT
See <http://hudson.zones.apache.org/hudson/job/Aries/109/changes>

Changes:

[mnuttall] ARIES-89: Implement application support: work on store()

------------------------------------------
[...truncated 939 lines...]
[INFO] [ianal:verify-legal-files {execution: default}]
[INFO] Checking legal files in: org.apache.aries.transaction-1.0.0-incubating-SNAPSHOT.jar
[INFO] Checking legal files in: org.apache.aries.transaction-1.0.0-incubating-SNAPSHOT-sources.jar
[INFO] Checking legal files in: org.apache.aries.transaction-1.0.0-incubating-SNAPSHOT-sources.jar
[INFO] [install:install {execution: default-install}]
[INFO] Installing <http://hudson.zones.apache.org/hudson/job/Aries/ws/aries/transaction/target/org.apache.aries.transaction-1.0.0-incubating-SNAPSHOT.jar>
to /home/hudson/.m2/repository/org/apache/aries/transaction/org.apache.aries.transaction/1.0.0-incubating-SNAPSHOT/org.apache.aries.transaction-1.0.0-incubating-SNAPSHOT.jar
[INFO] Installing <http://hudson.zones.apache.org/hudson/job/Aries/ws/aries/transaction/target/org.apache.aries.transaction-1.0.0-incubating-SNAPSHOT-sources.jar>
to /home/hudson/.m2/repository/org/apache/aries/transaction/org.apache.aries.transaction/1.0.0-incubating-SNAPSHOT/org.apache.aries.transaction-1.0.0-incubating-SNAPSHOT-sources.jar
[INFO] Installing <http://hudson.zones.apache.org/hudson/job/Aries/ws/aries/transaction/target/org.apache.aries.transaction-1.0.0-incubating-SNAPSHOT-sources.jar>
to /home/hudson/.m2/repository/org/apache/aries/transaction/org.apache.aries.transaction/1.0.0-incubating-SNAPSHOT/org.apache.aries.transaction-1.0.0-incubating-SNAPSHOT-sources.jar
[INFO] [bundle:install {execution: default-install}]
[INFO] Parsing file:/home/hudson/.m2/repository/repository.xml
[INFO] Installing org/apache/aries/transaction/org.apache.aries.transaction/1.0.0-incubating-SNAPSHOT/org.apache.aries.transaction-1.0.0-incubating-SNAPSHOT.jar
[INFO] Installing org/apache/aries/transaction/org.apache.aries.transaction/1.0.0-incubating-SNAPSHOT/org.apache.aries.transaction-1.0.0-incubating-SNAPSHOT-sources.jar
[INFO] Writing OBR metadata
[HUDSON] Archiving <http://hudson.zones.apache.org/hudson/job/Aries/ws/aries/transaction/dependency-reduced-pom.xml>
to /export/home/hudson/hudson/jobs/Aries/modules/org.apache.aries.transaction$org.apache.aries.transaction/builds/2010-01-07_19-51-54/archive/org.apache.aries.transaction/org.apache.aries.transaction/1.0.0-incubating-SNAPSHOT/dependency-reduced-pom.xml
[HUDSON] Re-archiving <http://hudson.zones.apache.org/hudson/job/Aries/ws/aries/transaction/target/org.apache.aries.transaction-1.0.0-incubating-SNAPSHOT.jar>
[HUDSON] Archiving <http://hudson.zones.apache.org/hudson/job/Aries/ws/aries/transaction/target/org.apache.aries.transaction-1.0.0-incubating-SNAPSHOT-sources.jar>
to /export/home/hudson/hudson/jobs/Aries/modules/org.apache.aries.transaction$org.apache.aries.transaction/builds/2010-01-07_19-51-54/archive/org.apache.aries.transaction/org.apache.aries.transaction/1.0.0-incubating-SNAPSHOT/org.apache.aries.transaction-1.0.0-incubating-SNAPSHOT-sources.jar
[INFO] ------------------------------------------------------------------------
[INFO] Building Apache Aries Application
[INFO]    task-segment: [clean, install]
[INFO] ------------------------------------------------------------------------
[INFO] [clean:clean {execution: default-clean}]
[INFO] Deleting file set: <http://hudson.zones.apache.org/hudson/job/Aries/ws/aries/application/target>
(included: [**], excluded: [])
[INFO] [enforcer:enforce {execution: default}]
[INFO] [remote-resources:process {execution: default}]
[INFO] [site:attach-descriptor {execution: default-attach-descriptor}]
[INFO] [ianal:verify-legal-files {execution: default}]
[INFO] [install:install {execution: default-install}]
[INFO] Installing <http://hudson.zones.apache.org/hudson/job/Aries/ws/aries/application/pom.xml>
to /home/hudson/.m2/repository/org/apache/aries/application/application/1.0.0-incubating-SNAPSHOT/application-1.0.0-incubating-SNAPSHOT.pom
[HUDSON] Archiving <http://hudson.zones.apache.org/hudson/job/Aries/ws/aries/application/pom.xml>
to /export/home/hudson/hudson/jobs/Aries/modules/org.apache.aries.application$application/builds/2010-01-07_19-51-54/archive/org.apache.aries.application/application/1.0.0-incubating-SNAPSHOT/pom.xml
[HUDSON] Archiving /home/hudson/.m2/repository/org/apache/aries/application/application/1.0.0-incubating-SNAPSHOT/application-1.0.0-incubating-SNAPSHOT.pom
to /export/home/hudson/hudson/jobs/Aries/modules/org.apache.aries.application$application/builds/2010-01-07_19-51-54/archive/org.apache.aries.application/application/1.0.0-incubating-SNAPSHOT/application-1.0.0-incubating-SNAPSHOT.pom
[INFO] ------------------------------------------------------------------------
[INFO] Building Apache Aries Application API
[INFO]    task-segment: [clean, install]
[INFO] ------------------------------------------------------------------------
[INFO] [clean:clean {execution: default-clean}]
[INFO] Deleting file set: <http://hudson.zones.apache.org/hudson/job/Aries/ws/aries/application/application-api/target>
(included: [**], excluded: [])
[INFO] [enforcer:enforce {execution: default}]
[INFO] [remote-resources:process {execution: default}]
[INFO] [resources:resources {execution: default-resources}]
[INFO] Using 'UTF-8' encoding to copy filtered resources.
[INFO] skip non existing resourceDirectory <http://hudson.zones.apache.org/hudson/job/Aries/ws/aries/application/application-api/src/main/resources>
[INFO] skip non existing resourceDirectory <http://hudson.zones.apache.org/hudson/job/Aries/ws/aries/application/application-api/src/main/filtered-resources>
[INFO] Copying 3 resources
[INFO] [compiler:compile {execution: default-compile}]
[INFO] Compiling 19 source files to <http://hudson.zones.apache.org/hudson/job/Aries/ws/aries/application/application-api/target/classes>
[INFO] [resources:testResources {execution: default-testResources}]
[INFO] Using 'UTF-8' encoding to copy filtered resources.
[INFO] skip non existing resourceDirectory <http://hudson.zones.apache.org/hudson/job/Aries/ws/aries/application/application-api/src/test/resources>
[INFO] skip non existing resourceDirectory <http://hudson.zones.apache.org/hudson/job/Aries/ws/aries/application/application-api/src/test/filtered-resources>
[INFO] Copying 3 resources
[INFO] [compiler:testCompile {execution: default-testCompile}]
[INFO] No sources to compile
[INFO] [surefire:test {execution: default-test}]
[INFO] Surefire report directory: <http://hudson.zones.apache.org/hudson/job/Aries/ws/aries/application/application-api/target/surefire-reports>

-------------------------------------------------------
 T E S T S
-------------------------------------------------------
There are no tests to run.

Results :

Tests run: 0, Failures: 0, Errors: 0, Skipped: 0

[HUDSON] Recording test results[INFO] [bundle:bundle {execution: default-bundle}]

[INFO] [ianal:verify-legal-files {execution: default}]
[INFO] Checking legal files in: org.apache.aries.application.api-1.0.0-incubating-SNAPSHOT.jar
[INFO] [install:install {execution: default-install}]
[INFO] Installing <http://hudson.zones.apache.org/hudson/job/Aries/ws/aries/application/application-api/target/org.apache.aries.application.api-1.0.0-incubating-SNAPSHOT.jar>
to /home/hudson/.m2/repository/org/apache/aries/application/org.apache.aries.application.api/1.0.0-incubating-SNAPSHOT/org.apache.aries.application.api-1.0.0-incubating-SNAPSHOT.jar
[INFO] [bundle:install {execution: default-install}]
[INFO] Parsing file:/home/hudson/.m2/repository/repository.xml
[INFO] Installing org/apache/aries/application/org.apache.aries.application.api/1.0.0-incubating-SNAPSHOT/org.apache.aries.application.api-1.0.0-incubating-SNAPSHOT.jar
[INFO] Writing OBR metadata
[HUDSON] Archiving <http://hudson.zones.apache.org/hudson/job/Aries/ws/aries/application/application-api/pom.xml>
to /export/home/hudson/hudson/jobs/Aries/modules/org.apache.aries.application$org.apache.aries.application.api/builds/2010-01-07_19-51-55/archive/org.apache.aries.application/org.apache.aries.application.api/1.0.0-incubating-SNAPSHOT/pom.xml
[HUDSON] Archiving <http://hudson.zones.apache.org/hudson/job/Aries/ws/aries/application/application-api/target/org.apache.aries.application.api-1.0.0-incubating-SNAPSHOT.jar>
to /export/home/hudson/hudson/jobs/Aries/modules/org.apache.aries.application$org.apache.aries.application.api/builds/2010-01-07_19-51-55/archive/org.apache.aries.application/org.apache.aries.application.api/1.0.0-incubating-SNAPSHOT/org.apache.aries.application.api-1.0.0-incubating-SNAPSHOT.jar
[INFO] ------------------------------------------------------------------------
[INFO] Building Apache Aries Application Utils
[INFO]    task-segment: [clean, install]
[INFO] ------------------------------------------------------------------------
[INFO] [clean:clean {execution: default-clean}]
[INFO] Deleting file set: <http://hudson.zones.apache.org/hudson/job/Aries/ws/aries/application/application-utils/target>
(included: [**], excluded: [])
[INFO] snapshot org.apache.aries.application:org.apache.aries.application.api:1.0.0-incubating-SNAPSHOT:
checking for updates from codehaus.snapshots
[INFO] snapshot org.apache.aries.application:org.apache.aries.application.api:1.0.0-incubating-SNAPSHOT:
checking for updates from apache.snapshots
[INFO] [enforcer:enforce {execution: default}]
[INFO] [remote-resources:process {execution: default}]
[INFO] [resources:resources {execution: default-resources}]
[INFO] Using 'UTF-8' encoding to copy filtered resources.
[INFO] Copying 1 resource to OSGI-INF/blueprint
[INFO] Copying 1 resource
[INFO] Copying 3 resources
[INFO] [compiler:compile {execution: default-compile}]
[INFO] Compiling 21 source files to <http://hudson.zones.apache.org/hudson/job/Aries/ws/aries/application/application-utils/target/classes>
[WARNING] <http://hudson.zones.apache.org/hudson/job/Aries/ws/aries/application/application-utils/src/main/java/org/apache/aries/application/utils/filesystem/impl/FileImpl.java>:[115,21]
[deprecation] toURL() in java.io.File has been deprecated

[WARNING] <http://hudson.zones.apache.org/hudson/job/Aries/ws/aries/application/application-utils/src/main/java/org/apache/aries/application/utils/filesystem/impl/ZipFileImpl.java>:[98,12]
[deprecation] toURL() in java.io.File has been deprecated

[INFO] [resources:testResources {execution: default-testResources}]
[INFO] Using 'UTF-8' encoding to copy filtered resources.
[INFO] Copying 9 resources
[INFO] skip non existing resourceDirectory <http://hudson.zones.apache.org/hudson/job/Aries/ws/aries/application/application-utils/src/test/filtered-resources>
[INFO] Copying 3 resources
[INFO] [compiler:testCompile {execution: default-testCompile}]
[INFO] Compiling 8 source files to <http://hudson.zones.apache.org/hudson/job/Aries/ws/aries/application/application-utils/target/test-classes>
[WARNING] <http://hudson.zones.apache.org/hudson/job/Aries/ws/aries/application/application-utils/src/test/java/org/apache/aries/application/utils/filesystem/IOUtilsTest.java>:[31,14]
[deprecation] java.io.StringBufferInputStream in java.io has been deprecated

[WARNING] <http://hudson.zones.apache.org/hudson/job/Aries/ws/aries/application/application-utils/src/test/java/org/apache/aries/application/utils/filesystem/IOUtilsTest.java>:[70,47]
[deprecation] java.io.StringBufferInputStream in java.io has been deprecated

[WARNING] <http://hudson.zones.apache.org/hudson/job/Aries/ws/aries/application/application-utils/src/test/java/org/apache/aries/application/utils/filesystem/IOUtilsTest.java>:[71,72]
[deprecation] java.io.StringBufferInputStream in java.io has been deprecated

[WARNING] <http://hudson.zones.apache.org/hudson/job/Aries/ws/aries/application/application-utils/src/test/java/org/apache/aries/application/utils/filesystem/IOUtilsTest.java>:[72,73]
[deprecation] java.io.StringBufferInputStream in java.io has been deprecated

[INFO] [surefire:test {execution: default-test}]
[INFO] Surefire report directory: <http://hudson.zones.apache.org/hudson/job/Aries/ws/aries/application/application-utils/target/surefire-reports>

-------------------------------------------------------
 T E S T S
-------------------------------------------------------
Running org.apache.aries.application.impl.VersionRangeTest
Tests run: 4, Failures: 0, Errors: 0, Skipped: 0, Time elapsed: 0.033 sec
Running org.apache.aries.application.utils.manifest.BundleManifestTest
Tests run: 2, Failures: 0, Errors: 0, Skipped: 0, Time elapsed: 0.026 sec
Running org.apache.aries.application.impl.ApplicationMetadataImplTest
Tests run: 1, Failures: 0, Errors: 0, Skipped: 0, Time elapsed: 0.01 sec
Running org.apache.aries.application.utils.filesystem.FileSystemTest
Tests run: 4, Failures: 0, Errors: 0, Skipped: 0, Time elapsed: 0.032 sec
Running org.apache.aries.application.utils.filesystem.IOUtilsTest
Tests run: 2, Failures: 0, Errors: 0, Skipped: 0, Time elapsed: 0.029 sec
Running org.apache.aries.application.utils.manifest.ManifestProcessorTest
Tests run: 4, Failures: 0, Errors: 0, Skipped: 0, Time elapsed: 0.01 sec
Running org.apache.aries.application.utils.manifest.ManifestHeaderProcessorTest
Tests run: 11, Failures: 0, Errors: 0, Skipped: 0, Time elapsed: 0.016 sec
Running org.apache.aries.application.impl.DeploymentContentImplTest
Tests run: 3, Failures: 0, Errors: 0, Skipped: 0, Time elapsed: 0.006 sec

Results :

Tests run: 31, Failures: 0, Errors: 0, Skipped: 0

[HUDSON] Recording test results
[INFO] [bundle:bundle {execution: default-bundle}]
[INFO] [ianal:verify-legal-files {execution: default}]
[INFO] Checking legal files in: org.apache.aries.application.utils-1.0.0-incubating-SNAPSHOT.jar
[INFO] [install:install {execution: default-install}]
[INFO] Installing <http://hudson.zones.apache.org/hudson/job/Aries/ws/aries/application/application-utils/target/org.apache.aries.application.utils-1.0.0-incubating-SNAPSHOT.jar>
to /home/hudson/.m2/repository/org/apache/aries/application/org.apache.aries.application.utils/1.0.0-incubating-SNAPSHOT/org.apache.aries.application.utils-1.0.0-incubating-SNAPSHOT.jar
[INFO] [bundle:install {execution: default-install}]
[INFO] Parsing file:/home/hudson/.m2/repository/repository.xml
[INFO] Installing org/apache/aries/application/org.apache.aries.application.utils/1.0.0-incubating-SNAPSHOT/org.apache.aries.application.utils-1.0.0-incubating-SNAPSHOT.jar
[INFO] Writing OBR metadata
[HUDSON] Archiving <http://hudson.zones.apache.org/hudson/job/Aries/ws/aries/application/application-utils/pom.xml>
to /export/home/hudson/hudson/jobs/Aries/modules/org.apache.aries.application$org.apache.aries.application.utils/builds/2010-01-07_19-51-55/archive/org.apache.aries.application/org.apache.aries.application.utils/1.0.0-incubating-SNAPSHOT/pom.xml
[HUDSON] Archiving <http://hudson.zones.apache.org/hudson/job/Aries/ws/aries/application/application-utils/target/org.apache.aries.application.utils-1.0.0-incubating-SNAPSHOT.jar>
to /export/home/hudson/hudson/jobs/Aries/modules/org.apache.aries.application$org.apache.aries.application.utils/builds/2010-01-07_19-51-55/archive/org.apache.aries.application/org.apache.aries.application.utils/1.0.0-incubating-SNAPSHOT/org.apache.aries.application.utils-1.0.0-incubating-SNAPSHOT.jar
[INFO] ------------------------------------------------------------------------
[INFO] Building Apache Aries application management
[INFO]    task-segment: [clean, install]
[INFO] ------------------------------------------------------------------------
[INFO] [clean:clean {execution: default-clean}]
[INFO] Deleting file set: <http://hudson.zones.apache.org/hudson/job/Aries/ws/aries/application/application-management/target>
(included: [**], excluded: [])
[INFO] snapshot org.apache.aries.application:org.apache.aries.application.utils:1.0.0-incubating-SNAPSHOT:
checking for updates from codehaus.snapshots
[INFO] snapshot org.apache.aries.application:org.apache.aries.application.utils:1.0.0-incubating-SNAPSHOT:
checking for updates from apache.snapshots
[INFO] [enforcer:enforce {execution: default}]
[INFO] [remote-resources:process {execution: default}]
[INFO] [resources:resources {execution: default-resources}]
[INFO] Using 'UTF-8' encoding to copy filtered resources.
[INFO] Copying 1 resource
[INFO] skip non existing resourceDirectory <http://hudson.zones.apache.org/hudson/job/Aries/ws/aries/application/application-management/src/main/filtered-resources>
[INFO] Copying 3 resources
[INFO] [compiler:compile {execution: default-compile}]
[INFO] Compiling 4 source files to <http://hudson.zones.apache.org/hudson/job/Aries/ws/aries/application/application-management/target/classes>
[HUDSON] Archiving <http://hudson.zones.apache.org/hudson/job/Aries/ws/aries/application/application-management/pom.xml>
to /export/home/hudson/hudson/jobs/Aries/modules/org.apache.aries.application$org.apache.aries.application.management/builds/2010-01-07_19-51-55/archive/org.apache.aries.application/org.apache.aries.application.management/1.0.0-incubating-SNAPSHOT/pom.xml
[INFO] ------------------------------------------------------------------------
[ERROR] BUILD FAILURE
[INFO] ------------------------------------------------------------------------
[INFO] Compilation failure

<http://hudson.zones.apache.org/hudson/job/Aries/ws/aries/application/application-management/src/main/java/org/apache/aries/application/management/impl/AriesApplicationImpl.java>:[38,46]
cannot find symbol
symbol  : class LocalPlatform
location: package org.apache.aries.application.management

<http://hudson.zones.apache.org/hudson/job/Aries/ws/aries/application/application-management/src/main/java/org/apache/aries/application/management/impl/AriesApplicationImpl.java>:[47,10]
cannot find symbol
symbol  : class LocalPlatform
location: class org.apache.aries.application.management.impl.AriesApplicationImpl

<http://hudson.zones.apache.org/hudson/job/Aries/ws/aries/application/application-management/src/main/java/org/apache/aries/application/management/impl/AriesApplicationImpl.java>:[54,6]
cannot find symbol
symbol  : class LocalPlatform
location: class org.apache.aries.application.management.impl.AriesApplicationImpl

<http://hudson.zones.apache.org/hudson/job/Aries/ws/aries/application/application-management/src/main/java/org/apache/aries/application/management/impl/AriesApplicationManagerImpl.java>:[46,46]
cannot find symbol
symbol  : class LocalPlatform
location: package org.apache.aries.application.management

<http://hudson.zones.apache.org/hudson/job/Aries/ws/aries/application/application-management/src/main/java/org/apache/aries/application/management/impl/AriesApplicationManagerImpl.java>:[61,10]
cannot find symbol
symbol  : class LocalPlatform
location: class org.apache.aries.application.management.impl.AriesApplicationManagerImpl

<http://hudson.zones.apache.org/hudson/job/Aries/ws/aries/application/application-management/src/main/java/org/apache/aries/application/management/impl/AriesApplicationManagerImpl.java>:[79,32]
cannot find symbol
symbol  : class LocalPlatform
location: class org.apache.aries.application.management.impl.AriesApplicationManagerImpl

<http://hudson.zones.apache.org/hudson/job/Aries/ws/aries/application/application-management/src/main/java/org/apache/aries/application/management/impl/AriesApplicationImpl.java>:[88,14]
store(java.io.OutputStream) in org.apache.aries.application.management.impl.AriesApplicationImpl
cannot implement store(java.io.OutputStream) in org.apache.aries.application.management.AriesApplication;
overridden method does not throw java.io.IOException

<http://hudson.zones.apache.org/hudson/job/Aries/ws/aries/application/application-management/src/main/java/org/apache/aries/application/management/impl/AriesApplicationImpl.java>:[82,14]
store(java.io.File) in org.apache.aries.application.management.impl.AriesApplicationImpl cannot
implement store(java.io.File) in org.apache.aries.application.management.AriesApplication;
overridden method does not throw java.io.IOException


[INFO] ------------------------------------------------------------------------
[INFO] Trace
org.apache.maven.BuildFailureException: Compilation failure
	at org.apache.maven.lifecycle.DefaultLifecycleExecutor.executeGoals(DefaultLifecycleExecutor.java:715)
	at org.apache.maven.lifecycle.DefaultLifecycleExecutor.executeGoalWithLifecycle(DefaultLifecycleExecutor.java:556)
	at org.apache.maven.lifecycle.DefaultLifecycleExecutor.executeGoal(DefaultLifecycleExecutor.java:535)
	at org.apache.maven.lifecycle.DefaultLifecycleExecutor.executeGoalAndHandleFailures(DefaultLifecycleExecutor.java:387)
	at org.apache.maven.lifecycle.DefaultLifecycleExecutor.executeTaskSegments(DefaultLifecycleExecutor.java:348)
	at org.apache.maven.lifecycle.DefaultLifecycleExecutor.execute(DefaultLifecycleExecutor.java:180)
	at org.apache.maven.lifecycle.LifecycleExecutorInterceptor.execute(LifecycleExecutorInterceptor.java:65)
	at org.apache.maven.DefaultMaven.doExecute(DefaultMaven.java:328)
	at org.apache.maven.DefaultMaven.execute(DefaultMaven.java:138)
	at org.apache.maven.cli.MavenCli.main(MavenCli.java:362)
	at sun.reflect.NativeMethodAccessorImpl.invoke0(Native Method)
	at sun.reflect.NativeMethodAccessorImpl.invoke(NativeMethodAccessorImpl.java:39)
	at sun.reflect.DelegatingMethodAccessorImpl.invoke(DelegatingMethodAccessorImpl.java:25)
	at java.lang.reflect.Method.invoke(Method.java:597)
	at org.codehaus.classworlds.Launcher.launchEnhanced(Launcher.java:315)
	at org.codehaus.classworlds.Launcher.launch(Launcher.java:255)
	at hudson.maven.agent.Main.launch(Main.java:165)
	at hudson.maven.MavenBuilder.call(MavenBuilder.java:159)
	at hudson.maven.MavenModuleSetBuild$Builder.call(MavenModuleSetBuild.java:688)
	at hudson.maven.MavenModuleSetBuild$Builder.call(MavenModuleSetBuild.java:632)
	at hudson.remoting.UserRequest.perform(UserRequest.java:104)
	at hudson.remoting.UserRequest.perform(UserRequest.java:48)
	at hudson.remoting.Request$2.run(Request.java:236)
	at java.util.concurrent.Executors$RunnableAdapter.call(Executors.java:441)
	at java.util.concurrent.FutureTask$Sync.innerRun(FutureTask.java:303)
	at java.util.concurrent.FutureTask.run(FutureTask.java:138)
	at java.util.concurrent.ThreadPoolExecutor$Worker.runTask(ThreadPoolExecutor.java:886)
	at java.util.concurrent.ThreadPoolExecutor$Worker.run(ThreadPoolExecutor.java:908)
	at java.lang.Thread.run(Thread.java:619)
Caused by: org.apache.maven.plugin.CompilationFailureException: Compilation failure
	at org.apache.maven.plugin.AbstractCompilerMojo.execute(AbstractCompilerMojo.java:516)
	at org.apache.maven.plugin.CompilerMojo.execute(CompilerMojo.java:114)
	at org.apache.maven.plugin.DefaultPluginManager.executeMojo(DefaultPluginManager.java:490)
	at hudson.maven.agent.PluginManagerInterceptor.executeMojo(PluginManagerInterceptor.java:182)
	at org.apache.maven.lifecycle.DefaultLifecycleExecutor.executeGoals(DefaultLifecycleExecutor.java:694)
	... 28 more
[INFO] ------------------------------------------------------------------------
[INFO] Total time: 2 minutes 33 seconds
[INFO] Finished at: Thu Jan 07 19:56:07 UTC 2010
[INFO] Final Memory: 113M/207M
[INFO] ------------------------------------------------------------------------
Sending e-mails to: aries-dev@incubator.apache.org
channel stopped


Mime
View raw message