aries-dev mailing list archives

Site index · List index
Message view « Date » · « Thread »
Top « Date » · « Thread »
From Apache Hudson Server <hud...@hudson.zones.apache.org>
Subject Build failed in Hudson: Aries » Apache Aries application management #104
Date Wed, 06 Jan 2010 18:28:30 GMT
See <http://hudson.zones.apache.org/hudson/job/Aries/org.apache.aries.application.management$org.apache.aries.application.management/104/changes>

Changes:

[mnuttall] ARIES-89: Implement application support: Add packages required by Hudson

------------------------------------------
[INFO] ------------------------------------------------------------------------
[INFO] Building Apache Aries application management
[INFO]    task-segment: [clean, install]
[INFO] ------------------------------------------------------------------------
[INFO] [clean:clean {execution: default-clean}]
[INFO] Deleting file set: <http://hudson.zones.apache.org/hudson/job/Aries/org.apache.aries.application.management$org.apache.aries.application.management/ws/target>
(included: [**], excluded: [])
[INFO] snapshot org.apache.aries.application:org.apache.aries.application.utils:1.0.0-incubating-SNAPSHOT:
checking for updates from codehaus.snapshots
[INFO] snapshot org.apache.aries.application:org.apache.aries.application.utils:1.0.0-incubating-SNAPSHOT:
checking for updates from apache.snapshots
[INFO] [enforcer:enforce {execution: default}]
[INFO] [remote-resources:process {execution: default}]
[INFO] [resources:resources {execution: default-resources}]
[INFO] Using 'UTF-8' encoding to copy filtered resources.
[INFO] Copying 1 resource
[INFO] skip non existing resourceDirectory <http://hudson.zones.apache.org/hudson/job/Aries/org.apache.aries.application.management$org.apache.aries.application.management/ws/src/main/filtered-resources>
[INFO] Copying 3 resources
[INFO] [compiler:compile {execution: default-compile}]
[INFO] No sources to compile
[INFO] [resources:testResources {execution: default-testResources}]
[INFO] Using 'UTF-8' encoding to copy filtered resources.
[INFO] Copying 4 resources
[INFO] skip non existing resourceDirectory <http://hudson.zones.apache.org/hudson/job/Aries/org.apache.aries.application.management$org.apache.aries.application.management/ws/src/test/filtered-resources>
[INFO] Copying 3 resources
[INFO] [compiler:testCompile {execution: default-testCompile}]
[INFO] Compiling 2 source files to <http://hudson.zones.apache.org/hudson/job/Aries/org.apache.aries.application.management$org.apache.aries.application.management/ws/target/test-classes>
[HUDSON] Archiving <http://hudson.zones.apache.org/hudson/job/Aries/org.apache.aries.application.management$org.apache.aries.application.management/ws/pom.xml>
to /export/home/hudson/hudson/jobs/Aries/modules/org.apache.aries.application.management$org.apache.aries.application.management/builds/2010-01-06_18-25-45/archive/org.apache.aries.application.management/org.apache.aries.application.management/1.0.0-incubating-SNAPSHOT/pom.xml
[INFO] ------------------------------------------------------------------------
[ERROR] BUILD FAILURE
[INFO] ------------------------------------------------------------------------
[INFO] Compilation failure

<http://hudson.zones.apache.org/hudson/job/Aries/org.apache.aries.application.management$org.apache.aries.application.management/ws/src/test/java/org/apache/aries/application/management/impl/AriesApplicationManagerImplTest.java>:[47,51]
cannot find symbol
symbol  : class AriesApplicationManagerImpl
location: package org.apache.aries.application.management.impl

<http://hudson.zones.apache.org/hudson/job/Aries/org.apache.aries.application.management$org.apache.aries.application.management/ws/src/test/java/org/apache/aries/application/management/impl/AriesApplicationManagerImplTest.java>:[48,51]
cannot find symbol
symbol  : class BundleInfoImpl
location: package org.apache.aries.application.management.impl

<http://hudson.zones.apache.org/hudson/job/Aries/org.apache.aries.application.management$org.apache.aries.application.management/ws/src/test/java/org/apache/aries/application/management/impl/AriesApplicationManagerImplTest.java>:[84,4]
cannot find symbol
symbol  : class AriesApplicationManagerImpl
location: class org.apache.aries.application.management.impl.AriesApplicationManagerImplTest

<http://hudson.zones.apache.org/hudson/job/Aries/org.apache.aries.application.management$org.apache.aries.application.management/ws/src/test/java/org/apache/aries/application/management/impl/AriesApplicationManagerImplTest.java>:[84,45]
cannot find symbol
symbol  : class AriesApplicationManagerImpl
location: class org.apache.aries.application.management.impl.AriesApplicationManagerImplTest

<http://hudson.zones.apache.org/hudson/job/Aries/org.apache.aries.application.management$org.apache.aries.application.management/ws/src/test/java/org/apache/aries/application/management/impl/AriesApplicationManagerImplTest.java>:[103,48]
cannot find symbol
symbol  : class BundleInfoImpl
location: class org.apache.aries.application.management.impl.AriesApplicationManagerImplTest

<http://hudson.zones.apache.org/hudson/job/Aries/org.apache.aries.application.management$org.apache.aries.application.management/ws/src/test/java/org/apache/aries/application/management/impl/AriesApplicationManagerImplTest.java>:[104,14]
cannot find symbol
symbol  : class BundleInfoImpl
location: class org.apache.aries.application.management.impl.AriesApplicationManagerImplTest


[INFO] ------------------------------------------------------------------------
[INFO] Trace
org.apache.maven.BuildFailureException: Compilation failure
	at org.apache.maven.lifecycle.DefaultLifecycleExecutor.executeGoals(DefaultLifecycleExecutor.java:715)
	at org.apache.maven.lifecycle.DefaultLifecycleExecutor.executeGoalWithLifecycle(DefaultLifecycleExecutor.java:556)
	at org.apache.maven.lifecycle.DefaultLifecycleExecutor.executeGoal(DefaultLifecycleExecutor.java:535)
	at org.apache.maven.lifecycle.DefaultLifecycleExecutor.executeGoalAndHandleFailures(DefaultLifecycleExecutor.java:387)
	at org.apache.maven.lifecycle.DefaultLifecycleExecutor.executeTaskSegments(DefaultLifecycleExecutor.java:348)
	at org.apache.maven.lifecycle.DefaultLifecycleExecutor.execute(DefaultLifecycleExecutor.java:180)
	at org.apache.maven.lifecycle.LifecycleExecutorInterceptor.execute(LifecycleExecutorInterceptor.java:65)
	at org.apache.maven.DefaultMaven.doExecute(DefaultMaven.java:328)
	at org.apache.maven.DefaultMaven.execute(DefaultMaven.java:138)
	at org.apache.maven.cli.MavenCli.main(MavenCli.java:362)
	at sun.reflect.NativeMethodAccessorImpl.invoke0(Native Method)
	at sun.reflect.NativeMethodAccessorImpl.invoke(NativeMethodAccessorImpl.java:39)
	at sun.reflect.DelegatingMethodAccessorImpl.invoke(DelegatingMethodAccessorImpl.java:25)
	at java.lang.reflect.Method.invoke(Method.java:597)
	at org.codehaus.classworlds.Launcher.launchEnhanced(Launcher.java:315)
	at org.codehaus.classworlds.Launcher.launch(Launcher.java:255)
	at hudson.maven.agent.Main.launch(Main.java:165)
	at hudson.maven.MavenBuilder.call(MavenBuilder.java:159)
	at hudson.maven.MavenModuleSetBuild$Builder.call(MavenModuleSetBuild.java:688)
	at hudson.maven.MavenModuleSetBuild$Builder.call(MavenModuleSetBuild.java:632)
	at hudson.remoting.UserRequest.perform(UserRequest.java:104)
	at hudson.remoting.UserRequest.perform(UserRequest.java:48)
	at hudson.remoting.Request$2.run(Request.java:236)
	at java.util.concurrent.Executors$RunnableAdapter.call(Executors.java:441)
	at java.util.concurrent.FutureTask$Sync.innerRun(FutureTask.java:303)
	at java.util.concurrent.FutureTask.run(FutureTask.java:138)
	at java.util.concurrent.ThreadPoolExecutor$Worker.runTask(ThreadPoolExecutor.java:886)
	at java.util.concurrent.ThreadPoolExecutor$Worker.run(ThreadPoolExecutor.java:908)
	at java.lang.Thread.run(Thread.java:619)
Caused by: org.apache.maven.plugin.CompilationFailureException: Compilation failure
	at org.apache.maven.plugin.AbstractCompilerMojo.execute(AbstractCompilerMojo.java:516)
	at org.apache.maven.plugin.TestCompilerMojo.execute(TestCompilerMojo.java:102)
	at org.apache.maven.plugin.DefaultPluginManager.executeMojo(DefaultPluginManager.java:490)
	at hudson.maven.agent.PluginManagerInterceptor.executeMojo(PluginManagerInterceptor.java:182)
	at org.apache.maven.lifecycle.DefaultLifecycleExecutor.executeGoals(DefaultLifecycleExecutor.java:694)
	... 28 more
[INFO] ------------------------------------------------------------------------
[INFO] Total time: 2 minutes 32 seconds
[INFO] Finished at: Wed Jan 06 18:29:45 UTC 2010
[INFO] Final Memory: 113M/221M
[INFO] ------------------------------------------------------------------------


Mime
View raw message