aries-dev mailing list archives

Site index · List index
Message view « Date » · « Thread »
Top « Date » · « Thread »
From Apache Jenkins Server <jenk...@builds.apache.org>
Subject Build failed in Jenkins: Aries #1052
Date Tue, 21 Jun 2011 11:58:18 GMT
See <https://builds.apache.org/job/Aries/1052/changes>

Changes:

[timothyjward] ARIES-657 : Commit patch from Brian DePradine - slight adjustment for blueprint
parser/core split

------------------------------------------
[...truncated 376 lines...]
	at org.apache.felix.bundlerepository.impl.DataModelHelperImpl.repository(DataModelHelperImpl.java:118)
	at org.apache.felix.obrplugin.ObrUpdate.parseRepositoryXml(ObrUpdate.java:291)
	... 32 more
[JENKINS] Archiving <https://builds.apache.org/job/Aries/ws/aries/testsupport/testsupport-unit/pom.xml>
to /home/hudson/hudson/jobs/Aries/modules/org.apache.aries.testsupport$org.apache.aries.testsupport.unit/builds/2011-06-21_11-56-49/archive/org.apache.aries.testsupport/org.apache.aries.testsupport.unit/0.3.1-SNAPSHOT/org.apache.aries.testsupport.unit-0.3.1-SNAPSHOT.pom
[JENKINS] Archiving <https://builds.apache.org/job/Aries/ws/aries/testsupport/testsupport-unit/target/org.apache.aries.testsupport.unit-0.3.1-SNAPSHOT.jar>
to /home/hudson/hudson/jobs/Aries/modules/org.apache.aries.testsupport$org.apache.aries.testsupport.unit/builds/2011-06-21_11-56-49/archive/org.apache.aries.testsupport/org.apache.aries.testsupport.unit/0.3.1-SNAPSHOT/org.apache.aries.testsupport.unit-0.3.1-SNAPSHOT.jar
[INFO] ------------------------------------------------------------------------
[INFO] Building Apache Aries Test Support
[INFO]    task-segment: [clean, install]
[INFO] ------------------------------------------------------------------------
[INFO] [clean:clean {execution: default-clean}]
[INFO] Deleting file set: <https://builds.apache.org/job/Aries/ws/aries/testsupport/target>
(included: [**], excluded: [])
[INFO] [enforcer:enforce {execution: default}]
[INFO] [remote-resources:process {execution: default}]
[INFO] [site:attach-descriptor {execution: default-attach-descriptor}]
[INFO] [ianal:verify-legal-files {execution: default}]
[INFO] [install:install {execution: default-install}]
[INFO] Installing <https://builds.apache.org/job/Aries/ws/aries/testsupport/pom.xml>
to /home/hudson/.m2/repository/org/apache/aries/testsupport/testsupport/0.4/testsupport-0.4.pom
[JENKINS] Archiving <https://builds.apache.org/job/Aries/ws/aries/testsupport/pom.xml>
to /home/hudson/hudson/jobs/Aries/modules/org.apache.aries.testsupport$testsupport/builds/2011-06-21_11-56-49/archive/org.apache.aries.testsupport/testsupport/0.4/testsupport-0.4.pom
[INFO] ------------------------------------------------------------------------
[INFO] Building Apache Aries Util
[INFO]    task-segment: [clean, install]
[INFO] ------------------------------------------------------------------------
[INFO] [clean:clean {execution: default-clean}]
[INFO] Deleting file set: <https://builds.apache.org/job/Aries/ws/aries/util/target>
(included: [**], excluded: [])
[INFO] [enforcer:enforce {execution: default}]
[INFO] [remote-resources:process {execution: default}]
[INFO] [resources:resources {execution: default-resources}]
[INFO] Using 'UTF-8' encoding to copy filtered resources.
[INFO] Copying 2 resources
[INFO] skip non existing resourceDirectory <https://builds.apache.org/job/Aries/ws/aries/util/src/main/filtered-resources>
[INFO] Copying 7 resources
[INFO] Copying 3 resources
[INFO] [compiler:compile {execution: default-compile}]
[INFO] Compiling 37 source files to <https://builds.apache.org/job/Aries/ws/aries/util/target/classes>
[WARNING] <https://builds.apache.org/job/Aries/ws/aries/util/src/main/java/org/apache/aries/util/tracker/InternalRecursiveBundleTracker.java>:[29,33]
[deprecation] org.osgi.service.framework.CompositeBundle in org.osgi.service.framework has
been deprecated

[WARNING] <https://builds.apache.org/job/Aries/ws/aries/util/src/main/java/org/apache/aries/util/tracker/InternalRecursiveBundleTracker.java>:[144,69]
[deprecation] org.osgi.service.framework.CompositeBundle in org.osgi.service.framework has
been deprecated

[WARNING] <https://builds.apache.org/job/Aries/ws/aries/util/src/main/java/org/apache/aries/util/tracker/InternalRecursiveBundleTracker.java>:[64,21]
[deprecation] org.osgi.service.framework.CompositeBundle in org.osgi.service.framework has
been deprecated

[WARNING] <https://builds.apache.org/job/Aries/ws/aries/util/src/main/java/org/apache/aries/util/tracker/InternalRecursiveBundleTracker.java>:[84,21]
[deprecation] org.osgi.service.framework.CompositeBundle in org.osgi.service.framework has
been deprecated

[WARNING] <https://builds.apache.org/job/Aries/ws/aries/util/src/main/java/org/apache/aries/util/tracker/InternalRecursiveBundleTracker.java>:[101,21]
[deprecation] org.osgi.service.framework.CompositeBundle in org.osgi.service.framework has
been deprecated

[WARNING] <https://builds.apache.org/job/Aries/ws/aries/util/src/main/java/org/apache/aries/util/tracker/InternalRecursiveBundleTracker.java>:[112,21]
[deprecation] org.osgi.service.framework.CompositeBundle in org.osgi.service.framework has
been deprecated

[WARNING] <https://builds.apache.org/job/Aries/ws/aries/util/src/main/java/org/apache/aries/util/tracker/InternalRecursiveBundleTracker.java>:[113,6]
[deprecation] org.osgi.service.framework.CompositeBundle in org.osgi.service.framework has
been deprecated

[WARNING] <https://builds.apache.org/job/Aries/ws/aries/util/src/main/java/org/apache/aries/util/tracker/InternalRecursiveBundleTracker.java>:[113,28]
[deprecation] org.osgi.service.framework.CompositeBundle in org.osgi.service.framework has
been deprecated

[INFO] [resources:testResources {execution: default-testResources}]
[INFO] Using 'UTF-8' encoding to copy filtered resources.
[INFO] Copying 20 resources
[INFO] skip non existing resourceDirectory <https://builds.apache.org/job/Aries/ws/aries/util/src/test/filtered-resources>
[INFO] Copying 3 resources
[INFO] [compiler:testCompile {execution: default-testCompile}]
[INFO] Compiling 9 source files to <https://builds.apache.org/job/Aries/ws/aries/util/target/test-classes>
[WARNING] <https://builds.apache.org/job/Aries/ws/aries/util/src/test/java/org/apache/aries/util/filesystem/FileUtilsTest.java>:[28,14]
[deprecation] java.io.StringBufferInputStream in java.io has been deprecated

[WARNING] <https://builds.apache.org/job/Aries/ws/aries/util/src/test/java/org/apache/aries/util/filesystem/IOUtilsTest.java>:[35,14]
[deprecation] java.io.StringBufferInputStream in java.io has been deprecated

[WARNING] <https://builds.apache.org/job/Aries/ws/aries/util/src/test/java/org/apache/aries/util/RecursiveBundleTrackerTest.java>:[34,33]
[deprecation] org.osgi.service.framework.CompositeBundle in org.osgi.service.framework has
been deprecated

[WARNING] <https://builds.apache.org/job/Aries/ws/aries/util/src/test/java/org/apache/aries/util/RecursiveBundleTrackerTest.java>:[112,31]
[deprecation] org.osgi.service.framework.CompositeBundle in org.osgi.service.framework has
been deprecated

[WARNING] <https://builds.apache.org/job/Aries/ws/aries/util/src/test/java/org/apache/aries/util/RecursiveBundleTrackerTest.java>:[126,12]
[deprecation] org.osgi.service.framework.CompositeBundle in org.osgi.service.framework has
been deprecated

[WARNING] <https://builds.apache.org/job/Aries/ws/aries/util/src/test/java/org/apache/aries/util/filesystem/IOUtilsTest.java>:[88,47]
[deprecation] java.io.StringBufferInputStream in java.io has been deprecated

[WARNING] <https://builds.apache.org/job/Aries/ws/aries/util/src/test/java/org/apache/aries/util/filesystem/IOUtilsTest.java>:[89,72]
[deprecation] java.io.StringBufferInputStream in java.io has been deprecated

[WARNING] <https://builds.apache.org/job/Aries/ws/aries/util/src/test/java/org/apache/aries/util/filesystem/IOUtilsTest.java>:[90,73]
[deprecation] java.io.StringBufferInputStream in java.io has been deprecated

[WARNING] <https://builds.apache.org/job/Aries/ws/aries/util/src/test/java/org/apache/aries/util/RecursiveBundleTrackerTest.java>:[59,8]
[deprecation] org.osgi.service.framework.CompositeBundle in org.osgi.service.framework has
been deprecated

[WARNING] <https://builds.apache.org/job/Aries/ws/aries/util/src/test/java/org/apache/aries/util/RecursiveBundleTrackerTest.java>:[127,8]
[deprecation] org.osgi.service.framework.CompositeBundle in org.osgi.service.framework has
been deprecated

[WARNING] <https://builds.apache.org/job/Aries/ws/aries/util/src/test/java/org/apache/aries/util/RecursiveBundleTrackerTest.java>:[127,46]
[deprecation] org.osgi.service.framework.CompositeBundle in org.osgi.service.framework has
been deprecated

[WARNING] <https://builds.apache.org/job/Aries/ws/aries/util/src/test/java/org/apache/aries/util/RecursiveBundleTrackerTest.java>:[129,45]
[deprecation] org.osgi.service.framework.CompositeBundle in org.osgi.service.framework has
been deprecated

[WARNING] <https://builds.apache.org/job/Aries/ws/aries/util/src/test/java/org/apache/aries/util/RecursiveBundleTrackerTest.java>:[130,45]
[deprecation] org.osgi.service.framework.CompositeBundle in org.osgi.service.framework has
been deprecated

[INFO] [surefire:test {execution: default-test}]
[INFO] Surefire report directory: <https://builds.apache.org/job/Aries/ws/aries/util/target/surefire-reports>

-------------------------------------------------------
 T E S T S
-------------------------------------------------------
Running org.apache.aries.util.manifest.ManifestHeaderProcessorTest
Tests run: 11, Failures: 0, Errors: 0, Skipped: 0, Time elapsed: 0.042 sec
Running org.apache.aries.util.SingleServiceTrackerTest
Tests run: 3, Failures: 0, Errors: 0, Skipped: 0, Time elapsed: 0.062 sec
Running org.apache.aries.util.filesystem.IOUtilsTest
Tests run: 5, Failures: 0, Errors: 0, Skipped: 0, Time elapsed: 0.087 sec
Running org.apache.aries.util.manifest.BundleManifestTest
Tests run: 2, Failures: 0, Errors: 0, Skipped: 0, Time elapsed: 0.007 sec
Running org.apache.aries.util.VersionRangeTest
Tests run: 10, Failures: 0, Errors: 0, Skipped: 0, Time elapsed: 0.012 sec
Running org.apache.aries.util.filesystem.FileUtilsTest
Tests run: 1, Failures: 0, Errors: 0, Skipped: 0, Time elapsed: 0.014 sec
Running org.apache.aries.util.FragmentUtilsTest
Tests run: 2, Failures: 0, Errors: 0, Skipped: 0, Time elapsed: 0.028 sec
Running org.apache.aries.util.filesystem.FileSystemTest
Tests run: 8, Failures: 0, Errors: 0, Skipped: 0, Time elapsed: 2.591 sec
Running org.apache.aries.util.RecursiveBundleTrackerTest
Tests run: 4, Failures: 0, Errors: 0, Skipped: 0, Time elapsed: 0.023 sec

Results :

Tests run: 46, Failures: 0, Errors: 0, Skipped: 0

[JENKINS] Recording test results
[INFO] [enforcer:enforce {execution: check-java15}]
[INFO] Checking unresolved references to org.codehaus.mojo.signature:java15:1.0
[INFO] [bundle:bundle {execution: default-bundle}]
[WARNING] Warning building bundle org.apache.aries:org.apache.aries.util:bundle:0.4-SNAPSHOT
: Did not find matching referal for !org.apache.aries.util*
[INFO] [ianal:verify-legal-files {execution: default}]
[INFO] Checking legal files in: org.apache.aries.util-0.4-SNAPSHOT.jar
[INFO] [install:install {execution: default-install}]
[INFO] Installing <https://builds.apache.org/job/Aries/ws/aries/util/target/org.apache.aries.util-0.4-SNAPSHOT.jar>
to /home/hudson/.m2/repository/org/apache/aries/org.apache.aries.util/0.4-SNAPSHOT/org.apache.aries.util-0.4-SNAPSHOT.jar
[INFO] [bundle:install {execution: default-install}]
[WARNING] Exception while updating local OBR: Unable to read repository xml: file:/home/hudson/.m2/repository/repository.xml
org.apache.maven.plugin.MojoExecutionException: Unable to read repository xml: file:/home/hudson/.m2/repository/repository.xml
	at org.apache.felix.obrplugin.ObrUpdate.parseRepositoryXml(ObrUpdate.java:295)
	at org.apache.felix.obrplugin.ObrInstall.execute(ObrInstall.java:140)
	at org.apache.maven.plugin.DefaultPluginManager.executeMojo(DefaultPluginManager.java:490)
	at hudson.maven.agent.PluginManagerInterceptor.executeMojo(PluginManagerInterceptor.java:182)
	at org.apache.maven.lifecycle.DefaultLifecycleExecutor.executeGoals(DefaultLifecycleExecutor.java:694)
	at org.apache.maven.lifecycle.DefaultLifecycleExecutor.executeGoalWithLifecycle(DefaultLifecycleExecutor.java:556)
	at org.apache.maven.lifecycle.DefaultLifecycleExecutor.executeGoal(DefaultLifecycleExecutor.java:535)
	at org.apache.maven.lifecycle.DefaultLifecycleExecutor.executeGoalAndHandleFailures(DefaultLifecycleExecutor.java:387)
	at org.apache.maven.lifecycle.DefaultLifecycleExecutor.executeTaskSegments(DefaultLifecycleExecutor.java:348)
	at org.apache.maven.lifecycle.DefaultLifecycleExecutor.execute(DefaultLifecycleExecutor.java:180)
	at org.apache.maven.lifecycle.LifecycleExecutorInterceptor.execute(LifecycleExecutorInterceptor.java:65)
	at org.apache.maven.DefaultMaven.doExecute(DefaultMaven.java:328)
	at org.apache.maven.DefaultMaven.execute(DefaultMaven.java:138)
	at org.apache.maven.cli.MavenCli.main(MavenCli.java:362)
	at sun.reflect.NativeMethodAccessorImpl.invoke0(Native Method)
	at sun.reflect.NativeMethodAccessorImpl.invoke(NativeMethodAccessorImpl.java:39)
	at sun.reflect.DelegatingMethodAccessorImpl.invoke(DelegatingMethodAccessorImpl.java:25)
	at java.lang.reflect.Method.invoke(Method.java:597)
	at org.codehaus.classworlds.Launcher.launchEnhanced(Launcher.java:315)
	at org.codehaus.classworlds.Launcher.launch(Launcher.java:255)
	at hudson.maven.agent.Main.launch(Main.java:185)
	at hudson.maven.MavenBuilder.call(MavenBuilder.java:164)
	at hudson.maven.MavenModuleSetBuild$Builder.call(MavenModuleSetBuild.java:987)
	at hudson.maven.MavenModuleSetBuild$Builder.call(MavenModuleSetBuild.java:918)
	at hudson.remoting.UserRequest.perform(UserRequest.java:118)
	at hudson.remoting.UserRequest.perform(UserRequest.java:48)
	at hudson.remoting.Request$2.run(Request.java:270)
	at java.util.concurrent.Executors$RunnableAdapter.call(Executors.java:441)
	at java.util.concurrent.FutureTask$Sync.innerRun(FutureTask.java:303)
	at java.util.concurrent.FutureTask.run(FutureTask.java:138)
	at java.util.concurrent.ThreadPoolExecutor$Worker.runTask(ThreadPoolExecutor.java:886)
	at java.util.concurrent.ThreadPoolExecutor$Worker.run(ThreadPoolExecutor.java:908)
	at java.lang.Thread.run(Thread.java:619)
Caused by: org.xmlpull.v1.XmlPullParserException: unexpected type (position:END_DOCUMENT null@3:1
in java.io.InputStreamReader@96057d) 
	at org.kxml2.io.KXmlParser.exception(Unknown Source)
	at org.kxml2.io.KXmlParser.nextTag(Unknown Source)
	at org.apache.felix.bundlerepository.impl.PullParser.parseRepository(PullParser.java:43)
	at org.apache.felix.bundlerepository.impl.DataModelHelperImpl.repository(DataModelHelperImpl.java:147)
	at org.apache.felix.bundlerepository.impl.DataModelHelperImpl.repository(DataModelHelperImpl.java:118)
	at org.apache.felix.obrplugin.ObrUpdate.parseRepositoryXml(ObrUpdate.java:291)
	... 32 more
[JENKINS] Archiving <https://builds.apache.org/job/Aries/ws/aries/util/pom.xml> to /home/hudson/hudson/jobs/Aries/modules/org.apache.aries$org.apache.aries.util/builds/2011-06-21_11-56-49/archive/org.apache.aries/org.apache.aries.util/0.4-SNAPSHOT/org.apache.aries.util-0.4-SNAPSHOT.pom
[JENKINS] Archiving <https://builds.apache.org/job/Aries/ws/aries/util/target/org.apache.aries.util-0.4-SNAPSHOT.jar>
to /home/hudson/hudson/jobs/Aries/modules/org.apache.aries$org.apache.aries.util/builds/2011-06-21_11-56-49/archive/org.apache.aries/org.apache.aries.util/0.4-SNAPSHOT/org.apache.aries.util-0.4-SNAPSHOT.jar
[INFO] ------------------------------------------------------------------------
[INFO] Building Apache Aries Proxy Service Dependencies
[INFO]    task-segment: [clean, install]
[INFO] ------------------------------------------------------------------------
[INFO] [clean:clean {execution: default-clean}]
[INFO] Deleting file set: <https://builds.apache.org/job/Aries/ws/aries/proxy/proxy-tmp/target>
(included: [**], excluded: [])
[INFO] [enforcer:enforce {execution: default}]
[INFO] [remote-resources:process {execution: default}]
[INFO] [antrun:run {execution: default}]
[INFO] Executing tasks
    [mkdir] Created dir: <https://builds.apache.org/job/Aries/ws/aries/proxy/proxy-tmp/target/downloaded>
      [get] Getting: http://download.eclipse.org/equinox/drops/S-3.7M6-201103101119/org.eclipse.osgi_3.7.0.v20110304.jar
      [get] To: <https://builds.apache.org/job/Aries/ws/aries/proxy/proxy-tmp/target/downloaded/org.eclipse.osgi_3.7.0.jar>
      [get] Error opening connection java.io.FileNotFoundException: http://download.eclipse.org/equinox/drops/S-3.7M6-201103101119/org.eclipse.osgi_3.7.0.v20110304.jar
      [get] Error opening connection java.io.FileNotFoundException: http://download.eclipse.org/equinox/drops/S-3.7M6-201103101119/org.eclipse.osgi_3.7.0.v20110304.jar
      [get] Error opening connection java.io.FileNotFoundException: http://download.eclipse.org/equinox/drops/S-3.7M6-201103101119/org.eclipse.osgi_3.7.0.v20110304.jar
      [get] Can't get http://download.eclipse.org/equinox/drops/S-3.7M6-201103101119/org.eclipse.osgi_3.7.0.v20110304.jar
to <https://builds.apache.org/job/Aries/ws/aries/proxy/proxy-tmp/target/downloaded/org.eclipse.osgi_3.7.0.jar>
[JENKINS] Archiving <https://builds.apache.org/job/Aries/ws/aries/proxy/proxy-tmp/pom.xml>
to /home/hudson/hudson/jobs/Aries/modules/org.apache.aries.proxy$org.apache.aries.proxy.tmp/builds/2011-06-21_11-56-49/archive/org.apache.aries.proxy/org.apache.aries.proxy.tmp/0.4-SNAPSHOT/org.apache.aries.proxy.tmp-0.4-SNAPSHOT.pom
[INFO] ------------------------------------------------------------------------
[ERROR] BUILD ERROR
[INFO] ------------------------------------------------------------------------
[INFO] An Ant BuildException has occured: Can't get http://download.eclipse.org/equinox/drops/S-3.7M6-201103101119/org.eclipse.osgi_3.7.0.v20110304.jar
to <https://builds.apache.org/job/Aries/ws/aries/proxy/proxy-tmp/target/downloaded/org.eclipse.osgi_3.7.0.jar>

[INFO] ------------------------------------------------------------------------
[INFO] Trace
org.apache.maven.lifecycle.LifecycleExecutionException: An Ant BuildException has occured:
Can't get http://download.eclipse.org/equinox/drops/S-3.7M6-201103101119/org.eclipse.osgi_3.7.0.v20110304.jar
to <https://builds.apache.org/job/Aries/ws/aries/proxy/proxy-tmp/target/downloaded/org.eclipse.osgi_3.7.0.jar>
	at org.apache.maven.lifecycle.DefaultLifecycleExecutor.executeGoals(DefaultLifecycleExecutor.java:719)
	at org.apache.maven.lifecycle.DefaultLifecycleExecutor.executeGoalWithLifecycle(DefaultLifecycleExecutor.java:556)
	at org.apache.maven.lifecycle.DefaultLifecycleExecutor.executeGoal(DefaultLifecycleExecutor.java:535)
	at org.apache.maven.lifecycle.DefaultLifecycleExecutor.executeGoalAndHandleFailures(DefaultLifecycleExecutor.java:387)
	at org.apache.maven.lifecycle.DefaultLifecycleExecutor.executeTaskSegments(DefaultLifecycleExecutor.java:348)
	at org.apache.maven.lifecycle.DefaultLifecycleExecutor.execute(DefaultLifecycleExecutor.java:180)
	at org.apache.maven.lifecycle.LifecycleExecutorInterceptor.execute(LifecycleExecutorInterceptor.java:65)
	at org.apache.maven.DefaultMaven.doExecute(DefaultMaven.java:328)
	at org.apache.maven.DefaultMaven.execute(DefaultMaven.java:138)
	at org.apache.maven.cli.MavenCli.main(MavenCli.java:362)
	at sun.reflect.NativeMethodAccessorImpl.invoke0(Native Method)
	at sun.reflect.NativeMethodAccessorImpl.invoke(NativeMethodAccessorImpl.java:39)
	at sun.reflect.DelegatingMethodAccessorImpl.invoke(DelegatingMethodAccessorImpl.java:25)
	at java.lang.reflect.Method.invoke(Method.java:597)
	at org.codehaus.classworlds.Launcher.launchEnhanced(Launcher.java:315)
	at org.codehaus.classworlds.Launcher.launch(Launcher.java:255)
	at hudson.maven.agent.Main.launch(Main.java:185)
	at hudson.maven.MavenBuilder.call(MavenBuilder.java:164)
	at hudson.maven.MavenModuleSetBuild$Builder.call(MavenModuleSetBuild.java:987)
	at hudson.maven.MavenModuleSetBuild$Builder.call(MavenModuleSetBuild.java:918)
	at hudson.remoting.UserRequest.perform(UserRequest.java:118)
	at hudson.remoting.UserRequest.perform(UserRequest.java:48)
	at hudson.remoting.Request$2.run(Request.java:270)
	at java.util.concurrent.Executors$RunnableAdapter.call(Executors.java:441)
	at java.util.concurrent.FutureTask$Sync.innerRun(FutureTask.java:303)
	at java.util.concurrent.FutureTask.run(FutureTask.java:138)
	at java.util.concurrent.ThreadPoolExecutor$Worker.runTask(ThreadPoolExecutor.java:886)
	at java.util.concurrent.ThreadPoolExecutor$Worker.run(ThreadPoolExecutor.java:908)
	at java.lang.Thread.run(Thread.java:619)
Caused by: org.apache.maven.plugin.MojoExecutionException: An Ant BuildException has occured:
Can't get http://download.eclipse.org/equinox/drops/S-3.7M6-201103101119/org.eclipse.osgi_3.7.0.v20110304.jar
to <https://builds.apache.org/job/Aries/ws/aries/proxy/proxy-tmp/target/downloaded/org.eclipse.osgi_3.7.0.jar>
	at org.apache.maven.plugin.antrun.AbstractAntMojo.executeTasks(AbstractAntMojo.java:131)
	at org.apache.maven.plugin.antrun.AntRunMojo.execute(AntRunMojo.java:98)
	at org.apache.maven.plugin.DefaultPluginManager.executeMojo(DefaultPluginManager.java:490)
	at hudson.maven.agent.PluginManagerInterceptor.executeMojo(PluginManagerInterceptor.java:182)
	at org.apache.maven.lifecycle.DefaultLifecycleExecutor.executeGoals(DefaultLifecycleExecutor.java:694)
	... 28 more
Caused by: Can't get http://download.eclipse.org/equinox/drops/S-3.7M6-201103101119/org.eclipse.osgi_3.7.0.v20110304.jar
to <https://builds.apache.org/job/Aries/ws/aries/proxy/proxy-tmp/target/downloaded/org.eclipse.osgi_3.7.0.jar>
	at org.apache.tools.ant.taskdefs.Get.doGet(Get.java:199)
	at org.apache.tools.ant.taskdefs.Get.execute(Get.java:78)
	at org.apache.tools.ant.UnknownElement.execute(UnknownElement.java:288)
	at sun.reflect.NativeMethodAccessorImpl.invoke0(Native Method)
	at sun.reflect.NativeMethodAccessorImpl.invoke(NativeMethodAccessorImpl.java:39)
	at sun.reflect.DelegatingMethodAccessorImpl.invoke(DelegatingMethodAccessorImpl.java:25)
	at java.lang.reflect.Method.invoke(Method.java:597)
	at org.apache.tools.ant.dispatch.DispatchUtils.execute(DispatchUtils.java:106)
	at org.apache.tools.ant.Task.perform(Task.java:348)
	at org.apache.tools.ant.Target.execute(Target.java:357)
	at org.apache.maven.plugin.antrun.AbstractAntMojo.executeTasks(AbstractAntMojo.java:118)
	... 32 more
[INFO] ------------------------------------------------------------------------
[INFO] Total time: 59 seconds
[INFO] Finished at: Tue Jun 21 11:58:15 UTC 2011
[INFO] Final Memory: 99M/435M
[INFO] ------------------------------------------------------------------------
Sending e-mails to: dev@aries.apache.org
channel stopped


Mime
View raw message