aries-dev mailing list archives

Site index · List index
Message view « Date » · « Thread »
Top « Date » · « Thread »
From Apache Jenkins Server <jenk...@builds.apache.org>
Subject Build failed in Jenkins: Aries #1046
Date Thu, 16 Jun 2011 19:59:59 GMT
See <https://builds.apache.org/job/Aries/1046/changes>

Changes:

[djencks] ARIES-680 try to make all use of slf4j-api, osgi core and osgi compendium provided
dependencies

[hughesj] svn ignore the target dir

[mahrwald] ARIES-676: Make tests more resilient to different JVMs

[mahrwald] ARIES-679: One slew of changes to check for Java5 compatibility and some fixes

[mahrwald] ARIES-676: Common up tests between modeller projects

------------------------------------------
[...truncated 129 lines...]
[INFO]   Apache Aries Blueprint API
[INFO]   Apache Aries Blueprint Core
[INFO]   Apache Aries Blueprint Annotation API
[INFO]   Apache Aries Blueprint Core
[INFO]   Apache Aries Blueprint CM
[INFO]   Apache Aries Blueprint Bundle
[INFO]   Apache Aries Blueprint Sample
[INFO]   Apache Aries Blueprint Annotation Impl
[INFO]   Apache Aries Blueprint Sample for Testing Annotation
[INFO]   Apache Aries Blueprint Sample Fragment for Testing Annotation
[INFO]   Apache Aries Blueprint Test Bundle A
[INFO]   Apache Aries Blueprint Test Bundle B
[INFO]   Apache Aries Blueprint Test Quiesce Bundle
[INFO]   Apache Aries Blueprint iTests
[INFO]   Apache Aries Blueprint Annotation iTests
[INFO]   Apache Aries Blueprint
[INFO]   Apache Aries JNDI API
[INFO]   Apache Aries JNDI Core
[INFO]   Apache Aries JNDI URL Handler
[INFO]   Apache Aries JNDI RMI Handler
[INFO]   Apache Aries JNDI Bundle
[INFO]   Apache Aries JNDI Support for Legacy Runtimes
[INFO]   Apache Aries JNDI "business logic" test bundle for Aries jndi-url iTests
[INFO]   Apache Aries JNDI Test Bundle for Aries jndi-url iTests
[INFO]   Apache Aries JNDI iTests for jndi-url
[INFO]   Apache Aries JNDI
[INFO]   Apache Aries Transaction Manager
[INFO]   Apache Aries Transaction Blueprint
[INFO]   Apache Aries Transaction Enlisting JDBC Datasource
[INFO]   Apache Aries Transaction Test Datasource Configuration
[INFO]   Apache Aries Transaction Test Bundle
[INFO]   Apache Aries Transaction Integration Tests
[INFO]   Apache Aries Transaction - reactor pom
[INFO]   Apache Aries Web Url handler
[INFO]   Apache Aries Web integration tests
[INFO]   Apache Aries Web Component
[INFO]   Apache Aries Application API
[INFO]   Apache Aries Application Utils
[INFO]   Apache Aries Application Modelling
[INFO]   Apache Aries Application Deployment Management
[INFO]   Apache Aries Application Management
[INFO]   Apache Aries Application Runtime
[INFO]   Apache Aries Application Bundle
[INFO]   Apache Aries Application Converters
[INFO]   Apache Aries Application Default local platform
[INFO]   Apache Aries Application Installer
[INFO]   Apache Aries Application itests sample application interface
[INFO]   Apache Aries Bundle Framework provider
[INFO]   Apache Aries Bundle Framework Manager provider
[INFO]   Apache Aries Bundle Repository provider
[INFO]   Apache Aries Isolated Application Runtime
[INFO]   Apache Aries Application OBR Resolver
[INFO]   Apache Aries Application No-op Resolver
[INFO]   Apache Aries Application integration tests
[INFO]   Apache Aries Application Modelling
[INFO]   Apache Aries Application Modelling tests
[INFO]   Apache Aries repository generator tool
[INFO]   Application distribution
[INFO]   Application distribution for isolated application support
[INFO]   Apache Aries Application
[INFO]   Apache Aries JMX API
[INFO]   Apache Aries JMX Blueprint API
[INFO]   Apache Aries JMX Core
[INFO]   Apache Aries Whiteboard support for JMX DynamicMBean services
[INFO]   Apache Aries JMX Blueprint Core
[INFO]   Apache Aries JMX Bundle
[INFO]   Apache Aries JMX Blueprint Bundle
[INFO]   Apache Aries JMX integration tests
[INFO]   Apache Aries JMX
[INFO]   Apache Aries Proxy Service Dependencies
[INFO]   Aries JPA Container API
[INFO]   Aries JPA Container
[INFO]   Aries JPA Container Managed Contexts
[INFO]   Aries JPA Container blueprint integration for Aries blueprint
[INFO]   Test Bundle for Aries JPA Container iTests
[INFO]   Test Bundle for Aries JPA Container advanced iTests
[INFO]   Test Bundle for Aries JPA Blueprint iTests
[INFO]   Aries JPA iTests
[INFO]   Aries JPA Component
[INFO]   Apache Aries Samples
[INFO]   Apache Aries blog sample
[INFO]   Apache Aries blog sample API
[INFO]   Apache Aries blog sample transaction enlisting JDBC datasource
[INFO]   Apache Aries blog sample assembly
[INFO]   Apache Aries blog sample
[INFO]   Apache Aries blog sample web component
[INFO]   Apache Aries blog sample persistence
[INFO]   Apache Aries Blog Sample EBA using JDBC
[INFO]   Apache Aries blog sample persistence
[INFO]   Apache Aries Blog Sample EBA using JPA
[INFO]   Apache Aries Blog sample iTests
[INFO]   AriesTrader :: Performance Benchmark Sample
[INFO]   AriesTrader :: Modules
[INFO]   AriesTrader :: Modules - Util
[INFO]   AriesTrader :: Modules - API
[INFO]   AriesTrader :: Modules - Core
[INFO]   AriesTrader :: Modules - Web
[INFO]   AriesTrader :: Modules - Beans
[INFO]   AriesTrader :: Modules - Entities
[INFO]   AriesTrader :: Modules - Derby DataSource
[INFO]   AriesTrader :: Modules - Persist JDBC
[INFO]   AriesTrader :: Modules - Persist JPA App Managed
[INFO]   AriesTrader :: Modules - Persist JPA Container Managed
[INFO]   AriesTrader :: Assemblies
[INFO]   AriesTrader :: Assemblies - EBA - JDBC
[INFO]   AriesTrader :: Assemblies - EBA - ALL
[INFO]   Equinox test harness that can be used to install sample EBAs
[INFO]   Apache Aries Blueprint samples
[INFO]   Apache Aries Blueprint HelloWorld
[INFO]   Apache Aries Blueprint HelloWorld API
[INFO]   Apache Aries Blueprint HelloWorldServer
[INFO]   Apache Aries Blueprint HelloWorldClient
[INFO]   Apache Aries Blueprint HelloWorld Assembly
[INFO]   Apache Aries Blueprint HelloWorld EBA
[INFO]   Apache Aries Blueprint sample iTests
[INFO]   Apache Aries Blueprint Sample - ID Verifier
[INFO]   Apache Aries Blueprint Sample - ID Verifier API
[INFO]   Apache Aries Blueprint Sample - ID Verifier Server
[INFO]   Apache Aries Blueprint Sample - ID Verifier Client
[INFO]   Apache Aries Blueprint Sample - ID Verifier Assembly
[INFO]   Apache Aries Twitter sample
[INFO]   Apache Aries Bundlise Twitter4j
[INFO]   Apache Aries Twitter bundle
[INFO]   Apache Aries Twitter EBA
[INFO]   Apache Aries Twitter sample integration tests
[INFO]   Apache Aries
[WARNING] POM for 'biz.aQute:bndlib:pom:1.15.0:runtime' is invalid.

Its dependencies (if any) will NOT be available to the current build.
[INFO] artifact org.apache.aries:eba-maven-plugin: checking for updates from central
[WARNING] *** CHECKSUM FAILED - Checksum failed on download: local = 'e017513cde451a0121a1d4f0c1fcfb270d545ed1';
remote = 'e3ab2f20e6537547cb3aca1663491527a77c9a64' - RETRYING
[WARNING] *** CHECKSUM FAILED - Checksum failed on download: local = 'e017513cde451a0121a1d4f0c1fcfb270d545ed1';
remote = 'e3ab2f20e6537547cb3aca1663491527a77c9a64' - IGNORING
[INFO] snapshot org.apache.aries:eba-maven-plugin:0.3.1-SNAPSHOT: checking for updates from
apache.snapshots
[INFO] snapshot org.apache.aries:eba-maven-plugin:0.3.1-SNAPSHOT: checking for updates from
codehaus.snapshots
[WARNING] repository metadata for: 'snapshot org.apache.aries:eba-maven-plugin:0.3.1-SNAPSHOT'
could not be retrieved from repository: codehaus.snapshots due to an error: Error transferring
file: Connection timed out
[INFO] Repository 'codehaus.snapshots' will be blacklisted
[INFO] ------------------------------------------------------------------------
[INFO] Building Aries :: Top Parent POM
[INFO]    task-segment: [clean, install]
[INFO] ------------------------------------------------------------------------
[INFO] [clean:clean {execution: default-clean}]
[INFO] Deleting file set: <https://builds.apache.org/job/Aries/ws/aries/parent/target>
(included: [**], excluded: [])
[INFO] Setting property: classpath.resource.loader.class => 'org.codehaus.plexus.velocity.ContextClassLoaderResourceLoader'.
[INFO] Setting property: velocimacro.messages.on => 'false'.
[INFO] Setting property: resource.loader => 'classpath'.
[INFO] Setting property: resource.manager.logwhenfound => 'false'.
[INFO] [remote-resources:process {execution: default}]
[INFO] [site:attach-descriptor {execution: default-attach-descriptor}]
[INFO] [install:install {execution: default-install}]
[INFO] Installing <https://builds.apache.org/job/Aries/ws/aries/parent/pom.xml> to /home/hudson/.m2/repository/org/apache/aries/parent/0.4.1-SNAPSHOT/parent-0.4.1-SNAPSHOT.pom
[JENKINS] Archiving <https://builds.apache.org/job/Aries/ws/aries/parent/pom.xml> to
/home/hudson/hudson/jobs/Aries/modules/org.apache.aries$parent/builds/2011-06-16_19-58-43/archive/org.apache.aries/parent/0.4.1-SNAPSHOT/parent-0.4.1-SNAPSHOT.pom
[INFO] ------------------------------------------------------------------------
[INFO] Building Aries :: Default Parent POM
[INFO]    task-segment: [clean, install]
[INFO] ------------------------------------------------------------------------
[INFO] [clean:clean {execution: default-clean}]
[INFO] Deleting file set: <https://builds.apache.org/job/Aries/ws/aries/parent/default-parent/target>
(included: [**], excluded: [])
[INFO] [enforcer:enforce {execution: default}]
[INFO] [remote-resources:process {execution: default}]
[INFO] [site:attach-descriptor {execution: default-attach-descriptor}]
[INFO] [ianal:verify-legal-files {execution: default}]
[INFO] [install:install {execution: default-install}]
[INFO] Installing <https://builds.apache.org/job/Aries/ws/aries/parent/default-parent/pom.xml>
to /home/hudson/.m2/repository/org/apache/aries/default-parent/0.4.1-SNAPSHOT/default-parent-0.4.1-SNAPSHOT.pom
[JENKINS] Archiving <https://builds.apache.org/job/Aries/ws/aries/parent/default-parent/pom.xml>
to /home/hudson/hudson/jobs/Aries/modules/org.apache.aries$default-parent/builds/2011-06-16_19-58-43/archive/org.apache.aries/default-parent/0.4.1-SNAPSHOT/default-parent-0.4.1-SNAPSHOT.pom
[INFO] ------------------------------------------------------------------------
[INFO] Building Aries :: Java 5 Parent POM
[INFO]    task-segment: [clean, install]
[INFO] ------------------------------------------------------------------------
[INFO] [clean:clean {execution: default-clean}]
[INFO] Deleting file set: <https://builds.apache.org/job/Aries/ws/aries/parent/default-parent/java5-parent/target>
(included: [**], excluded: [])
[INFO] [enforcer:enforce {execution: default}]
[INFO] [remote-resources:process {execution: default}]
[JENKINS] Archiving <https://builds.apache.org/job/Aries/ws/aries/parent/default-parent/java5-parent/pom.xml>
to /home/hudson/hudson/jobs/Aries/modules/org.apache.aries$java5-parent/builds/2011-06-16_19-58-43/archive/org.apache.aries/java5-parent/0.4.1-SNAPSHOT/java5-parent-0.4.1-SNAPSHOT.pom
[INFO] ------------------------------------------------------------------------
[ERROR] BUILD ERROR
[INFO] ------------------------------------------------------------------------
[INFO] Failed to configure plugin parameters for: org.apache.maven.plugins:maven-enforcer-plugin:1.0-beta-1



Cause: Class name which was explicitly given in configuration using 'implementation' attribute:
'org.codehaus.mojo.animal_sniffer.enforcer.CheckSignatureRule' cannot be loaded
[INFO] ------------------------------------------------------------------------
[INFO] Trace
org.apache.maven.lifecycle.LifecycleExecutionException: Error configuring: org.apache.maven.plugins:maven-enforcer-plugin.
Reason: Unable to parse the created DOM for plugin configuration
	at org.apache.maven.lifecycle.DefaultLifecycleExecutor.executeGoals(DefaultLifecycleExecutor.java:723)
	at org.apache.maven.lifecycle.DefaultLifecycleExecutor.executeGoalWithLifecycle(DefaultLifecycleExecutor.java:556)
	at org.apache.maven.lifecycle.DefaultLifecycleExecutor.executeGoal(DefaultLifecycleExecutor.java:535)
	at org.apache.maven.lifecycle.DefaultLifecycleExecutor.executeGoalAndHandleFailures(DefaultLifecycleExecutor.java:387)
	at org.apache.maven.lifecycle.DefaultLifecycleExecutor.executeTaskSegments(DefaultLifecycleExecutor.java:348)
	at org.apache.maven.lifecycle.DefaultLifecycleExecutor.execute(DefaultLifecycleExecutor.java:180)
	at org.apache.maven.lifecycle.LifecycleExecutorInterceptor.execute(LifecycleExecutorInterceptor.java:65)
	at org.apache.maven.DefaultMaven.doExecute(DefaultMaven.java:328)
	at org.apache.maven.DefaultMaven.execute(DefaultMaven.java:138)
	at org.apache.maven.cli.MavenCli.main(MavenCli.java:362)
	at sun.reflect.NativeMethodAccessorImpl.invoke0(Native Method)
	at sun.reflect.NativeMethodAccessorImpl.invoke(NativeMethodAccessorImpl.java:39)
	at sun.reflect.DelegatingMethodAccessorImpl.invoke(DelegatingMethodAccessorImpl.java:25)
	at java.lang.reflect.Method.invoke(Method.java:597)
	at org.codehaus.classworlds.Launcher.launchEnhanced(Launcher.java:315)
	at org.codehaus.classworlds.Launcher.launch(Launcher.java:255)
	at hudson.maven.agent.Main.launch(Main.java:185)
	at hudson.maven.MavenBuilder.call(MavenBuilder.java:164)
	at hudson.maven.MavenModuleSetBuild$Builder.call(MavenModuleSetBuild.java:987)
	at hudson.maven.MavenModuleSetBuild$Builder.call(MavenModuleSetBuild.java:918)
	at hudson.remoting.UserRequest.perform(UserRequest.java:118)
	at hudson.remoting.UserRequest.perform(UserRequest.java:48)
	at hudson.remoting.Request$2.run(Request.java:270)
	at java.util.concurrent.Executors$RunnableAdapter.call(Executors.java:441)
	at java.util.concurrent.FutureTask$Sync.innerRun(FutureTask.java:303)
	at java.util.concurrent.FutureTask.run(FutureTask.java:138)
	at java.util.concurrent.ThreadPoolExecutor$Worker.runTask(ThreadPoolExecutor.java:886)
	at java.util.concurrent.ThreadPoolExecutor$Worker.run(ThreadPoolExecutor.java:908)
	at java.lang.Thread.run(Thread.java:619)
Caused by: org.apache.maven.plugin.PluginConfigurationException: Error configuring: org.apache.maven.plugins:maven-enforcer-plugin.
Reason: Unable to parse the created DOM for plugin configuration
	at org.apache.maven.plugin.DefaultPluginManager.populatePluginFields(DefaultPluginManager.java:1363)
	at org.apache.maven.plugin.DefaultPluginManager.getConfiguredMojo(DefaultPluginManager.java:724)
	at org.apache.maven.plugin.DefaultPluginManager.executeMojo(DefaultPluginManager.java:468)
	at hudson.maven.agent.PluginManagerInterceptor.executeMojo(PluginManagerInterceptor.java:182)
	at org.apache.maven.lifecycle.DefaultLifecycleExecutor.executeGoals(DefaultLifecycleExecutor.java:694)
	... 28 more
Caused by: org.codehaus.plexus.component.configurator.ComponentConfigurationException: Class
name which was explicitly given in configuration using 'implementation' attribute: 'org.codehaus.mojo.animal_sniffer.enforcer.CheckSignatureRule'
cannot be loaded
	at org.codehaus.plexus.component.configurator.converters.AbstractConfigurationConverter.getClassForImplementationHint(AbstractConfigurationConverter.java:71)
	at org.codehaus.plexus.component.configurator.converters.composite.ArrayConverter.fromConfiguration(ArrayConverter.java:78)
	at org.codehaus.plexus.component.configurator.converters.ComponentValueSetter.configure(ComponentValueSetter.java:207)
	at org.codehaus.plexus.component.configurator.converters.composite.ObjectWithFieldsConverter.processConfiguration(ObjectWithFieldsConverter.java:137)
	at org.codehaus.plexus.component.configurator.BasicComponentConfigurator.configureComponent(BasicComponentConfigurator.java:56)
	at hudson.maven.agent.ComponentConfiguratorFilter.configureComponent(ComponentConfiguratorFilter.java:49)
	at hudson.maven.agent.PluginManagerInterceptor$MojoIntercepter.configureComponent(PluginManagerInterceptor.java:146)
	at org.apache.maven.plugin.DefaultPluginManager.populatePluginFields(DefaultPluginManager.java:1357)
	... 32 more
Caused by: java.lang.ClassNotFoundException: org.codehaus.mojo.animal_sniffer.enforcer.CheckSignatureRule
	at java.net.URLClassLoader$1.run(URLClassLoader.java:202)
	at java.security.AccessController.doPrivileged(Native Method)
	at java.net.URLClassLoader.findClass(URLClassLoader.java:190)
	at java.lang.ClassLoader.loadClass(ClassLoader.java:307)
	at org.codehaus.classworlds.RealmClassLoader.loadClassDirect(RealmClassLoader.java:195)
	at org.codehaus.classworlds.DefaultClassRealm.loadClass(DefaultClassRealm.java:255)
	at org.codehaus.classworlds.DefaultClassRealm.loadClass(DefaultClassRealm.java:274)
	at org.codehaus.classworlds.DefaultClassRealm.loadClass(DefaultClassRealm.java:274)
	at org.codehaus.classworlds.RealmClassLoader.loadClass(RealmClassLoader.java:214)
	at java.lang.ClassLoader.loadClass(ClassLoader.java:248)
	at org.codehaus.plexus.component.configurator.converters.AbstractConfigurationConverter.getClassForImplementationHint(AbstractConfigurationConverter.java:62)
	... 39 more
[INFO] ------------------------------------------------------------------------
[INFO] Total time: 43 seconds
[INFO] Finished at: Thu Jun 16 12:59:57 PDT 2011
[INFO] Final Memory: 75M/392M
[INFO] ------------------------------------------------------------------------
channel stopped


Mime
View raw message