aries-dev mailing list archives

Site index · List index
Message view « Date » · « Thread »
Top « Date » · « Thread »
From Apache Jenkins Server <jenk...@builds.apache.org>
Subject Build failed in Jenkins: Aries » Apache Aries Proxy Service #1064
Date Thu, 30 Jun 2011 12:51:40 GMT
See <https://builds.apache.org/job/Aries/org.apache.aries.proxy$org.apache.aries.proxy.impl/1064/changes>

Changes:

[mahrwald] ARIES-694: Make sure interface proxy classloader cache is invalidated when encountering
refreshed classes.

------------------------------------------
[INFO] ------------------------------------------------------------------------
[INFO] Building Apache Aries Proxy Service
[INFO]    task-segment: [clean, install]
[INFO] ------------------------------------------------------------------------
[INFO] [clean:clean {execution: default-clean}]
[INFO] Deleting file set: <https://builds.apache.org/job/Aries/org.apache.aries.proxy$org.apache.aries.proxy.impl/ws/target>
(included: [**], excluded: [])
[WARNING] POM for 'org.osgi:org.osgi.core:pom:4.3.0:compile' is invalid.

Its dependencies (if any) will NOT be available to the current build.
[INFO] snapshot org.apache.aries.proxy:org.apache.aries.proxy.api:0.4-SNAPSHOT: checking for
updates from codehaus.snapshots
[INFO] snapshot org.apache.aries.testsupport:org.apache.aries.testsupport.unit:0.3.1-SNAPSHOT:
checking for updates from codehaus.snapshots
[INFO] snapshot org.apache.aries.proxy:org.apache.aries.proxy.api:0.4-SNAPSHOT: checking for
updates from apache.snapshots
[INFO] snapshot org.apache.aries.testsupport:org.apache.aries.testsupport.unit:0.3.1-SNAPSHOT:
checking for updates from apache.snapshots
[INFO] [enforcer:enforce {execution: default}]
[INFO] [remote-resources:process {execution: default}]
[WARNING] POM for 'org.osgi:org.osgi.core:pom:4.3.0:compile' is invalid.

Its dependencies (if any) will NOT be available to the current build.
[WARNING] Invalid project model for artifact [org.osgi.core:org.osgi:4.3.0]. It will be ignored
by the remote resources Mojo.
[INFO] [resources:resources {execution: default-resources}]
[INFO] Using 'UTF-8' encoding to copy filtered resources.
[INFO] Copying 1 resource
[INFO] skip non existing resourceDirectory <https://builds.apache.org/job/Aries/org.apache.aries.proxy$org.apache.aries.proxy.impl/ws/src/main/filtered-resources>
[INFO] Copying 1 resource
[INFO] Copying 3 resources
[INFO] [compiler:compile {execution: default-compile}]
[INFO] Compiling 34 source files to <https://builds.apache.org/job/Aries/org.apache.aries.proxy$org.apache.aries.proxy.impl/ws/target/classes>
[INFO] [antrun:run {execution: default}]
[INFO] Executing tasks
   [delete] Deleting directory <https://builds.apache.org/job/Aries/org.apache.aries.proxy$org.apache.aries.proxy.impl/ws/target/classes/org/apache/aries/proxy/synthesizer>
[INFO] Executed tasks
[INFO] [resources:testResources {execution: default-testResources}]
[INFO] Using 'UTF-8' encoding to copy filtered resources.
[INFO] Copying 0 resource
[INFO] skip non existing resourceDirectory <https://builds.apache.org/job/Aries/org.apache.aries.proxy$org.apache.aries.proxy.impl/ws/src/test/filtered-resources>
[INFO] Copying 3 resources
[INFO] [compiler:testCompile {execution: default-testCompile}]
[INFO] Compiling 28 source files to <https://builds.apache.org/job/Aries/org.apache.aries.proxy$org.apache.aries.proxy.impl/ws/target/test-classes>
[JENKINS] Archiving <https://builds.apache.org/job/Aries/org.apache.aries.proxy$org.apache.aries.proxy.impl/ws/pom.xml>
to /home/hudson/hudson/jobs/Aries/modules/org.apache.aries.proxy$org.apache.aries.proxy.impl/builds/2011-06-30_12-51-00/archive/org.apache.aries.proxy/org.apache.aries.proxy.impl/0.4-SNAPSHOT/org.apache.aries.proxy.impl-0.4-SNAPSHOT.pom
[INFO] ------------------------------------------------------------------------
[ERROR] BUILD FAILURE
[INFO] ------------------------------------------------------------------------
[INFO] Compilation failure

<https://builds.apache.org/job/Aries/org.apache.aries.proxy$org.apache.aries.proxy.impl/ws/src/test/java/org/apache/aries/blueprint/proxy/InterfaceProxyingTest.java>:[48,23]
package com.ibm.jvm.util does not exist

<https://builds.apache.org/job/Aries/org.apache.aries.proxy$org.apache.aries.proxy.impl/ws/src/test/java/org/apache/aries/blueprint/proxy/InterfaceProxyingTest.java>:[218,10]
cannot find symbol
symbol  : class ByteArrayOutputStream
location: class org.apache.aries.blueprint.proxy.InterfaceProxyingTest.TestClassLoader

<https://builds.apache.org/job/Aries/org.apache.aries.proxy$org.apache.aries.proxy.impl/ws/src/test/java/org/apache/aries/blueprint/proxy/InterfaceProxyingTest.java>:[218,43]
cannot find symbol
symbol  : class ByteArrayOutputStream
location: class org.apache.aries.blueprint.proxy.InterfaceProxyingTest.TestClassLoader


[INFO] ------------------------------------------------------------------------
[INFO] Trace
org.apache.maven.BuildFailureException: Compilation failure
	at org.apache.maven.lifecycle.DefaultLifecycleExecutor.executeGoals(DefaultLifecycleExecutor.java:715)
	at org.apache.maven.lifecycle.DefaultLifecycleExecutor.executeGoalWithLifecycle(DefaultLifecycleExecutor.java:556)
	at org.apache.maven.lifecycle.DefaultLifecycleExecutor.executeGoal(DefaultLifecycleExecutor.java:535)
	at org.apache.maven.lifecycle.DefaultLifecycleExecutor.executeGoalAndHandleFailures(DefaultLifecycleExecutor.java:387)
	at org.apache.maven.lifecycle.DefaultLifecycleExecutor.executeTaskSegments(DefaultLifecycleExecutor.java:348)
	at org.apache.maven.lifecycle.DefaultLifecycleExecutor.execute(DefaultLifecycleExecutor.java:180)
	at org.apache.maven.lifecycle.LifecycleExecutorInterceptor.execute(LifecycleExecutorInterceptor.java:65)
	at org.apache.maven.DefaultMaven.doExecute(DefaultMaven.java:328)
	at org.apache.maven.DefaultMaven.execute(DefaultMaven.java:138)
	at org.apache.maven.cli.MavenCli.main(MavenCli.java:362)
	at sun.reflect.NativeMethodAccessorImpl.invoke0(Native Method)
	at sun.reflect.NativeMethodAccessorImpl.invoke(NativeMethodAccessorImpl.java:39)
	at sun.reflect.DelegatingMethodAccessorImpl.invoke(DelegatingMethodAccessorImpl.java:25)
	at java.lang.reflect.Method.invoke(Method.java:597)
	at org.codehaus.classworlds.Launcher.launchEnhanced(Launcher.java:315)
	at org.codehaus.classworlds.Launcher.launch(Launcher.java:255)
	at hudson.maven.agent.Main.launch(Main.java:185)
	at hudson.maven.MavenBuilder.call(MavenBuilder.java:164)
	at hudson.maven.MavenModuleSetBuild$Builder.call(MavenModuleSetBuild.java:987)
	at hudson.maven.MavenModuleSetBuild$Builder.call(MavenModuleSetBuild.java:918)
	at hudson.remoting.UserRequest.perform(UserRequest.java:118)
	at hudson.remoting.UserRequest.perform(UserRequest.java:48)
	at hudson.remoting.Request$2.run(Request.java:270)
	at java.util.concurrent.Executors$RunnableAdapter.call(Executors.java:441)
	at java.util.concurrent.FutureTask$Sync.innerRun(FutureTask.java:303)
	at java.util.concurrent.FutureTask.run(FutureTask.java:138)
	at java.util.concurrent.ThreadPoolExecutor$Worker.runTask(ThreadPoolExecutor.java:886)
	at java.util.concurrent.ThreadPoolExecutor$Worker.run(ThreadPoolExecutor.java:908)
	at java.lang.Thread.run(Thread.java:619)
Caused by: org.apache.maven.plugin.CompilationFailureException: Compilation failure
	at org.apache.maven.plugin.AbstractCompilerMojo.execute(AbstractCompilerMojo.java:516)
	at org.apache.maven.plugin.TestCompilerMojo.execute(TestCompilerMojo.java:102)
	at org.apache.maven.plugin.DefaultPluginManager.executeMojo(DefaultPluginManager.java:490)
	at hudson.maven.agent.PluginManagerInterceptor.executeMojo(PluginManagerInterceptor.java:182)
	at org.apache.maven.lifecycle.DefaultLifecycleExecutor.executeGoals(DefaultLifecycleExecutor.java:694)
	... 28 more
[INFO] ------------------------------------------------------------------------
[INFO] Total time: 31 seconds
[INFO] Finished at: Thu Jun 30 12:51:01 UTC 2011
[INFO] Final Memory: 108M/431M
[INFO] ------------------------------------------------------------------------


Mime
View raw message