aries-dev mailing list archives

Site index · List index
Message view « Date » · « Thread »
Top « Date » · « Thread »
From Apache Jenkins Server <jenk...@builds.apache.org>
Subject Build failed in Jenkins: Aries » Apache Aries Proxy Service Dependencies #1053
Date Tue, 21 Jun 2011 19:54:33 GMT
See <https://builds.apache.org/job/Aries/org.apache.aries.proxy$org.apache.aries.proxy.tmp/1053/>

------------------------------------------
[INFO] ------------------------------------------------------------------------
[INFO] Building Apache Aries Proxy Service Dependencies
[INFO]    task-segment: [clean, install]
[INFO] ------------------------------------------------------------------------
[INFO] [clean:clean {execution: default-clean}]
[INFO] Deleting file set: <https://builds.apache.org/job/Aries/org.apache.aries.proxy$org.apache.aries.proxy.tmp/ws/target>
(included: [**], excluded: [])
[INFO] [enforcer:enforce {execution: default}]
[INFO] [remote-resources:process {execution: default}]
[INFO] [antrun:run {execution: default}]
[INFO] Executing tasks
    [mkdir] Created dir: <https://builds.apache.org/job/Aries/org.apache.aries.proxy$org.apache.aries.proxy.tmp/ws/target/downloaded>
      [get] Getting: http://download.eclipse.org/equinox/drops/S-3.7M6-201103101119/org.eclipse.osgi_3.7.0.v20110304.jar
      [get] To: <https://builds.apache.org/job/Aries/org.apache.aries.proxy$org.apache.aries.proxy.tmp/ws/target/downloaded/org.eclipse.osgi_3.7.0.jar>
      [get] Error opening connection java.io.FileNotFoundException: http://download.eclipse.org/equinox/drops/S-3.7M6-201103101119/org.eclipse.osgi_3.7.0.v20110304.jar
      [get] Error opening connection java.io.FileNotFoundException: http://download.eclipse.org/equinox/drops/S-3.7M6-201103101119/org.eclipse.osgi_3.7.0.v20110304.jar
      [get] Error opening connection java.io.FileNotFoundException: http://download.eclipse.org/equinox/drops/S-3.7M6-201103101119/org.eclipse.osgi_3.7.0.v20110304.jar
      [get] Can't get http://download.eclipse.org/equinox/drops/S-3.7M6-201103101119/org.eclipse.osgi_3.7.0.v20110304.jar
to <https://builds.apache.org/job/Aries/org.apache.aries.proxy$org.apache.aries.proxy.tmp/ws/target/downloaded/org.eclipse.osgi_3.7.0.jar>
[JENKINS] Archiving <https://builds.apache.org/job/Aries/org.apache.aries.proxy$org.apache.aries.proxy.tmp/ws/pom.xml>
to /home/hudson/hudson/jobs/Aries/modules/org.apache.aries.proxy$org.apache.aries.proxy.tmp/builds/2011-06-21_19-51-55/archive/org.apache.aries.proxy/org.apache.aries.proxy.tmp/0.4-SNAPSHOT/org.apache.aries.proxy.tmp-0.4-SNAPSHOT.pom
[INFO] ------------------------------------------------------------------------
[ERROR] BUILD ERROR
[INFO] ------------------------------------------------------------------------
[INFO] An Ant BuildException has occured: Can't get http://download.eclipse.org/equinox/drops/S-3.7M6-201103101119/org.eclipse.osgi_3.7.0.v20110304.jar
to <https://builds.apache.org/job/Aries/org.apache.aries.proxy$org.apache.aries.proxy.tmp/ws/target/downloaded/org.eclipse.osgi_3.7.0.jar>

[INFO] ------------------------------------------------------------------------
[INFO] Trace
org.apache.maven.lifecycle.LifecycleExecutionException: An Ant BuildException has occured:
Can't get http://download.eclipse.org/equinox/drops/S-3.7M6-201103101119/org.eclipse.osgi_3.7.0.v20110304.jar
to <https://builds.apache.org/job/Aries/org.apache.aries.proxy$org.apache.aries.proxy.tmp/ws/target/downloaded/org.eclipse.osgi_3.7.0.jar>
	at org.apache.maven.lifecycle.DefaultLifecycleExecutor.executeGoals(DefaultLifecycleExecutor.java:719)
	at org.apache.maven.lifecycle.DefaultLifecycleExecutor.executeGoalWithLifecycle(DefaultLifecycleExecutor.java:556)
	at org.apache.maven.lifecycle.DefaultLifecycleExecutor.executeGoal(DefaultLifecycleExecutor.java:535)
	at org.apache.maven.lifecycle.DefaultLifecycleExecutor.executeGoalAndHandleFailures(DefaultLifecycleExecutor.java:387)
	at org.apache.maven.lifecycle.DefaultLifecycleExecutor.executeTaskSegments(DefaultLifecycleExecutor.java:348)
	at org.apache.maven.lifecycle.DefaultLifecycleExecutor.execute(DefaultLifecycleExecutor.java:180)
	at org.apache.maven.lifecycle.LifecycleExecutorInterceptor.execute(LifecycleExecutorInterceptor.java:65)
	at org.apache.maven.DefaultMaven.doExecute(DefaultMaven.java:328)
	at org.apache.maven.DefaultMaven.execute(DefaultMaven.java:138)
	at org.apache.maven.cli.MavenCli.main(MavenCli.java:362)
	at sun.reflect.NativeMethodAccessorImpl.invoke0(Native Method)
	at sun.reflect.NativeMethodAccessorImpl.invoke(NativeMethodAccessorImpl.java:39)
	at sun.reflect.DelegatingMethodAccessorImpl.invoke(DelegatingMethodAccessorImpl.java:25)
	at java.lang.reflect.Method.invoke(Method.java:597)
	at org.codehaus.classworlds.Launcher.launchEnhanced(Launcher.java:315)
	at org.codehaus.classworlds.Launcher.launch(Launcher.java:255)
	at hudson.maven.agent.Main.launch(Main.java:185)
	at hudson.maven.MavenBuilder.call(MavenBuilder.java:164)
	at hudson.maven.MavenModuleSetBuild$Builder.call(MavenModuleSetBuild.java:987)
	at hudson.maven.MavenModuleSetBuild$Builder.call(MavenModuleSetBuild.java:918)
	at hudson.remoting.UserRequest.perform(UserRequest.java:118)
	at hudson.remoting.UserRequest.perform(UserRequest.java:48)
	at hudson.remoting.Request$2.run(Request.java:270)
	at java.util.concurrent.Executors$RunnableAdapter.call(Executors.java:441)
	at java.util.concurrent.FutureTask$Sync.innerRun(FutureTask.java:303)
	at java.util.concurrent.FutureTask.run(FutureTask.java:138)
	at java.util.concurrent.ThreadPoolExecutor$Worker.runTask(ThreadPoolExecutor.java:886)
	at java.util.concurrent.ThreadPoolExecutor$Worker.run(ThreadPoolExecutor.java:908)
	at java.lang.Thread.run(Thread.java:619)
Caused by: org.apache.maven.plugin.MojoExecutionException: An Ant BuildException has occured:
Can't get http://download.eclipse.org/equinox/drops/S-3.7M6-201103101119/org.eclipse.osgi_3.7.0.v20110304.jar
to <https://builds.apache.org/job/Aries/org.apache.aries.proxy$org.apache.aries.proxy.tmp/ws/target/downloaded/org.eclipse.osgi_3.7.0.jar>
	at org.apache.maven.plugin.antrun.AbstractAntMojo.executeTasks(AbstractAntMojo.java:131)
	at org.apache.maven.plugin.antrun.AntRunMojo.execute(AntRunMojo.java:98)
	at org.apache.maven.plugin.DefaultPluginManager.executeMojo(DefaultPluginManager.java:490)
	at hudson.maven.agent.PluginManagerInterceptor.executeMojo(PluginManagerInterceptor.java:182)
	at org.apache.maven.lifecycle.DefaultLifecycleExecutor.executeGoals(DefaultLifecycleExecutor.java:694)
	... 28 more
Caused by: Can't get http://download.eclipse.org/equinox/drops/S-3.7M6-201103101119/org.eclipse.osgi_3.7.0.v20110304.jar
to <https://builds.apache.org/job/Aries/org.apache.aries.proxy$org.apache.aries.proxy.tmp/ws/target/downloaded/org.eclipse.osgi_3.7.0.jar>
	at org.apache.tools.ant.taskdefs.Get.doGet(Get.java:199)
	at org.apache.tools.ant.taskdefs.Get.execute(Get.java:78)
	at org.apache.tools.ant.UnknownElement.execute(UnknownElement.java:288)
	at sun.reflect.NativeMethodAccessorImpl.invoke0(Native Method)
	at sun.reflect.NativeMethodAccessorImpl.invoke(NativeMethodAccessorImpl.java:39)
	at sun.reflect.DelegatingMethodAccessorImpl.invoke(DelegatingMethodAccessorImpl.java:25)
	at java.lang.reflect.Method.invoke(Method.java:597)
	at org.apache.tools.ant.dispatch.DispatchUtils.execute(DispatchUtils.java:106)
	at org.apache.tools.ant.Task.perform(Task.java:348)
	at org.apache.tools.ant.Target.execute(Target.java:357)
	at org.apache.maven.plugin.antrun.AbstractAntMojo.executeTasks(AbstractAntMojo.java:118)
	... 32 more
[INFO] ------------------------------------------------------------------------
[INFO] Total time: 59 seconds
[INFO] Finished at: Tue Jun 21 19:54:31 UTC 2011
[INFO] Final Memory: 98M/403M
[INFO] ------------------------------------------------------------------------


Mime
View raw message