aries-dev mailing list archives

Site index · List index
Message view « Date » · « Thread »
Top « Date » · « Thread »
From Apache Jenkins Server <jenk...@builds.apache.org>
Subject Build failed in Jenkins: Aries #1083
Date Fri, 08 Jul 2011 00:05:15 GMT
See <https://builds.apache.org/job/Aries/1083/changes>

Changes:

[mahrwald] ARIES-691: Fix NullPointer in getting classloader for resolved bundle on Felix

------------------------------------------
[...truncated 4618 lines...]
[INFO] Building Apache Aries JMX Blueprint Bundle
[INFO]    task-segment: [clean, install]
[INFO] ------------------------------------------------------------------------
[INFO] [clean:clean {execution: default-clean}]
[INFO] Deleting file set: <https://builds.apache.org/job/Aries/ws/aries/jmx/jmx-blueprint-bundle/target>
(included: [**], excluded: [])
[INFO] snapshot org.apache.aries.jmx:org.apache.aries.jmx.blueprint.core:0.3.1-SNAPSHOT: checking
for updates from codehaus.snapshots
[INFO] snapshot org.apache.aries.jmx:org.apache.aries.jmx.blueprint.core:0.3.1-SNAPSHOT: checking
for updates from apache.snapshots
[INFO] [enforcer:enforce {execution: default}]
[INFO] [remote-resources:process {execution: default}]
[INFO] [resources:resources {execution: default-resources}]
[INFO] Using 'UTF-8' encoding to copy filtered resources.
[INFO] skip non existing resourceDirectory <https://builds.apache.org/job/Aries/ws/aries/jmx/jmx-blueprint-bundle/src/main/resources>
[INFO] skip non existing resourceDirectory <https://builds.apache.org/job/Aries/ws/aries/jmx/jmx-blueprint-bundle/src/main/filtered-resources>
[INFO] skip non existing resourceDirectory <https://builds.apache.org/job/Aries/ws/aries/jmx/jmx-blueprint-bundle/src/main/java>
[INFO] Copying 3 resources
[INFO] [compiler:compile {execution: default-compile}]
[INFO] No sources to compile
[INFO] [resources:testResources {execution: default-testResources}]
[INFO] Using 'UTF-8' encoding to copy filtered resources.
[INFO] skip non existing resourceDirectory <https://builds.apache.org/job/Aries/ws/aries/jmx/jmx-blueprint-bundle/src/test/resources>
[INFO] skip non existing resourceDirectory <https://builds.apache.org/job/Aries/ws/aries/jmx/jmx-blueprint-bundle/src/test/filtered-resources>
[INFO] Copying 3 resources
[INFO] [compiler:testCompile {execution: default-testCompile}]
[INFO] No sources to compile
[INFO] [surefire:test {execution: default-test}]
[INFO] Surefire report directory: <https://builds.apache.org/job/Aries/ws/aries/jmx/jmx-blueprint-bundle/target/surefire-reports>

-------------------------------------------------------
 T E S T S
-------------------------------------------------------
There are no tests to run.

Results :

Tests run: 0, Failures: 0, Errors: 0, Skipped: 0

[JENKINS] Recording test results[INFO] [bundle:bundle {execution: default-bundle}]

[WARNING] Warning building bundle org.apache.aries.jmx:org.apache.aries.jmx.blueprint:bundle:0.3.1-SNAPSHOT
: Did not find matching referal for !org.apache.aries.jmx*
[INFO] [shade:shade {execution: default}]
[INFO] Including org.apache.aries.jmx:org.apache.aries.jmx.blueprint.api:jar:0.3.1-SNAPSHOT
in the shaded jar.
[INFO] Including org.apache.aries.jmx:org.apache.aries.jmx.blueprint.core:jar:0.3.1-SNAPSHOT
in the shaded jar.
[INFO] Excluding org.apache.aries:org.apache.aries.util:jar:0.4-SNAPSHOT from the shaded jar.
[WARNING] We have a duplicate org/apache/aries/jmx/blueprint/BlueprintMetadataMBean.class
in /home/hudson/.m2/repository/org/apache/aries/jmx/org.apache.aries.jmx.blueprint.api/0.3.1-SNAPSHOT/org.apache.aries.jmx.blueprint.api-0.3.1-SNAPSHOT.jar
[WARNING] We have a duplicate org/apache/aries/jmx/blueprint/BlueprintStateMBean.class in
/home/hudson/.m2/repository/org/apache/aries/jmx/org.apache.aries.jmx.blueprint.api/0.3.1-SNAPSHOT/org.apache.aries.jmx.blueprint.api-0.3.1-SNAPSHOT.jar
[WARNING] We have a duplicate org/apache/aries/jmx/blueprint/Item.class in /home/hudson/.m2/repository/org/apache/aries/jmx/org.apache.aries.jmx.blueprint.api/0.3.1-SNAPSHOT/org.apache.aries.jmx.blueprint.api-0.3.1-SNAPSHOT.jar
[WARNING] We have a duplicate org/apache/aries/jmx/blueprint/JmxConstants.class in /home/hudson/.m2/repository/org/apache/aries/jmx/org.apache.aries.jmx.blueprint.api/0.3.1-SNAPSHOT/org.apache.aries.jmx.blueprint.api-0.3.1-SNAPSHOT.jar
[WARNING] We have a duplicate org/apache/aries/jmx/blueprint/codec/BPBeanArgument.class in
/home/hudson/.m2/repository/org/apache/aries/jmx/org.apache.aries.jmx.blueprint.core/0.3.1-SNAPSHOT/org.apache.aries.jmx.blueprint.core-0.3.1-SNAPSHOT.jar
[WARNING] We have a duplicate org/apache/aries/jmx/blueprint/codec/BPBeanMetadata.class in
/home/hudson/.m2/repository/org/apache/aries/jmx/org.apache.aries.jmx.blueprint.core/0.3.1-SNAPSHOT/org.apache.aries.jmx.blueprint.core-0.3.1-SNAPSHOT.jar
[WARNING] We have a duplicate org/apache/aries/jmx/blueprint/codec/BPBeanProperty.class in
/home/hudson/.m2/repository/org/apache/aries/jmx/org.apache.aries.jmx.blueprint.core/0.3.1-SNAPSHOT/org.apache.aries.jmx.blueprint.core-0.3.1-SNAPSHOT.jar
[WARNING] We have a duplicate org/apache/aries/jmx/blueprint/codec/BPCollectionMetadata.class
in /home/hudson/.m2/repository/org/apache/aries/jmx/org.apache.aries.jmx.blueprint.core/0.3.1-SNAPSHOT/org.apache.aries.jmx.blueprint.core-0.3.1-SNAPSHOT.jar
[WARNING] We have a duplicate org/apache/aries/jmx/blueprint/codec/BPComponentMetadata.class
in /home/hudson/.m2/repository/org/apache/aries/jmx/org.apache.aries.jmx.blueprint.core/0.3.1-SNAPSHOT/org.apache.aries.jmx.blueprint.core-0.3.1-SNAPSHOT.jar
[WARNING] We have a duplicate org/apache/aries/jmx/blueprint/codec/BPIdRefMetadata.class in
/home/hudson/.m2/repository/org/apache/aries/jmx/org.apache.aries.jmx.blueprint.core/0.3.1-SNAPSHOT/org.apache.aries.jmx.blueprint.core-0.3.1-SNAPSHOT.jar
[WARNING] We have a duplicate org/apache/aries/jmx/blueprint/codec/BPMapEntry.class in /home/hudson/.m2/repository/org/apache/aries/jmx/org.apache.aries.jmx.blueprint.core/0.3.1-SNAPSHOT/org.apache.aries.jmx.blueprint.core-0.3.1-SNAPSHOT.jar
[WARNING] We have a duplicate org/apache/aries/jmx/blueprint/codec/BPMapMetadata.class in
/home/hudson/.m2/repository/org/apache/aries/jmx/org.apache.aries.jmx.blueprint.core/0.3.1-SNAPSHOT/org.apache.aries.jmx.blueprint.core-0.3.1-SNAPSHOT.jar
[WARNING] We have a duplicate org/apache/aries/jmx/blueprint/codec/BPMetadata.class in /home/hudson/.m2/repository/org/apache/aries/jmx/org.apache.aries.jmx.blueprint.core/0.3.1-SNAPSHOT/org.apache.aries.jmx.blueprint.core-0.3.1-SNAPSHOT.jar
[WARNING] We have a duplicate org/apache/aries/jmx/blueprint/codec/BPNonNullMetadata.class
in /home/hudson/.m2/repository/org/apache/aries/jmx/org.apache.aries.jmx.blueprint.core/0.3.1-SNAPSHOT/org.apache.aries.jmx.blueprint.core-0.3.1-SNAPSHOT.jar
[WARNING] We have a duplicate org/apache/aries/jmx/blueprint/codec/BPNullMetadata.class in
/home/hudson/.m2/repository/org/apache/aries/jmx/org.apache.aries.jmx.blueprint.core/0.3.1-SNAPSHOT/org.apache.aries.jmx.blueprint.core-0.3.1-SNAPSHOT.jar
[WARNING] We have a duplicate org/apache/aries/jmx/blueprint/codec/BPPropsMetadata.class in
/home/hudson/.m2/repository/org/apache/aries/jmx/org.apache.aries.jmx.blueprint.core/0.3.1-SNAPSHOT/org.apache.aries.jmx.blueprint.core-0.3.1-SNAPSHOT.jar
[WARNING] We have a duplicate org/apache/aries/jmx/blueprint/codec/BPRefMetadata.class in
/home/hudson/.m2/repository/org/apache/aries/jmx/org.apache.aries.jmx.blueprint.core/0.3.1-SNAPSHOT/org.apache.aries.jmx.blueprint.core-0.3.1-SNAPSHOT.jar
[WARNING] We have a duplicate org/apache/aries/jmx/blueprint/codec/BPReferenceListMetadata.class
in /home/hudson/.m2/repository/org/apache/aries/jmx/org.apache.aries.jmx.blueprint.core/0.3.1-SNAPSHOT/org.apache.aries.jmx.blueprint.core-0.3.1-SNAPSHOT.jar
[WARNING] We have a duplicate org/apache/aries/jmx/blueprint/codec/BPReferenceListener.class
in /home/hudson/.m2/repository/org/apache/aries/jmx/org.apache.aries.jmx.blueprint.core/0.3.1-SNAPSHOT/org.apache.aries.jmx.blueprint.core-0.3.1-SNAPSHOT.jar
[WARNING] We have a duplicate org/apache/aries/jmx/blueprint/codec/BPReferenceMetadata.class
in /home/hudson/.m2/repository/org/apache/aries/jmx/org.apache.aries.jmx.blueprint.core/0.3.1-SNAPSHOT/org.apache.aries.jmx.blueprint.core-0.3.1-SNAPSHOT.jar
[WARNING] We have a duplicate org/apache/aries/jmx/blueprint/codec/BPRegistrationListener.class
in /home/hudson/.m2/repository/org/apache/aries/jmx/org.apache.aries.jmx.blueprint.core/0.3.1-SNAPSHOT/org.apache.aries.jmx.blueprint.core-0.3.1-SNAPSHOT.jar
[WARNING] We have a duplicate org/apache/aries/jmx/blueprint/codec/BPServiceMetadata.class
in /home/hudson/.m2/repository/org/apache/aries/jmx/org.apache.aries.jmx.blueprint.core/0.3.1-SNAPSHOT/org.apache.aries.jmx.blueprint.core-0.3.1-SNAPSHOT.jar
[WARNING] We have a duplicate org/apache/aries/jmx/blueprint/codec/BPServiceReferenceMetadata.class
in /home/hudson/.m2/repository/org/apache/aries/jmx/org.apache.aries.jmx.blueprint.core/0.3.1-SNAPSHOT/org.apache.aries.jmx.blueprint.core-0.3.1-SNAPSHOT.jar
[WARNING] We have a duplicate org/apache/aries/jmx/blueprint/codec/BPTarget.class in /home/hudson/.m2/repository/org/apache/aries/jmx/org.apache.aries.jmx.blueprint.core/0.3.1-SNAPSHOT/org.apache.aries.jmx.blueprint.core-0.3.1-SNAPSHOT.jar
[WARNING] We have a duplicate org/apache/aries/jmx/blueprint/codec/BPValueMetadata.class in
/home/hudson/.m2/repository/org/apache/aries/jmx/org.apache.aries.jmx.blueprint.core/0.3.1-SNAPSHOT/org.apache.aries.jmx.blueprint.core-0.3.1-SNAPSHOT.jar
[WARNING] We have a duplicate org/apache/aries/jmx/blueprint/codec/OSGiBlueprintEvent.class
in /home/hudson/.m2/repository/org/apache/aries/jmx/org.apache.aries.jmx.blueprint.core/0.3.1-SNAPSHOT/org.apache.aries.jmx.blueprint.core-0.3.1-SNAPSHOT.jar
[WARNING] We have a duplicate org/apache/aries/jmx/blueprint/codec/TransferObject.class in
/home/hudson/.m2/repository/org/apache/aries/jmx/org.apache.aries.jmx.blueprint.core/0.3.1-SNAPSHOT/org.apache.aries.jmx.blueprint.core-0.3.1-SNAPSHOT.jar
[WARNING] We have a duplicate org/apache/aries/jmx/blueprint/codec/Util.class in /home/hudson/.m2/repository/org/apache/aries/jmx/org.apache.aries.jmx.blueprint.core/0.3.1-SNAPSHOT/org.apache.aries.jmx.blueprint.core-0.3.1-SNAPSHOT.jar
[WARNING] We have a duplicate org/apache/aries/jmx/blueprint/impl/Activator$1.class in /home/hudson/.m2/repository/org/apache/aries/jmx/org.apache.aries.jmx.blueprint.core/0.3.1-SNAPSHOT/org.apache.aries.jmx.blueprint.core-0.3.1-SNAPSHOT.jar
[WARNING] We have a duplicate org/apache/aries/jmx/blueprint/impl/Activator$2.class in /home/hudson/.m2/repository/org/apache/aries/jmx/org.apache.aries.jmx.blueprint.core/0.3.1-SNAPSHOT/org.apache.aries.jmx.blueprint.core-0.3.1-SNAPSHOT.jar
[WARNING] We have a duplicate org/apache/aries/jmx/blueprint/impl/Activator$MBeanServerServiceTracker.class
in /home/hudson/.m2/repository/org/apache/aries/jmx/org.apache.aries.jmx.blueprint.core/0.3.1-SNAPSHOT/org.apache.aries.jmx.blueprint.core-0.3.1-SNAPSHOT.jar
[WARNING] We have a duplicate org/apache/aries/jmx/blueprint/impl/Activator.class in /home/hudson/.m2/repository/org/apache/aries/jmx/org.apache.aries.jmx.blueprint.core/0.3.1-SNAPSHOT/org.apache.aries.jmx.blueprint.core-0.3.1-SNAPSHOT.jar
[WARNING] We have a duplicate org/apache/aries/jmx/blueprint/impl/BlueprintMetadata.class
in /home/hudson/.m2/repository/org/apache/aries/jmx/org.apache.aries.jmx.blueprint.core/0.3.1-SNAPSHOT/org.apache.aries.jmx.blueprint.core-0.3.1-SNAPSHOT.jar
[WARNING] We have a duplicate org/apache/aries/jmx/blueprint/impl/BlueprintState$1.class in
/home/hudson/.m2/repository/org/apache/aries/jmx/org.apache.aries.jmx.blueprint.core/0.3.1-SNAPSHOT/org.apache.aries.jmx.blueprint.core-0.3.1-SNAPSHOT.jar
[WARNING] We have a duplicate org/apache/aries/jmx/blueprint/impl/BlueprintState$BlueprintStateListener.class
in /home/hudson/.m2/repository/org/apache/aries/jmx/org.apache.aries.jmx.blueprint.core/0.3.1-SNAPSHOT/org.apache.aries.jmx.blueprint.core-0.3.1-SNAPSHOT.jar
[WARNING] We have a duplicate org/apache/aries/jmx/blueprint/impl/BlueprintState$JMXThreadFactory.class
in /home/hudson/.m2/repository/org/apache/aries/jmx/org.apache.aries.jmx.blueprint.core/0.3.1-SNAPSHOT/org.apache.aries.jmx.blueprint.core-0.3.1-SNAPSHOT.jar
[WARNING] We have a duplicate org/apache/aries/jmx/blueprint/impl/BlueprintState.class in
/home/hudson/.m2/repository/org/apache/aries/jmx/org.apache.aries.jmx.blueprint.core/0.3.1-SNAPSHOT/org.apache.aries.jmx.blueprint.core-0.3.1-SNAPSHOT.jar
[WARNING] We have a duplicate org/apache/aries/jmx/blueprint/impl/RegistrableStandardEmitterMBean.class
in /home/hudson/.m2/repository/org/apache/aries/jmx/org.apache.aries.jmx.blueprint.core/0.3.1-SNAPSHOT/org.apache.aries.jmx.blueprint.core-0.3.1-SNAPSHOT.jar
[INFO] Replacing original artifact with shaded artifact.
[INFO] Replacing <https://builds.apache.org/job/Aries/ws/aries/jmx/jmx-blueprint-bundle/target/org.apache.aries.jmx.blueprint-0.3.1-SNAPSHOT.jar>
with <https://builds.apache.org/job/Aries/ws/aries/jmx/jmx-blueprint-bundle/target/org.apache.aries.jmx.blueprint-0.3.1-SNAPSHOT-shaded.jar>
[INFO] [ianal:verify-legal-files {execution: default}]
[INFO] Checking legal files in: org.apache.aries.jmx.blueprint-0.3.1-SNAPSHOT.jar
[INFO] [install:install {execution: default-install}]
[INFO] Installing <https://builds.apache.org/job/Aries/ws/aries/jmx/jmx-blueprint-bundle/target/org.apache.aries.jmx.blueprint-0.3.1-SNAPSHOT.jar>
to /home/hudson/.m2/repository/org/apache/aries/jmx/org.apache.aries.jmx.blueprint/0.3.1-SNAPSHOT/org.apache.aries.jmx.blueprint-0.3.1-SNAPSHOT.jar
[INFO] [bundle:install {execution: default-install}]
[INFO] Installing org/apache/aries/jmx/org.apache.aries.jmx.blueprint/0.3.1-SNAPSHOT/org.apache.aries.jmx.blueprint-0.3.1-SNAPSHOT.jar
[INFO] Writing OBR metadata
[JENKINS] Archiving <https://builds.apache.org/job/Aries/ws/aries/jmx/jmx-blueprint-bundle/dependency-reduced-pom.xml>
to /home/hudson/hudson/jobs/Aries/modules/org.apache.aries.jmx$org.apache.aries.jmx.blueprint/builds/2011-07-07_23-51-39/archive/org.apache.aries.jmx/org.apache.aries.jmx.blueprint/0.3.1-SNAPSHOT/org.apache.aries.jmx.blueprint-0.3.1-SNAPSHOT.pom
[JENKINS] Archiving <https://builds.apache.org/job/Aries/ws/aries/jmx/jmx-blueprint-bundle/target/org.apache.aries.jmx.blueprint-0.3.1-SNAPSHOT.jar>
to /home/hudson/hudson/jobs/Aries/modules/org.apache.aries.jmx$org.apache.aries.jmx.blueprint/builds/2011-07-07_23-51-39/archive/org.apache.aries.jmx/org.apache.aries.jmx.blueprint/0.3.1-SNAPSHOT/org.apache.aries.jmx.blueprint-0.3.1-SNAPSHOT.jar
[INFO] ------------------------------------------------------------------------
[INFO] Building Apache Aries JMX integration tests
[INFO]    task-segment: [clean, install]
[INFO] ------------------------------------------------------------------------
[INFO] [clean:clean {execution: default-clean}]
[INFO] Deleting file set: <https://builds.apache.org/job/Aries/ws/aries/jmx/jmx-itests/target>
(included: [**], excluded: [])
[INFO] snapshot org.apache.aries.jmx:org.apache.aries.jmx.core.whiteboard:0.3.1-SNAPSHOT:
checking for updates from codehaus.snapshots
[INFO] snapshot org.apache.aries.jmx:org.apache.aries.jmx.core.whiteboard:0.3.1-SNAPSHOT:
checking for updates from apache.snapshots
Downloading: http://snapshots.repository.codehaus.org/org/apache/aries/jmx/org.apache.aries.jmx.core.whiteboard/0.3.1-SNAPSHOT/org.apache.aries.jmx.core.whiteboard-0.3.1-SNAPSHOT.pom
[INFO] Unable to find resource 'org.apache.aries.jmx:org.apache.aries.jmx.core.whiteboard:pom:0.3.1-SNAPSHOT'
in repository codehaus.snapshots (http://snapshots.repository.codehaus.org)
Downloading: http://repository.apache.org/snapshots/org/apache/aries/jmx/org.apache.aries.jmx.core.whiteboard/0.3.1-SNAPSHOT/org.apache.aries.jmx.core.whiteboard-0.3.1-SNAPSHOT.pom
[INFO] Unable to find resource 'org.apache.aries.jmx:org.apache.aries.jmx.core.whiteboard:pom:0.3.1-SNAPSHOT'
in repository apache.snapshots (http://repository.apache.org/snapshots)
[INFO] snapshot org.apache.aries.jmx:org.apache.aries.jmx:0.3.1-SNAPSHOT: checking for updates
from codehaus.snapshots
[INFO] snapshot org.apache.aries.jmx:org.apache.aries.jmx:0.3.1-SNAPSHOT: checking for updates
from apache.snapshots
[INFO] snapshot org.apache.aries.jmx:org.apache.aries.jmx.blueprint:0.3.1-SNAPSHOT: checking
for updates from codehaus.snapshots
[INFO] snapshot org.apache.aries.jmx:org.apache.aries.jmx.blueprint:0.3.1-SNAPSHOT: checking
for updates from apache.snapshots
[INFO] snapshot org.apache.aries.jmx:org.apache.aries.jmx.whiteboard:0.3.1-SNAPSHOT: checking
for updates from codehaus.snapshots
[INFO] snapshot org.apache.aries.jmx:org.apache.aries.jmx.whiteboard:0.3.1-SNAPSHOT: checking
for updates from apache.snapshots
Downloading: http://snapshots.repository.codehaus.org/org/apache/aries/jmx/org.apache.aries.jmx.core.whiteboard/0.3.1-SNAPSHOT/org.apache.aries.jmx.core.whiteboard-0.3.1-SNAPSHOT.jar
[INFO] Unable to find resource 'org.apache.aries.jmx:org.apache.aries.jmx.core.whiteboard:jar:0.3.1-SNAPSHOT'
in repository codehaus.snapshots (http://snapshots.repository.codehaus.org)
Downloading: http://repository.apache.org/snapshots/org/apache/aries/jmx/org.apache.aries.jmx.core.whiteboard/0.3.1-SNAPSHOT/org.apache.aries.jmx.core.whiteboard-0.3.1-SNAPSHOT.jar
[INFO] Unable to find resource 'org.apache.aries.jmx:org.apache.aries.jmx.core.whiteboard:jar:0.3.1-SNAPSHOT'
in repository apache.snapshots (http://repository.apache.org/snapshots)
[JENKINS] Archiving <https://builds.apache.org/job/Aries/ws/aries/jmx/jmx-itests/pom.xml>
to /home/hudson/hudson/jobs/Aries/modules/org.apache.aries.jmx$org.apache.aries.jmx.itests/builds/2011-07-07_23-51-39/archive/org.apache.aries.jmx/org.apache.aries.jmx.itests/0.3.1-SNAPSHOT/org.apache.aries.jmx.itests-0.3.1-SNAPSHOT.pom
[INFO] ------------------------------------------------------------------------
[ERROR] BUILD ERROR
[INFO] ------------------------------------------------------------------------
[INFO] Failed to resolve artifact.

Missing:
----------
1) org.apache.aries.jmx:org.apache.aries.jmx.core.whiteboard:jar:0.3.1-SNAPSHOT

  Try downloading the file manually from the project website.

  Then, install it using the command: 
      mvn install:install-file -DgroupId=org.apache.aries.jmx -DartifactId=org.apache.aries.jmx.core.whiteboard
-Dversion=0.3.1-SNAPSHOT -Dpackaging=jar -Dfile=/path/to/file

  Alternatively, if you host your own repository you can deploy the file there: 
      mvn deploy:deploy-file -DgroupId=org.apache.aries.jmx -DartifactId=org.apache.aries.jmx.core.whiteboard
-Dversion=0.3.1-SNAPSHOT -Dpackaging=jar -Dfile=/path/to/file -Durl=[url] -DrepositoryId=[id]

  Path to dependency: 
  	1) org.apache.aries.jmx:org.apache.aries.jmx.itests:jar:0.3.1-SNAPSHOT
  	2) org.apache.aries.jmx:org.apache.aries.jmx.core.whiteboard:jar:0.3.1-SNAPSHOT

----------
1 required artifact is missing.

for artifact: 
  org.apache.aries.jmx:org.apache.aries.jmx.itests:jar:0.3.1-SNAPSHOT

from the specified remote repositories:
  codehaus.snapshots (http://snapshots.repository.codehaus.org),
  central (http://repo1.maven.org/maven2),
  Nexus (http://repository.apache.org/snapshots)



[INFO] ------------------------------------------------------------------------
[INFO] Trace
org.apache.maven.lifecycle.LifecycleExecutionException: Missing:
----------
1) org.apache.aries.jmx:org.apache.aries.jmx.core.whiteboard:jar:0.3.1-SNAPSHOT

  Try downloading the file manually from the project website.

  Then, install it using the command: 
      mvn install:install-file -DgroupId=org.apache.aries.jmx -DartifactId=org.apache.aries.jmx.core.whiteboard
-Dversion=0.3.1-SNAPSHOT -Dpackaging=jar -Dfile=/path/to/file

  Alternatively, if you host your own repository you can deploy the file there: 
      mvn deploy:deploy-file -DgroupId=org.apache.aries.jmx -DartifactId=org.apache.aries.jmx.core.whiteboard
-Dversion=0.3.1-SNAPSHOT -Dpackaging=jar -Dfile=/path/to/file -Durl=[url] -DrepositoryId=[id]

  Path to dependency: 
  	1) org.apache.aries.jmx:org.apache.aries.jmx.itests:jar:0.3.1-SNAPSHOT
  	2) org.apache.aries.jmx:org.apache.aries.jmx.core.whiteboard:jar:0.3.1-SNAPSHOT

----------
1 required artifact is missing.

for artifact: 
  org.apache.aries.jmx:org.apache.aries.jmx.itests:jar:0.3.1-SNAPSHOT

from the specified remote repositories:
  codehaus.snapshots (http://snapshots.repository.codehaus.org),
  central (http://repo1.maven.org/maven2),
  Nexus (http://repository.apache.org/snapshots)


	at org.apache.maven.lifecycle.DefaultLifecycleExecutor.executeGoals(DefaultLifecycleExecutor.java:711)
	at org.apache.maven.lifecycle.DefaultLifecycleExecutor.executeGoalWithLifecycle(DefaultLifecycleExecutor.java:556)
	at org.apache.maven.lifecycle.DefaultLifecycleExecutor.executeGoal(DefaultLifecycleExecutor.java:535)
	at org.apache.maven.lifecycle.DefaultLifecycleExecutor.executeGoalAndHandleFailures(DefaultLifecycleExecutor.java:387)
	at org.apache.maven.lifecycle.DefaultLifecycleExecutor.executeTaskSegments(DefaultLifecycleExecutor.java:348)
	at org.apache.maven.lifecycle.DefaultLifecycleExecutor.execute(DefaultLifecycleExecutor.java:180)
	at org.apache.maven.lifecycle.LifecycleExecutorInterceptor.execute(LifecycleExecutorInterceptor.java:65)
	at org.apache.maven.DefaultMaven.doExecute(DefaultMaven.java:328)
	at org.apache.maven.DefaultMaven.execute(DefaultMaven.java:138)
	at org.apache.maven.cli.MavenCli.main(MavenCli.java:362)
	at sun.reflect.NativeMethodAccessorImpl.invoke0(Native Method)
	at sun.reflect.NativeMethodAccessorImpl.invoke(NativeMethodAccessorImpl.java:39)
	at sun.reflect.DelegatingMethodAccessorImpl.invoke(DelegatingMethodAccessorImpl.java:25)
	at java.lang.reflect.Method.invoke(Method.java:597)
	at org.codehaus.classworlds.Launcher.launchEnhanced(Launcher.java:315)
	at org.codehaus.classworlds.Launcher.launch(Launcher.java:255)
	at hudson.maven.agent.Main.launch(Main.java:185)
	at hudson.maven.MavenBuilder.call(MavenBuilder.java:164)
	at hudson.maven.MavenModuleSetBuild$Builder.call(MavenModuleSetBuild.java:987)
	at hudson.maven.MavenModuleSetBuild$Builder.call(MavenModuleSetBuild.java:918)
	at hudson.remoting.UserRequest.perform(UserRequest.java:118)
	at hudson.remoting.UserRequest.perform(UserRequest.java:48)
	at hudson.remoting.Request$2.run(Request.java:270)
	at java.util.concurrent.Executors$RunnableAdapter.call(Executors.java:441)
	at java.util.concurrent.FutureTask$Sync.innerRun(FutureTask.java:303)
	at java.util.concurrent.FutureTask.run(FutureTask.java:138)
	at java.util.concurrent.ThreadPoolExecutor$Worker.runTask(ThreadPoolExecutor.java:886)
	at java.util.concurrent.ThreadPoolExecutor$Worker.run(ThreadPoolExecutor.java:908)
	at java.lang.Thread.run(Thread.java:619)
Caused by: org.apache.maven.artifact.resolver.MultipleArtifactsNotFoundException: Missing:
----------
1) org.apache.aries.jmx:org.apache.aries.jmx.core.whiteboard:jar:0.3.1-SNAPSHOT

  Try downloading the file manually from the project website.

  Then, install it using the command: 
      mvn install:install-file -DgroupId=org.apache.aries.jmx -DartifactId=org.apache.aries.jmx.core.whiteboard
-Dversion=0.3.1-SNAPSHOT -Dpackaging=jar -Dfile=/path/to/file

  Alternatively, if you host your own repository you can deploy the file there: 
      mvn deploy:deploy-file -DgroupId=org.apache.aries.jmx -DartifactId=org.apache.aries.jmx.core.whiteboard
-Dversion=0.3.1-SNAPSHOT -Dpackaging=jar -Dfile=/path/to/file -Durl=[url] -DrepositoryId=[id]

  Path to dependency: 
  	1) org.apache.aries.jmx:org.apache.aries.jmx.itests:jar:0.3.1-SNAPSHOT
  	2) org.apache.aries.jmx:org.apache.aries.jmx.core.whiteboard:jar:0.3.1-SNAPSHOT

----------
1 required artifact is missing.

for artifact: 
  org.apache.aries.jmx:org.apache.aries.jmx.itests:jar:0.3.1-SNAPSHOT

from the specified remote repositories:
  codehaus.snapshots (http://snapshots.repository.codehaus.org),
  central (http://repo1.maven.org/maven2),
  Nexus (http://repository.apache.org/snapshots)


	at org.apache.maven.artifact.resolver.DefaultArtifactResolver.resolveTransitively(DefaultArtifactResolver.java:360)
	at org.apache.maven.artifact.resolver.DefaultArtifactResolver.resolveTransitively(DefaultArtifactResolver.java:304)
	at org.apache.maven.plugin.DefaultPluginManager.resolveTransitiveDependencies(DefaultPluginManager.java:1499)
	at org.apache.maven.plugin.DefaultPluginManager.executeMojo(DefaultPluginManager.java:442)
	at hudson.maven.agent.PluginManagerInterceptor.executeMojo(PluginManagerInterceptor.java:182)
	at org.apache.maven.lifecycle.DefaultLifecycleExecutor.executeGoals(DefaultLifecycleExecutor.java:694)
	... 28 more
[INFO] ------------------------------------------------------------------------
[INFO] Total time: 13 minutes 4 seconds
[INFO] Finished at: Thu Jul 07 17:05:12 PDT 2011
[INFO] Final Memory: 168M/982M
[INFO] ------------------------------------------------------------------------
channel stopped


Mime
View raw message