aries-dev mailing list archives

Site index · List index
Message view « Date » · « Thread »
Top « Date » · « Thread »
From Apache Jenkins Server <jenk...@builds.apache.org>
Subject Build failed in Jenkins: Aries #1071
Date Sat, 02 Jul 2011 15:05:03 GMT
See <https://builds.apache.org/job/Aries/1071/changes>

Changes:

[mahrwald] ARIES-691: Test with EclipseLink

------------------------------------------
[...truncated 5020 lines...]
[INFO] [resources:testResources {execution: default-testResources}]
[INFO] Using 'UTF-8' encoding to copy filtered resources.
[INFO] Copying 0 resource
[INFO] skip non existing resourceDirectory <https://builds.apache.org/job/Aries/ws/aries/jpa/jpa-container-context/src/test/filtered-resources>
[INFO] Copying 3 resources
[INFO] [compiler:testCompile {execution: default-testCompile}]
[INFO] Compiling 5 source files to <https://builds.apache.org/job/Aries/ws/aries/jpa/jpa-container-context/target/test-classes>
[INFO] [surefire:test {execution: default-test}]
[INFO] Surefire report directory: <https://builds.apache.org/job/Aries/ws/aries/jpa/jpa-container-context/target/surefire-reports>

-------------------------------------------------------
 T E S T S
-------------------------------------------------------
Running org.apache.aries.jpa.container.context.transaction.impl.JTAPersistenceContextRegistryTest
Tests run: 6, Failures: 0, Errors: 0, Skipped: 0, Time elapsed: 0.074 sec
Running org.apache.aries.jpa.container.context.impl.PersistenceContextManagerTest
Tests run: 18, Failures: 0, Errors: 0, Skipped: 0, Time elapsed: 0.088 sec
Running org.apache.aries.jpa.container.context.impl.GlobalPersistenceManagerTest
Tests run: 3, Failures: 0, Errors: 0, Skipped: 0, Time elapsed: 0.015 sec

Results :

Tests run: 27, Failures: 0, Errors: 0, Skipped: 0

[JENKINS] Recording test results
[INFO] [enforcer:enforce {execution: check-java15}]
[INFO] Checking unresolved references to org.codehaus.mojo.signature:java15:1.0
[INFO] [bundle:bundle {execution: default-bundle}]
[INFO] [ianal:verify-legal-files {execution: default}]
[INFO] Checking legal files in: org.apache.aries.jpa.container.context-0.3.1-SNAPSHOT.jar
[INFO] [install:install {execution: default-install}]
[INFO] Installing <https://builds.apache.org/job/Aries/ws/aries/jpa/jpa-container-context/target/org.apache.aries.jpa.container.context-0.3.1-SNAPSHOT.jar>
to /home/jenkins/.m2/repository/org/apache/aries/jpa/org.apache.aries.jpa.container.context/0.3.1-SNAPSHOT/org.apache.aries.jpa.container.context-0.3.1-SNAPSHOT.jar
[INFO] [bundle:install {execution: default-install}]
[INFO] Installing org/apache/aries/jpa/org.apache.aries.jpa.container.context/0.3.1-SNAPSHOT/org.apache.aries.jpa.container.context-0.3.1-SNAPSHOT.jar
[INFO] Writing OBR metadata
[JENKINS] Archiving <https://builds.apache.org/job/Aries/ws/aries/jpa/jpa-container-context/pom.xml>
to /home/hudson/hudson/jobs/Aries/modules/org.apache.aries.jpa$org.apache.aries.jpa.container.context/builds/2011-07-02_14-53-06/archive/org.apache.aries.jpa/org.apache.aries.jpa.container.context/0.3.1-SNAPSHOT/org.apache.aries.jpa.container.context-0.3.1-SNAPSHOT.pom
[JENKINS] Archiving <https://builds.apache.org/job/Aries/ws/aries/jpa/jpa-container-context/target/org.apache.aries.jpa.container.context-0.3.1-SNAPSHOT.jar>
to /home/hudson/hudson/jobs/Aries/modules/org.apache.aries.jpa$org.apache.aries.jpa.container.context/builds/2011-07-02_14-53-06/archive/org.apache.aries.jpa/org.apache.aries.jpa.container.context/0.3.1-SNAPSHOT/org.apache.aries.jpa.container.context-0.3.1-SNAPSHOT.jar
[INFO] ------------------------------------------------------------------------
[INFO] Building Aries JPA Container blueprint integration for Aries blueprint
[INFO]    task-segment: [clean, install]
[INFO] ------------------------------------------------------------------------
[INFO] [clean:clean {execution: default-clean}]
[INFO] Deleting file set: <https://builds.apache.org/job/Aries/ws/aries/jpa/jpa-blueprint-aries/target>
(included: [**], excluded: [])
[INFO] [enforcer:enforce {execution: default}]
[INFO] [remote-resources:process {execution: default}]
[INFO] [resources:resources {execution: default-resources}]
[INFO] Using 'UTF-8' encoding to copy filtered resources.
[INFO] Copying 4 resources
[INFO] skip non existing resourceDirectory <https://builds.apache.org/job/Aries/ws/aries/jpa/jpa-blueprint-aries/src/main/filtered-resources>
[INFO] Copying 0 resource
[INFO] Copying 3 resources
[INFO] [compiler:compile {execution: default-compile}]
[INFO] Compiling 1 source file to <https://builds.apache.org/job/Aries/ws/aries/jpa/jpa-blueprint-aries/target/classes>
[INFO] [resources:testResources {execution: default-testResources}]
[INFO] Using 'UTF-8' encoding to copy filtered resources.
[INFO] Copying 2 resources
[INFO] skip non existing resourceDirectory <https://builds.apache.org/job/Aries/ws/aries/jpa/jpa-blueprint-aries/src/test/filtered-resources>
[INFO] Copying 3 resources
[INFO] [compiler:testCompile {execution: default-testCompile}]
[INFO] Compiling 1 source file to <https://builds.apache.org/job/Aries/ws/aries/jpa/jpa-blueprint-aries/target/test-classes>
[INFO] [surefire:test {execution: default-test}]
[INFO] Surefire report directory: <https://builds.apache.org/job/Aries/ws/aries/jpa/jpa-blueprint-aries/target/surefire-reports>

-------------------------------------------------------
 T E S T S
-------------------------------------------------------
Running org.apache.aries.jpa.blueprint.aries.test.NSHandlerTest
Tests run: 20, Failures: 0, Errors: 0, Skipped: 0, Time elapsed: 0.186 sec

Results :

Tests run: 20, Failures: 0, Errors: 0, Skipped: 0

[JENKINS] Recording test results
[INFO] [bundle:bundle {execution: default-bundle}]
[INFO] [ianal:verify-legal-files {execution: default}]
[INFO] Checking legal files in: org.apache.aries.jpa.blueprint.aries-0.3.1-SNAPSHOT.jar
[INFO] [install:install {execution: default-install}]
[INFO] Installing <https://builds.apache.org/job/Aries/ws/aries/jpa/jpa-blueprint-aries/target/org.apache.aries.jpa.blueprint.aries-0.3.1-SNAPSHOT.jar>
to /home/jenkins/.m2/repository/org/apache/aries/jpa/org.apache.aries.jpa.blueprint.aries/0.3.1-SNAPSHOT/org.apache.aries.jpa.blueprint.aries-0.3.1-SNAPSHOT.jar
[INFO] [bundle:install {execution: default-install}]
[INFO] Installing org/apache/aries/jpa/org.apache.aries.jpa.blueprint.aries/0.3.1-SNAPSHOT/org.apache.aries.jpa.blueprint.aries-0.3.1-SNAPSHOT.jar
[INFO] Writing OBR metadata
[JENKINS] Archiving <https://builds.apache.org/job/Aries/ws/aries/jpa/jpa-blueprint-aries/pom.xml>
to /home/hudson/hudson/jobs/Aries/modules/org.apache.aries.jpa$org.apache.aries.jpa.blueprint.aries/builds/2011-07-02_14-53-06/archive/org.apache.aries.jpa/org.apache.aries.jpa.blueprint.aries/0.3.1-SNAPSHOT/org.apache.aries.jpa.blueprint.aries-0.3.1-SNAPSHOT.pom
[JENKINS] Archiving <https://builds.apache.org/job/Aries/ws/aries/jpa/jpa-blueprint-aries/target/org.apache.aries.jpa.blueprint.aries-0.3.1-SNAPSHOT.jar>
to /home/hudson/hudson/jobs/Aries/modules/org.apache.aries.jpa$org.apache.aries.jpa.blueprint.aries/builds/2011-07-02_14-53-06/archive/org.apache.aries.jpa/org.apache.aries.jpa.blueprint.aries/0.3.1-SNAPSHOT/org.apache.aries.jpa.blueprint.aries-0.3.1-SNAPSHOT.jar
[INFO] ------------------------------------------------------------------------
[INFO] Building Aries JPA Container adapter for use with EclipseLink
[INFO]    task-segment: [clean, install]
[INFO] ------------------------------------------------------------------------
[INFO] [clean:clean {execution: default-clean}]
Downloading: http://www.eclipse.org/downloads/download.php?r=1&nf=1&file=/rt/eclipselink/maven.repo/org/eclipse/persistence/org.eclipse.persistence.jpa/2.1.0/org.eclipse.persistence.jpa-2.1.0.pom
2K downloaded  (org.eclipse.persistence.jpa-2.1.0.pom)
Downloading: http://www.eclipse.org/downloads/download.php?r=1&nf=1&file=/rt/eclipselink/maven.repo/org/eclipse/persistence/org.eclipse.persistence.asm/2.1.0/org.eclipse.persistence.asm-2.1.0.pom
1K downloaded  (org.eclipse.persistence.asm-2.1.0.pom)
Downloading: http://www.eclipse.org/downloads/download.php?r=1&nf=1&file=/rt/eclipselink/maven.repo/org/eclipse/persistence/org.eclipse.persistence.core/2.1.0/org.eclipse.persistence.core-2.1.0.pom
2K downloaded  (org.eclipse.persistence.core-2.1.0.pom)
Downloading: http://www.eclipse.org/downloads/download.php?r=1&nf=1&file=/rt/eclipselink/maven.repo/org/eclipse/persistence/org.eclipse.persistence.antlr/2.1.0/org.eclipse.persistence.antlr-2.1.0.pom
1K downloaded  (org.eclipse.persistence.antlr-2.1.0.pom)
Downloading: http://www.eclipse.org/downloads/download.php?r=1&nf=1&file=/rt/eclipselink/maven.repo/org/eclipse/persistence/org.eclipse.persistence.jpa/2.1.0/org.eclipse.persistence.jpa-2.1.0.jar
807K downloaded  (org.eclipse.persistence.jpa-2.1.0.jar)
Downloading: http://www.eclipse.org/downloads/download.php?r=1&nf=1&file=/rt/eclipselink/maven.repo/org/eclipse/persistence/org.eclipse.persistence.asm/2.1.0/org.eclipse.persistence.asm-2.1.0.jar
231K downloaded  (org.eclipse.persistence.asm-2.1.0.jar)
Downloading: http://www.eclipse.org/downloads/download.php?r=1&nf=1&file=/rt/eclipselink/maven.repo/org/eclipse/persistence/org.eclipse.persistence.core/2.1.0/org.eclipse.persistence.core-2.1.0.jar
4029K downloaded  (org.eclipse.persistence.core-2.1.0.jar)
[WARNING] Unable to get resource 'org.eclipse.persistence:org.eclipse.persistence.core:jar:2.1.0'
from repository EclipseLink Repo (http://www.eclipse.org/downloads/download.php?r=1&nf=1&file=/rt/eclipselink/maven.repo):
Error transferring file: Connection timed out
Downloading: http://repo1.maven.org/maven2/org/eclipse/persistence/org.eclipse.persistence.core/2.1.0/org.eclipse.persistence.core-2.1.0.jar
[INFO] Unable to find resource 'org.eclipse.persistence:org.eclipse.persistence.core:jar:2.1.0'
in repository central (http://repo1.maven.org/maven2)
Downloading: http://www.eclipse.org/downloads/download.php?r=1&nf=1&file=/rt/eclipselink/maven.repo/org/eclipse/persistence/org.eclipse.persistence.antlr/2.1.0/org.eclipse.persistence.antlr-2.1.0.jar
75K downloaded  (org.eclipse.persistence.antlr-2.1.0.jar)
[JENKINS] Archiving <https://builds.apache.org/job/Aries/ws/aries/jpa/jpa-container-eclipselink-adapter/pom.xml>
to /home/hudson/hudson/jobs/Aries/modules/org.apache.aries.jpa$org.apache.aries.jpa.eclipselink.adapter/builds/2011-07-02_14-53-06/archive/org.apache.aries.jpa/org.apache.aries.jpa.eclipselink.adapter/0.3.1-SNAPSHOT/org.apache.aries.jpa.eclipselink.adapter-0.3.1-SNAPSHOT.pom
[INFO] ------------------------------------------------------------------------
[ERROR] BUILD ERROR
[INFO] ------------------------------------------------------------------------
[INFO] Failed to resolve artifact.

Missing:
----------
1) org.eclipse.persistence:org.eclipse.persistence.core:jar:2.1.0

  Try downloading the file manually from the project website.

  Then, install it using the command: 
      mvn install:install-file -DgroupId=org.eclipse.persistence -DartifactId=org.eclipse.persistence.core
-Dversion=2.1.0 -Dpackaging=jar -Dfile=/path/to/file

  Alternatively, if you host your own repository you can deploy the file there: 
      mvn deploy:deploy-file -DgroupId=org.eclipse.persistence -DartifactId=org.eclipse.persistence.core
-Dversion=2.1.0 -Dpackaging=jar -Dfile=/path/to/file -Durl=[url] -DrepositoryId=[id]

  Path to dependency: 
  	1) org.apache.aries.jpa:org.apache.aries.jpa.eclipselink.adapter:bundle:0.3.1-SNAPSHOT
  	2) org.eclipse.persistence:org.eclipse.persistence.jpa:jar:2.1.0
  	3) org.eclipse.persistence:org.eclipse.persistence.core:jar:2.1.0

----------
1 required artifact is missing.

for artifact: 
  org.apache.aries.jpa:org.apache.aries.jpa.eclipselink.adapter:bundle:0.3.1-SNAPSHOT

from the specified remote repositories:
  codehaus.snapshots (http://snapshots.repository.codehaus.org),
  central (http://repo1.maven.org/maven2),
  Nexus (http://repository.apache.org/snapshots),
  EclipseLink Repo (http://www.eclipse.org/downloads/download.php?r=1&nf=1&file=/rt/eclipselink/maven.repo)



[INFO] ------------------------------------------------------------------------
[INFO] Trace
org.apache.maven.lifecycle.LifecycleExecutionException: Missing:
----------
1) org.eclipse.persistence:org.eclipse.persistence.core:jar:2.1.0

  Try downloading the file manually from the project website.

  Then, install it using the command: 
      mvn install:install-file -DgroupId=org.eclipse.persistence -DartifactId=org.eclipse.persistence.core
-Dversion=2.1.0 -Dpackaging=jar -Dfile=/path/to/file

  Alternatively, if you host your own repository you can deploy the file there: 
      mvn deploy:deploy-file -DgroupId=org.eclipse.persistence -DartifactId=org.eclipse.persistence.core
-Dversion=2.1.0 -Dpackaging=jar -Dfile=/path/to/file -Durl=[url] -DrepositoryId=[id]

  Path to dependency: 
  	1) org.apache.aries.jpa:org.apache.aries.jpa.eclipselink.adapter:bundle:0.3.1-SNAPSHOT
  	2) org.eclipse.persistence:org.eclipse.persistence.jpa:jar:2.1.0
  	3) org.eclipse.persistence:org.eclipse.persistence.core:jar:2.1.0

----------
1 required artifact is missing.

for artifact: 
  org.apache.aries.jpa:org.apache.aries.jpa.eclipselink.adapter:bundle:0.3.1-SNAPSHOT

from the specified remote repositories:
  codehaus.snapshots (http://snapshots.repository.codehaus.org),
  central (http://repo1.maven.org/maven2),
  Nexus (http://repository.apache.org/snapshots),
  EclipseLink Repo (http://www.eclipse.org/downloads/download.php?r=1&nf=1&file=/rt/eclipselink/maven.repo)


	at org.apache.maven.lifecycle.DefaultLifecycleExecutor.executeGoals(DefaultLifecycleExecutor.java:711)
	at org.apache.maven.lifecycle.DefaultLifecycleExecutor.executeGoalWithLifecycle(DefaultLifecycleExecutor.java:556)
	at org.apache.maven.lifecycle.DefaultLifecycleExecutor.executeGoal(DefaultLifecycleExecutor.java:535)
	at org.apache.maven.lifecycle.DefaultLifecycleExecutor.executeGoalAndHandleFailures(DefaultLifecycleExecutor.java:387)
	at org.apache.maven.lifecycle.DefaultLifecycleExecutor.executeTaskSegments(DefaultLifecycleExecutor.java:348)
	at org.apache.maven.lifecycle.DefaultLifecycleExecutor.execute(DefaultLifecycleExecutor.java:180)
	at org.apache.maven.lifecycle.LifecycleExecutorInterceptor.execute(LifecycleExecutorInterceptor.java:65)
	at org.apache.maven.DefaultMaven.doExecute(DefaultMaven.java:328)
	at org.apache.maven.DefaultMaven.execute(DefaultMaven.java:138)
	at org.apache.maven.cli.MavenCli.main(MavenCli.java:362)
	at sun.reflect.NativeMethodAccessorImpl.invoke0(Native Method)
	at sun.reflect.NativeMethodAccessorImpl.invoke(NativeMethodAccessorImpl.java:39)
	at sun.reflect.DelegatingMethodAccessorImpl.invoke(DelegatingMethodAccessorImpl.java:25)
	at java.lang.reflect.Method.invoke(Method.java:597)
	at org.codehaus.classworlds.Launcher.launchEnhanced(Launcher.java:315)
	at org.codehaus.classworlds.Launcher.launch(Launcher.java:255)
	at hudson.maven.agent.Main.launch(Main.java:185)
	at hudson.maven.MavenBuilder.call(MavenBuilder.java:164)
	at hudson.maven.MavenModuleSetBuild$Builder.call(MavenModuleSetBuild.java:987)
	at hudson.maven.MavenModuleSetBuild$Builder.call(MavenModuleSetBuild.java:918)
	at hudson.remoting.UserRequest.perform(UserRequest.java:118)
	at hudson.remoting.UserRequest.perform(UserRequest.java:48)
	at hudson.remoting.Request$2.run(Request.java:270)
	at java.util.concurrent.Executors$RunnableAdapter.call(Executors.java:441)
	at java.util.concurrent.FutureTask$Sync.innerRun(FutureTask.java:303)
	at java.util.concurrent.FutureTask.run(FutureTask.java:138)
	at java.util.concurrent.ThreadPoolExecutor$Worker.runTask(ThreadPoolExecutor.java:886)
	at java.util.concurrent.ThreadPoolExecutor$Worker.run(ThreadPoolExecutor.java:908)
	at java.lang.Thread.run(Thread.java:619)
Caused by: org.apache.maven.artifact.resolver.MultipleArtifactsNotFoundException: Missing:
----------
1) org.eclipse.persistence:org.eclipse.persistence.core:jar:2.1.0

  Try downloading the file manually from the project website.

  Then, install it using the command: 
      mvn install:install-file -DgroupId=org.eclipse.persistence -DartifactId=org.eclipse.persistence.core
-Dversion=2.1.0 -Dpackaging=jar -Dfile=/path/to/file

  Alternatively, if you host your own repository you can deploy the file there: 
      mvn deploy:deploy-file -DgroupId=org.eclipse.persistence -DartifactId=org.eclipse.persistence.core
-Dversion=2.1.0 -Dpackaging=jar -Dfile=/path/to/file -Durl=[url] -DrepositoryId=[id]

  Path to dependency: 
  	1) org.apache.aries.jpa:org.apache.aries.jpa.eclipselink.adapter:bundle:0.3.1-SNAPSHOT
  	2) org.eclipse.persistence:org.eclipse.persistence.jpa:jar:2.1.0
  	3) org.eclipse.persistence:org.eclipse.persistence.core:jar:2.1.0

----------
1 required artifact is missing.

for artifact: 
  org.apache.aries.jpa:org.apache.aries.jpa.eclipselink.adapter:bundle:0.3.1-SNAPSHOT

from the specified remote repositories:
  codehaus.snapshots (http://snapshots.repository.codehaus.org),
  central (http://repo1.maven.org/maven2),
  Nexus (http://repository.apache.org/snapshots),
  EclipseLink Repo (http://www.eclipse.org/downloads/download.php?r=1&nf=1&file=/rt/eclipselink/maven.repo)


	at org.apache.maven.artifact.resolver.DefaultArtifactResolver.resolveTransitively(DefaultArtifactResolver.java:360)
	at org.apache.maven.artifact.resolver.DefaultArtifactResolver.resolveTransitively(DefaultArtifactResolver.java:304)
	at org.apache.maven.plugin.DefaultPluginManager.resolveTransitiveDependencies(DefaultPluginManager.java:1499)
	at org.apache.maven.plugin.DefaultPluginManager.executeMojo(DefaultPluginManager.java:442)
	at hudson.maven.agent.PluginManagerInterceptor.executeMojo(PluginManagerInterceptor.java:182)
	at org.apache.maven.lifecycle.DefaultLifecycleExecutor.executeGoals(DefaultLifecycleExecutor.java:694)
	... 28 more
[INFO] ------------------------------------------------------------------------
[INFO] Total time: 11 minutes 47 seconds
[INFO] Finished at: Sat Jul 02 15:03:47 UTC 2011
[INFO] Final Memory: 147M/965M
[INFO] ------------------------------------------------------------------------
channel stopped


Mime
View raw message