aries-dev mailing list archives

Site index · List index
Message view « Date » · « Thread »
Top « Date » · « Thread »
From Apache Jenkins Server <jenk...@builds.apache.org>
Subject Build failed in Jenkins: Aries #1089
Date Tue, 12 Jul 2011 17:52:16 GMT
See <https://builds.apache.org/job/Aries/1089/changes>

Changes:

[jwross] ARIES-708: org.apache.aries.util pom should point to java6-parent, not java5-parent

Set org.apache.aries.util pom back to java5-parent. Set java5-parent project pom to accept
1.6 source but still target 1.5. This results in no @Override compile errors on implemented
interface methods but still enforces java 5 compatibility on org.apache.aries.util.

------------------------------------------
[...truncated 145 lines...]
[INFO]   Apache Aries Transaction Enlisting JDBC Datasource
[INFO]   Apache Aries Transaction Test Datasource Configuration
[INFO]   Apache Aries Transaction Test Bundle
[INFO]   Apache Aries Transaction Integration Tests
[INFO]   Apache Aries Transaction - reactor pom
[INFO]   Apache Aries Web Url handler
[INFO]   Apache Aries Web integration tests
[INFO]   Apache Aries Web Component
[INFO]   Apache Aries Application API
[INFO]   Apache Aries Application Utils
[INFO]   Apache Aries Application Modelling
[INFO]   Apache Aries Application Deployment Management
[INFO]   Apache Aries Application Management
[INFO]   Apache Aries Application Runtime
[INFO]   Apache Aries Application Bundle
[INFO]   Apache Aries Application Converters
[INFO]   Apache Aries Application Default local platform
[INFO]   Apache Aries Application Installer
[INFO]   Apache Aries Application itests sample application interface
[INFO]   Apache Aries Bundle Framework provider
[INFO]   Apache Aries Bundle Framework Manager provider
[INFO]   Apache Aries Bundle Repository provider
[INFO]   Apache Aries Isolated Application Runtime
[INFO]   Apache Aries Application OBR Resolver
[INFO]   Apache Aries Application No-op Resolver
[INFO]   Apache Aries Application integration tests
[INFO]   Apache Aries Application Modelling
[INFO]   Apache Aries Application Modelling tests
[INFO]   Apache Aries repository generator tool
[INFO]   Application distribution
[INFO]   Application distribution for isolated application support
[INFO]   Apache Aries Application
[INFO]   Apache Aries JMX API
[INFO]   Apache Aries JMX Blueprint API
[INFO]   Apache Aries JMX Core
[INFO]   Apache Aries JMX Core via Whiteboards
[INFO]   Apache Aries Whiteboard support for JMX DynamicMBean services
[INFO]   Apache Aries JMX Blueprint Core
[INFO]   Apache Aries JMX Bundle
[INFO]   Apache Aries JMX Blueprint Bundle
[INFO]   Apache Aries JMX integration tests
[INFO]   Apache Aries JMX
[INFO]   Aries JPA Container API
[INFO]   Aries JPA Container
[INFO]   Aries JPA Container Managed Contexts
[INFO]   Aries JPA Container blueprint integration for Aries blueprint
[INFO]   Aries JPA Container adapter for use with EclipseLink
[INFO]   Test Bundle for Aries JPA Container iTests
[INFO]   Test Bundle for Aries JPA Container iTests
[INFO]   Test Bundle for Aries JPA Container advanced iTests
[INFO]   Test Bundle for Aries JPA Blueprint iTests
[INFO]   Aries JPA iTests
[INFO]   Aries JPA Component
[INFO]   Apache Aries Samples
[INFO]   Apache Aries blog sample
[INFO]   Apache Aries blog sample API
[INFO]   Apache Aries blog sample transaction enlisting JDBC datasource
[INFO]   Apache Aries blog sample assembly
[INFO]   Apache Aries blog sample
[INFO]   Apache Aries blog sample web component
[INFO]   Apache Aries blog sample persistence
[INFO]   Apache Aries Blog Sample EBA using JDBC
[INFO]   Apache Aries blog sample persistence
[INFO]   Apache Aries Blog Sample EBA using JPA
[INFO]   Apache Aries Blog sample iTests
[INFO]   AriesTrader :: Performance Benchmark Sample
[INFO]   AriesTrader :: Modules
[INFO]   AriesTrader :: Modules - Util
[INFO]   AriesTrader :: Modules - API
[INFO]   AriesTrader :: Modules - Core
[INFO]   AriesTrader :: Modules - Web
[INFO]   AriesTrader :: Modules - Beans
[INFO]   AriesTrader :: Modules - Entities
[INFO]   AriesTrader :: Modules - Derby DataSource
[INFO]   AriesTrader :: Modules - Persist JDBC
[INFO]   AriesTrader :: Modules - Persist JPA App Managed
[INFO]   AriesTrader :: Modules - Persist JPA Container Managed
[INFO]   AriesTrader :: Assemblies
[INFO]   AriesTrader :: Assemblies - EBA - JDBC
[INFO]   AriesTrader :: Assemblies - EBA - ALL
[INFO]   Equinox test harness that can be used to install sample EBAs
[INFO]   Apache Aries Blueprint samples
[INFO]   Apache Aries Blueprint HelloWorld
[INFO]   Apache Aries Blueprint HelloWorld API
[INFO]   Apache Aries Blueprint HelloWorldServer
[INFO]   Apache Aries Blueprint HelloWorldClient
[INFO]   Apache Aries Blueprint HelloWorld Assembly
[INFO]   Apache Aries Blueprint HelloWorld EBA
[INFO]   Apache Aries Blueprint sample iTests
[INFO]   Apache Aries Blueprint Sample - ID Verifier
[INFO]   Apache Aries Blueprint Sample - ID Verifier API
[INFO]   Apache Aries Blueprint Sample - ID Verifier Server
[INFO]   Apache Aries Blueprint Sample - ID Verifier Client
[INFO]   Apache Aries Blueprint Sample - ID Verifier Assembly
[INFO]   Apache Aries Twitter sample
[INFO]   Apache Aries Bundlise Twitter4j
[INFO]   Apache Aries Twitter bundle
[INFO]   Apache Aries Twitter EBA
[INFO]   Apache Aries Twitter sample integration tests
[INFO]   Apache Aries
[WARNING] POM for 'biz.aQute:bndlib:pom:1.15.0:runtime' is invalid.

Its dependencies (if any) will NOT be available to the current build.
[INFO] artifact org.apache.aries:eba-maven-plugin: checking for updates from central
[WARNING] *** CHECKSUM FAILED - Checksum failed on download: local = 'e017513cde451a0121a1d4f0c1fcfb270d545ed1';
remote = 'e3ab2f20e6537547cb3aca1663491527a77c9a64' - RETRYING
[WARNING] *** CHECKSUM FAILED - Checksum failed on download: local = 'e017513cde451a0121a1d4f0c1fcfb270d545ed1';
remote = 'e3ab2f20e6537547cb3aca1663491527a77c9a64' - IGNORING
[INFO] snapshot org.apache.aries:eba-maven-plugin:0.3.1-SNAPSHOT: checking for updates from
apache.snapshots
[INFO] snapshot org.apache.aries:eba-maven-plugin:0.3.1-SNAPSHOT: checking for updates from
codehaus.snapshots
[INFO] ------------------------------------------------------------------------
[INFO] Building Aries :: Top Parent POM
[INFO]    task-segment: [clean, install]
[INFO] ------------------------------------------------------------------------
[INFO] [clean:clean {execution: default-clean}]
[INFO] Deleting file set: <https://builds.apache.org/job/Aries/ws/aries/parent/target>
(included: [**], excluded: [])
[INFO] Setting property: classpath.resource.loader.class => 'org.codehaus.plexus.velocity.ContextClassLoaderResourceLoader'.
[INFO] Setting property: velocimacro.messages.on => 'false'.
[INFO] Setting property: resource.loader => 'classpath'.
[INFO] Setting property: resource.manager.logwhenfound => 'false'.
[INFO] [remote-resources:process {execution: default}]
[INFO] [site:attach-descriptor {execution: default-attach-descriptor}]
[INFO] [install:install {execution: default-install}]
[INFO] Installing <https://builds.apache.org/job/Aries/ws/aries/parent/pom.xml> to /home/hudson/.m2/repository/org/apache/aries/parent/0.4.1-SNAPSHOT/parent-0.4.1-SNAPSHOT.pom
[JENKINS] Archiving <https://builds.apache.org/job/Aries/ws/aries/parent/pom.xml> to
/home/hudson/hudson/jobs/Aries/modules/org.apache.aries$parent/builds/2011-07-12_17-51-23/archive/org.apache.aries/parent/0.4.1-SNAPSHOT/parent-0.4.1-SNAPSHOT.pom
[INFO] ------------------------------------------------------------------------
[INFO] Building Aries :: Default Parent POM
[INFO]    task-segment: [clean, install]
[INFO] ------------------------------------------------------------------------
[INFO] [clean:clean {execution: default-clean}]
[INFO] Deleting file set: <https://builds.apache.org/job/Aries/ws/aries/parent/default-parent/target>
(included: [**], excluded: [])
[INFO] [enforcer:enforce {execution: default}]
[INFO] [remote-resources:process {execution: default}]
[INFO] [site:attach-descriptor {execution: default-attach-descriptor}]
[INFO] [ianal:verify-legal-files {execution: default}]
[INFO] [install:install {execution: default-install}]
[INFO] Installing <https://builds.apache.org/job/Aries/ws/aries/parent/default-parent/pom.xml>
to /home/hudson/.m2/repository/org/apache/aries/default-parent/0.4.1-SNAPSHOT/default-parent-0.4.1-SNAPSHOT.pom
[JENKINS] Archiving <https://builds.apache.org/job/Aries/ws/aries/parent/default-parent/pom.xml>
to /home/hudson/hudson/jobs/Aries/modules/org.apache.aries$default-parent/builds/2011-07-12_17-51-23/archive/org.apache.aries/default-parent/0.4.1-SNAPSHOT/default-parent-0.4.1-SNAPSHOT.pom
[INFO] ------------------------------------------------------------------------
[INFO] Building Aries :: Java 5 Parent POM
[INFO]    task-segment: [clean, install]
[INFO] ------------------------------------------------------------------------
[INFO] [clean:clean {execution: default-clean}]
[INFO] Deleting file set: <https://builds.apache.org/job/Aries/ws/aries/parent/default-parent/java5-parent/target>
(included: [**], excluded: [])
[INFO] [enforcer:enforce {execution: default}]
[INFO] [remote-resources:process {execution: default}]
[INFO] [enforcer:enforce {execution: check-java15}]
[INFO] Checking unresolved references to org.codehaus.mojo.signature:java15:1.0
[INFO] [site:attach-descriptor {execution: default-attach-descriptor}]
[INFO] [ianal:verify-legal-files {execution: default}]
[INFO] [install:install {execution: default-install}]
[INFO] Installing <https://builds.apache.org/job/Aries/ws/aries/parent/default-parent/java5-parent/pom.xml>
to /home/hudson/.m2/repository/org/apache/aries/java5-parent/0.4.1-SNAPSHOT/java5-parent-0.4.1-SNAPSHOT.pom
[JENKINS] Archiving <https://builds.apache.org/job/Aries/ws/aries/parent/default-parent/java5-parent/pom.xml>
to /home/hudson/hudson/jobs/Aries/modules/org.apache.aries$java5-parent/builds/2011-07-12_17-51-23/archive/org.apache.aries/java5-parent/0.4.1-SNAPSHOT/java5-parent-0.4.1-SNAPSHOT.pom
[INFO] ------------------------------------------------------------------------
[INFO] Building Aries :: Java 6 Parent POM
[INFO]    task-segment: [clean, install]
[INFO] ------------------------------------------------------------------------
[INFO] [clean:clean {execution: default-clean}]
[INFO] Deleting file set: <https://builds.apache.org/job/Aries/ws/aries/parent/default-parent/java6-parent/target>
(included: [**], excluded: [])
[INFO] [enforcer:enforce {execution: default}]
[INFO] [remote-resources:process {execution: default}]
[INFO] [site:attach-descriptor {execution: default-attach-descriptor}]
[INFO] [ianal:verify-legal-files {execution: default}]
[INFO] [install:install {execution: default-install}]
[INFO] Installing <https://builds.apache.org/job/Aries/ws/aries/parent/default-parent/java6-parent/pom.xml>
to /home/hudson/.m2/repository/org/apache/aries/java6-parent/0.4.1-SNAPSHOT/java6-parent-0.4.1-SNAPSHOT.pom
[JENKINS] Archiving <https://builds.apache.org/job/Aries/ws/aries/parent/default-parent/java6-parent/pom.xml>
to /home/hudson/hudson/jobs/Aries/modules/org.apache.aries$java6-parent/builds/2011-07-12_17-51-23/archive/org.apache.aries/java6-parent/0.4.1-SNAPSHOT/java6-parent-0.4.1-SNAPSHOT.pom
[INFO] ------------------------------------------------------------------------
[INFO] Building Aries Maven EBA Plugin
[INFO]    task-segment: [clean, install]
[INFO] ------------------------------------------------------------------------
[INFO] [clean:clean {execution: default-clean}]
[INFO] Deleting file set: <https://builds.apache.org/job/Aries/ws/aries/eba-maven-plugin/target>
(included: [**], excluded: [])
[INFO] [enforcer:enforce {execution: default}]
[INFO] [plugin:descriptor {execution: default-descriptor}]
[INFO] Using 'UTF-8' encoding to read mojo metadata.
[INFO] Applying mojo extractor for language: java
[INFO] Mojo extractor for language: java found 1 mojo descriptors.
[INFO] Applying mojo extractor for language: bsh
[INFO] Mojo extractor for language: bsh found 0 mojo descriptors.
[INFO] [remote-resources:process {execution: default}]
[INFO] [resources:resources {execution: default-resources}]
[INFO] Using 'UTF-8' encoding to copy filtered resources.
[INFO] Copying 1 resource
[INFO] skip non existing resourceDirectory <https://builds.apache.org/job/Aries/ws/aries/eba-maven-plugin/src/main/filtered-resources>
[INFO] Copying 0 resource
[INFO] Copying 3 resources
[INFO] [compiler:compile {execution: default-compile}]
[INFO] Compiling 1 source file to <https://builds.apache.org/job/Aries/ws/aries/eba-maven-plugin/target/classes>
[JENKINS] Archiving <https://builds.apache.org/job/Aries/ws/aries/eba-maven-plugin/pom.xml>
to /home/hudson/hudson/jobs/Aries/modules/org.apache.aries$eba-maven-plugin/builds/2011-07-12_17-51-23/archive/org.apache.aries/eba-maven-plugin/0.3.1-SNAPSHOT/eba-maven-plugin-0.3.1-SNAPSHOT.pom
[INFO] ------------------------------------------------------------------------
[ERROR] BUILD FAILURE
[INFO] ------------------------------------------------------------------------
[INFO] Compilation failure
Failure executing javac, but could not parse the error:
javac: source release 1.6 requires target release 1.6


[INFO] ------------------------------------------------------------------------
[INFO] Trace
org.apache.maven.BuildFailureException: Compilation failure
Failure executing javac, but could not parse the error:
javac: source release 1.6 requires target release 1.6


	at org.apache.maven.lifecycle.DefaultLifecycleExecutor.executeGoals(DefaultLifecycleExecutor.java:715)
	at org.apache.maven.lifecycle.DefaultLifecycleExecutor.executeGoalWithLifecycle(DefaultLifecycleExecutor.java:556)
	at org.apache.maven.lifecycle.DefaultLifecycleExecutor.executeGoal(DefaultLifecycleExecutor.java:535)
	at org.apache.maven.lifecycle.DefaultLifecycleExecutor.executeGoalAndHandleFailures(DefaultLifecycleExecutor.java:387)
	at org.apache.maven.lifecycle.DefaultLifecycleExecutor.executeTaskSegments(DefaultLifecycleExecutor.java:348)
	at org.apache.maven.lifecycle.DefaultLifecycleExecutor.execute(DefaultLifecycleExecutor.java:180)
	at org.apache.maven.lifecycle.LifecycleExecutorInterceptor.execute(LifecycleExecutorInterceptor.java:65)
	at org.apache.maven.DefaultMaven.doExecute(DefaultMaven.java:328)
	at org.apache.maven.DefaultMaven.execute(DefaultMaven.java:138)
	at org.apache.maven.cli.MavenCli.main(MavenCli.java:362)
	at sun.reflect.NativeMethodAccessorImpl.invoke0(Native Method)
	at sun.reflect.NativeMethodAccessorImpl.invoke(NativeMethodAccessorImpl.java:39)
	at sun.reflect.DelegatingMethodAccessorImpl.invoke(DelegatingMethodAccessorImpl.java:25)
	at java.lang.reflect.Method.invoke(Method.java:597)
	at org.codehaus.classworlds.Launcher.launchEnhanced(Launcher.java:315)
	at org.codehaus.classworlds.Launcher.launch(Launcher.java:255)
	at hudson.maven.agent.Main.launch(Main.java:185)
	at hudson.maven.MavenBuilder.call(MavenBuilder.java:164)
	at hudson.maven.MavenModuleSetBuild$Builder.call(MavenModuleSetBuild.java:987)
	at hudson.maven.MavenModuleSetBuild$Builder.call(MavenModuleSetBuild.java:918)
	at hudson.remoting.UserRequest.perform(UserRequest.java:118)
	at hudson.remoting.UserRequest.perform(UserRequest.java:48)
	at hudson.remoting.Request$2.run(Request.java:270)
	at java.util.concurrent.Executors$RunnableAdapter.call(Executors.java:441)
	at java.util.concurrent.FutureTask$Sync.innerRun(FutureTask.java:303)
	at java.util.concurrent.FutureTask.run(FutureTask.java:138)
	at java.util.concurrent.ThreadPoolExecutor$Worker.runTask(ThreadPoolExecutor.java:886)
	at java.util.concurrent.ThreadPoolExecutor$Worker.run(ThreadPoolExecutor.java:908)
	at java.lang.Thread.run(Thread.java:619)
Caused by: org.apache.maven.plugin.CompilationFailureException: Compilation failure
Failure executing javac, but could not parse the error:
javac: source release 1.6 requires target release 1.6


	at org.apache.maven.plugin.AbstractCompilerMojo.execute(AbstractCompilerMojo.java:516)
	at org.apache.maven.plugin.CompilerMojo.execute(CompilerMojo.java:114)
	at org.apache.maven.plugin.DefaultPluginManager.executeMojo(DefaultPluginManager.java:490)
	at hudson.maven.agent.PluginManagerInterceptor.executeMojo(PluginManagerInterceptor.java:182)
	at org.apache.maven.lifecycle.DefaultLifecycleExecutor.executeGoals(DefaultLifecycleExecutor.java:694)
	... 28 more
[INFO] ------------------------------------------------------------------------
[INFO] Total time: 22 seconds
[INFO] Finished at: Tue Jul 12 10:52:12 PDT 2011
[INFO] Final Memory: 79M/399M
[INFO] ------------------------------------------------------------------------
Sending e-mails to: dev@aries.apache.org
channel stopped


Mime
View raw message