aries-dev mailing list archives

Site index · List index
Message view « Date » · « Thread »
Top « Date » · « Thread »
From Apache Jenkins Server <jenk...@builds.apache.org>
Subject Build failed in Jenkins: Aries » Apache Aries blog sample transaction enlisting JDBC datasource #1093
Date Wed, 20 Jul 2011 08:12:03 GMT
See <https://builds.apache.org/job/Aries/org.apache.aries.samples.blog$org.apache.aries.samples.blog.datasource/1093/>

------------------------------------------
[INFO] ------------------------------------------------------------------------
[INFO] Building Apache Aries blog sample transaction enlisting JDBC datasource
[INFO]    task-segment: [clean, install]
[INFO] ------------------------------------------------------------------------
[INFO] [clean:clean {execution: default-clean}]
[INFO] Deleting file set: <https://builds.apache.org/job/Aries/org.apache.aries.samples.blog$org.apache.aries.samples.blog.datasource/ws/target>
(included: [**], excluded: [])
[INFO] [enforcer:enforce {execution: default}]
[INFO] [remote-resources:process {execution: default}]
[INFO] [resources:resources {execution: default-resources}]
[INFO] Using 'UTF-8' encoding to copy filtered resources.
[INFO] Copying 1 resource to OSGI-INF/blueprint
[INFO] Copying 3 resources
[INFO] [compiler:compile {execution: default-compile}]
[INFO] Nothing to compile - all classes are up to date
[INFO] [resources:testResources {execution: default-testResources}]
[INFO] Using 'UTF-8' encoding to copy filtered resources.
[INFO] skip non existing resourceDirectory <https://builds.apache.org/job/Aries/org.apache.aries.samples.blog$org.apache.aries.samples.blog.datasource/ws/src/test/resources>
[INFO] skip non existing resourceDirectory <https://builds.apache.org/job/Aries/org.apache.aries.samples.blog$org.apache.aries.samples.blog.datasource/ws/src/test/filtered-resources>
[INFO] Copying 3 resources
[INFO] [compiler:testCompile {execution: default-testCompile}]
[INFO] No sources to compile
[INFO] [surefire:test {execution: default-test}]
[INFO] Surefire report directory: <https://builds.apache.org/job/Aries/org.apache.aries.samples.blog$org.apache.aries.samples.blog.datasource/ws/target/surefire-reports>
[JENKINS] Recording test results
[JENKINS] Archiving <https://builds.apache.org/job/Aries/org.apache.aries.samples.blog$org.apache.aries.samples.blog.datasource/ws/pom.xml>
to /home/hudson/hudson/jobs/Aries/modules/org.apache.aries.samples.blog$org.apache.aries.samples.blog.datasource/builds/2011-07-20_07-53-13/archive/org.apache.aries.samples.blog/org.apache.aries.samples.blog.datasource/0.3.1-SNAPSHOT/org.apache.aries.samples.blog.datasource-0.3.1-SNAPSHOT.pom
[INFO] ------------------------------------------------------------------------
[ERROR] BUILD ERROR
[INFO] ------------------------------------------------------------------------
[INFO] Error creating properties files for forking; nested exception is java.io.IOException:
No space left on device

[INFO] ------------------------------------------------------------------------
[INFO] Trace
org.apache.maven.lifecycle.LifecycleExecutionException: Error creating properties files for
forking; nested exception is java.io.IOException: No space left on device
	at org.apache.maven.lifecycle.DefaultLifecycleExecutor.executeGoals(DefaultLifecycleExecutor.java:719)
	at org.apache.maven.lifecycle.DefaultLifecycleExecutor.executeGoalWithLifecycle(DefaultLifecycleExecutor.java:556)
	at org.apache.maven.lifecycle.DefaultLifecycleExecutor.executeGoal(DefaultLifecycleExecutor.java:535)
	at org.apache.maven.lifecycle.DefaultLifecycleExecutor.executeGoalAndHandleFailures(DefaultLifecycleExecutor.java:387)
	at org.apache.maven.lifecycle.DefaultLifecycleExecutor.executeTaskSegments(DefaultLifecycleExecutor.java:348)
	at org.apache.maven.lifecycle.DefaultLifecycleExecutor.execute(DefaultLifecycleExecutor.java:180)
	at org.apache.maven.lifecycle.LifecycleExecutorInterceptor.execute(LifecycleExecutorInterceptor.java:65)
	at org.apache.maven.DefaultMaven.doExecute(DefaultMaven.java:328)
	at org.apache.maven.DefaultMaven.execute(DefaultMaven.java:138)
	at org.apache.maven.cli.MavenCli.main(MavenCli.java:362)
	at sun.reflect.NativeMethodAccessorImpl.invoke0(Native Method)
	at sun.reflect.NativeMethodAccessorImpl.invoke(NativeMethodAccessorImpl.java:39)
	at sun.reflect.DelegatingMethodAccessorImpl.invoke(DelegatingMethodAccessorImpl.java:25)
	at java.lang.reflect.Method.invoke(Method.java:597)
	at org.codehaus.classworlds.Launcher.launchEnhanced(Launcher.java:315)
	at org.codehaus.classworlds.Launcher.launch(Launcher.java:255)
	at hudson.maven.agent.Main.launch(Main.java:185)
	at hudson.maven.MavenBuilder.call(MavenBuilder.java:164)
	at hudson.maven.MavenModuleSetBuild$Builder.call(MavenModuleSetBuild.java:987)
	at hudson.maven.MavenModuleSetBuild$Builder.call(MavenModuleSetBuild.java:918)
	at hudson.remoting.UserRequest.perform(UserRequest.java:118)
	at hudson.remoting.UserRequest.perform(UserRequest.java:48)
	at hudson.remoting.Request$2.run(Request.java:270)
	at java.util.concurrent.Executors$RunnableAdapter.call(Executors.java:441)
	at java.util.concurrent.FutureTask$Sync.innerRun(FutureTask.java:303)
	at java.util.concurrent.FutureTask.run(FutureTask.java:138)
	at java.util.concurrent.ThreadPoolExecutor$Worker.runTask(ThreadPoolExecutor.java:886)
	at java.util.concurrent.ThreadPoolExecutor$Worker.run(ThreadPoolExecutor.java:908)
	at java.lang.Thread.run(Thread.java:619)
Caused by: org.apache.maven.plugin.MojoExecutionException: Error creating properties files
for forking; nested exception is java.io.IOException: No space left on device
	at org.apache.maven.plugin.surefire.SurefirePlugin.execute(SurefirePlugin.java:541)
	at org.apache.maven.plugin.DefaultPluginManager.executeMojo(DefaultPluginManager.java:490)
	at hudson.maven.agent.PluginManagerInterceptor.executeMojo(PluginManagerInterceptor.java:182)
	at org.apache.maven.lifecycle.DefaultLifecycleExecutor.executeGoals(DefaultLifecycleExecutor.java:694)
	... 28 more
Caused by: org.apache.maven.surefire.booter.SurefireBooterForkException: Error creating properties
files for forking; nested exception is java.io.IOException: No space left on device
	at org.apache.maven.surefire.booter.SurefireBooter.fork(SurefireBooter.java:629)
	at org.apache.maven.surefire.booter.SurefireBooter.forkSuites(SurefireBooter.java:479)
	at org.apache.maven.surefire.booter.SurefireBooter.runSuitesForkOnce(SurefireBooter.java:379)
	at org.apache.maven.surefire.booter.SurefireBooter.run(SurefireBooter.java:245)
	at org.apache.maven.plugin.surefire.SurefirePlugin.execute(SurefirePlugin.java:537)
	... 31 more
Caused by: java.io.IOException: No space left on device
	at java.io.FileOutputStream.writeBytes(Native Method)
	at java.io.FileOutputStream.write(FileOutputStream.java:260)
	at sun.nio.cs.StreamEncoder.writeBytes(StreamEncoder.java:202)
	at sun.nio.cs.StreamEncoder.implFlushBuffer(StreamEncoder.java:272)
	at sun.nio.cs.StreamEncoder.implFlush(StreamEncoder.java:276)
	at sun.nio.cs.StreamEncoder.flush(StreamEncoder.java:122)
	at java.io.OutputStreamWriter.flush(OutputStreamWriter.java:212)
	at java.io.BufferedWriter.flush(BufferedWriter.java:236)
	at java.util.Properties.store0(Properties.java:822)
	at java.util.Properties.store(Properties.java:796)
	at org.apache.maven.surefire.booter.SurefireBooter.writePropertiesFile(SurefireBooter.java:541)
	at org.apache.maven.surefire.booter.SurefireBooter.writePropertiesFile(SurefireBooter.java:529)
	at org.apache.maven.surefire.booter.SurefireBooter.fork(SurefireBooter.java:621)
	... 35 more
[INFO] ------------------------------------------------------------------------
[INFO] Total time: 18 minutes 41 seconds
[INFO] Finished at: Wed Jul 20 08:05:37 UTC 2011
[INFO] Final Memory: 172M/955M
[INFO] ------------------------------------------------------------------------


Mime
View raw message