aries-dev mailing list archives

Site index · List index
Message view « Date » · « Thread »
Top « Date » · « Thread »
From Apache Jenkins Server <jenk...@builds.apache.org>
Subject Build failed in Jenkins: Aries #1600
Date Wed, 25 Jul 2012 00:17:17 GMT
See <https://builds.apache.org/job/Aries/1600/changes>

Changes:

[cumminsh] [ARIES-862] Updating missed bits of dev profiles

[cumminsh] [ARIES-862] Moving to released version of blueprint.core and released application
bundles

------------------------------------------
[...truncated 6713 lines...]
[INFO] No sources to compile
[INFO] [resources:testResources {execution: default-testResources}]
[INFO] Using 'UTF-8' encoding to copy filtered resources.
[INFO] skip non existing resourceDirectory <https://builds.apache.org/job/Aries/ws/aries/jmx/jmx-blueprint-bundle/src/test/resources>
[INFO] skip non existing resourceDirectory <https://builds.apache.org/job/Aries/ws/aries/jmx/jmx-blueprint-bundle/src/test/filtered-resources>
[INFO] Copying 3 resources
[INFO] [compiler:testCompile {execution: default-testCompile}]
[INFO] No sources to compile
[INFO] [surefire:test {execution: default-test}]
[INFO] Surefire report directory: <https://builds.apache.org/job/Aries/ws/aries/jmx/jmx-blueprint-bundle/target/surefire-reports>

-------------------------------------------------------
 T E S T S
-------------------------------------------------------
There are no tests to run.

Results :

Tests run: 0, Failures: 0, Errors: 0, Skipped: 0

[JENKINS] Recording test results[INFO] [enforcer:enforce {execution: check-java15}]
[INFO] Checking unresolved references to org.codehaus.mojo.signature:java15:1.0

[INFO] [bundle:bundle {execution: default-bundle}]
[WARNING] Warning building bundle org.apache.aries.jmx:org.apache.aries.jmx.blueprint:bundle:1.0.0-SNAPSHOT
: Did not find matching referal for !org.apache.aries.jmx*
[INFO] [shade:shade {execution: default}]
[INFO] Including org.apache.aries.jmx:org.apache.aries.jmx.blueprint.api:jar:1.0.0 in the
shaded jar.
[INFO] Including org.apache.aries.jmx:org.apache.aries.jmx.blueprint.core:jar:1.0.0 in the
shaded jar.
[INFO] Excluding org.apache.aries:org.apache.aries.util:jar:1.0.0 from the shaded jar.
[WARNING] We have a duplicate org/apache/aries/jmx/blueprint/BlueprintMetadataMBean.class
in /home/hudson/hudson-slave/maven-repositories/0/org/apache/aries/jmx/org.apache.aries.jmx.blueprint.api/1.0.0/org.apache.aries.jmx.blueprint.api-1.0.0.jar
[WARNING] We have a duplicate org/apache/aries/jmx/blueprint/BlueprintStateMBean.class in
/home/hudson/hudson-slave/maven-repositories/0/org/apache/aries/jmx/org.apache.aries.jmx.blueprint.api/1.0.0/org.apache.aries.jmx.blueprint.api-1.0.0.jar
[WARNING] We have a duplicate org/apache/aries/jmx/blueprint/Item.class in /home/hudson/hudson-slave/maven-repositories/0/org/apache/aries/jmx/org.apache.aries.jmx.blueprint.api/1.0.0/org.apache.aries.jmx.blueprint.api-1.0.0.jar
[WARNING] We have a duplicate org/apache/aries/jmx/blueprint/JmxConstants.class in /home/hudson/hudson-slave/maven-repositories/0/org/apache/aries/jmx/org.apache.aries.jmx.blueprint.api/1.0.0/org.apache.aries.jmx.blueprint.api-1.0.0.jar
[WARNING] We have a duplicate org/apache/aries/jmx/blueprint/codec/BPBeanArgument.class in
/home/hudson/hudson-slave/maven-repositories/0/org/apache/aries/jmx/org.apache.aries.jmx.blueprint.core/1.0.0/org.apache.aries.jmx.blueprint.core-1.0.0.jar
[WARNING] We have a duplicate org/apache/aries/jmx/blueprint/codec/BPBeanMetadata.class in
/home/hudson/hudson-slave/maven-repositories/0/org/apache/aries/jmx/org.apache.aries.jmx.blueprint.core/1.0.0/org.apache.aries.jmx.blueprint.core-1.0.0.jar
[WARNING] We have a duplicate org/apache/aries/jmx/blueprint/codec/BPBeanProperty.class in
/home/hudson/hudson-slave/maven-repositories/0/org/apache/aries/jmx/org.apache.aries.jmx.blueprint.core/1.0.0/org.apache.aries.jmx.blueprint.core-1.0.0.jar
[WARNING] We have a duplicate org/apache/aries/jmx/blueprint/codec/BPCollectionMetadata.class
in /home/hudson/hudson-slave/maven-repositories/0/org/apache/aries/jmx/org.apache.aries.jmx.blueprint.core/1.0.0/org.apache.aries.jmx.blueprint.core-1.0.0.jar
[WARNING] We have a duplicate org/apache/aries/jmx/blueprint/codec/BPComponentMetadata.class
in /home/hudson/hudson-slave/maven-repositories/0/org/apache/aries/jmx/org.apache.aries.jmx.blueprint.core/1.0.0/org.apache.aries.jmx.blueprint.core-1.0.0.jar
[WARNING] We have a duplicate org/apache/aries/jmx/blueprint/codec/BPIdRefMetadata.class in
/home/hudson/hudson-slave/maven-repositories/0/org/apache/aries/jmx/org.apache.aries.jmx.blueprint.core/1.0.0/org.apache.aries.jmx.blueprint.core-1.0.0.jar
[WARNING] We have a duplicate org/apache/aries/jmx/blueprint/codec/BPMapEntry.class in /home/hudson/hudson-slave/maven-repositories/0/org/apache/aries/jmx/org.apache.aries.jmx.blueprint.core/1.0.0/org.apache.aries.jmx.blueprint.core-1.0.0.jar
[WARNING] We have a duplicate org/apache/aries/jmx/blueprint/codec/BPMapMetadata.class in
/home/hudson/hudson-slave/maven-repositories/0/org/apache/aries/jmx/org.apache.aries.jmx.blueprint.core/1.0.0/org.apache.aries.jmx.blueprint.core-1.0.0.jar
[WARNING] We have a duplicate org/apache/aries/jmx/blueprint/codec/BPMetadata.class in /home/hudson/hudson-slave/maven-repositories/0/org/apache/aries/jmx/org.apache.aries.jmx.blueprint.core/1.0.0/org.apache.aries.jmx.blueprint.core-1.0.0.jar
[WARNING] We have a duplicate org/apache/aries/jmx/blueprint/codec/BPNonNullMetadata.class
in /home/hudson/hudson-slave/maven-repositories/0/org/apache/aries/jmx/org.apache.aries.jmx.blueprint.core/1.0.0/org.apache.aries.jmx.blueprint.core-1.0.0.jar
[WARNING] We have a duplicate org/apache/aries/jmx/blueprint/codec/BPNullMetadata.class in
/home/hudson/hudson-slave/maven-repositories/0/org/apache/aries/jmx/org.apache.aries.jmx.blueprint.core/1.0.0/org.apache.aries.jmx.blueprint.core-1.0.0.jar
[WARNING] We have a duplicate org/apache/aries/jmx/blueprint/codec/BPPropsMetadata.class in
/home/hudson/hudson-slave/maven-repositories/0/org/apache/aries/jmx/org.apache.aries.jmx.blueprint.core/1.0.0/org.apache.aries.jmx.blueprint.core-1.0.0.jar
[WARNING] We have a duplicate org/apache/aries/jmx/blueprint/codec/BPRefMetadata.class in
/home/hudson/hudson-slave/maven-repositories/0/org/apache/aries/jmx/org.apache.aries.jmx.blueprint.core/1.0.0/org.apache.aries.jmx.blueprint.core-1.0.0.jar
[WARNING] We have a duplicate org/apache/aries/jmx/blueprint/codec/BPReferenceListMetadata.class
in /home/hudson/hudson-slave/maven-repositories/0/org/apache/aries/jmx/org.apache.aries.jmx.blueprint.core/1.0.0/org.apache.aries.jmx.blueprint.core-1.0.0.jar
[WARNING] We have a duplicate org/apache/aries/jmx/blueprint/codec/BPReferenceListener.class
in /home/hudson/hudson-slave/maven-repositories/0/org/apache/aries/jmx/org.apache.aries.jmx.blueprint.core/1.0.0/org.apache.aries.jmx.blueprint.core-1.0.0.jar
[WARNING] We have a duplicate org/apache/aries/jmx/blueprint/codec/BPReferenceMetadata.class
in /home/hudson/hudson-slave/maven-repositories/0/org/apache/aries/jmx/org.apache.aries.jmx.blueprint.core/1.0.0/org.apache.aries.jmx.blueprint.core-1.0.0.jar
[WARNING] We have a duplicate org/apache/aries/jmx/blueprint/codec/BPRegistrationListener.class
in /home/hudson/hudson-slave/maven-repositories/0/org/apache/aries/jmx/org.apache.aries.jmx.blueprint.core/1.0.0/org.apache.aries.jmx.blueprint.core-1.0.0.jar
[WARNING] We have a duplicate org/apache/aries/jmx/blueprint/codec/BPServiceMetadata.class
in /home/hudson/hudson-slave/maven-repositories/0/org/apache/aries/jmx/org.apache.aries.jmx.blueprint.core/1.0.0/org.apache.aries.jmx.blueprint.core-1.0.0.jar
[WARNING] We have a duplicate org/apache/aries/jmx/blueprint/codec/BPServiceReferenceMetadata.class
in /home/hudson/hudson-slave/maven-repositories/0/org/apache/aries/jmx/org.apache.aries.jmx.blueprint.core/1.0.0/org.apache.aries.jmx.blueprint.core-1.0.0.jar
[WARNING] We have a duplicate org/apache/aries/jmx/blueprint/codec/BPTarget.class in /home/hudson/hudson-slave/maven-repositories/0/org/apache/aries/jmx/org.apache.aries.jmx.blueprint.core/1.0.0/org.apache.aries.jmx.blueprint.core-1.0.0.jar
[WARNING] We have a duplicate org/apache/aries/jmx/blueprint/codec/BPValueMetadata.class in
/home/hudson/hudson-slave/maven-repositories/0/org/apache/aries/jmx/org.apache.aries.jmx.blueprint.core/1.0.0/org.apache.aries.jmx.blueprint.core-1.0.0.jar
[WARNING] We have a duplicate org/apache/aries/jmx/blueprint/codec/OSGiBlueprintEvent.class
in /home/hudson/hudson-slave/maven-repositories/0/org/apache/aries/jmx/org.apache.aries.jmx.blueprint.core/1.0.0/org.apache.aries.jmx.blueprint.core-1.0.0.jar
[WARNING] We have a duplicate org/apache/aries/jmx/blueprint/codec/TransferObject.class in
/home/hudson/hudson-slave/maven-repositories/0/org/apache/aries/jmx/org.apache.aries.jmx.blueprint.core/1.0.0/org.apache.aries.jmx.blueprint.core-1.0.0.jar
[WARNING] We have a duplicate org/apache/aries/jmx/blueprint/codec/Util.class in /home/hudson/hudson-slave/maven-repositories/0/org/apache/aries/jmx/org.apache.aries.jmx.blueprint.core/1.0.0/org.apache.aries.jmx.blueprint.core-1.0.0.jar
[WARNING] We have a duplicate org/apache/aries/jmx/blueprint/impl/Activator$1.class in /home/hudson/hudson-slave/maven-repositories/0/org/apache/aries/jmx/org.apache.aries.jmx.blueprint.core/1.0.0/org.apache.aries.jmx.blueprint.core-1.0.0.jar
[WARNING] We have a duplicate org/apache/aries/jmx/blueprint/impl/Activator$2.class in /home/hudson/hudson-slave/maven-repositories/0/org/apache/aries/jmx/org.apache.aries.jmx.blueprint.core/1.0.0/org.apache.aries.jmx.blueprint.core-1.0.0.jar
[WARNING] We have a duplicate org/apache/aries/jmx/blueprint/impl/Activator$MBeanServerServiceTracker.class
in /home/hudson/hudson-slave/maven-repositories/0/org/apache/aries/jmx/org.apache.aries.jmx.blueprint.core/1.0.0/org.apache.aries.jmx.blueprint.core-1.0.0.jar
[WARNING] We have a duplicate org/apache/aries/jmx/blueprint/impl/Activator.class in /home/hudson/hudson-slave/maven-repositories/0/org/apache/aries/jmx/org.apache.aries.jmx.blueprint.core/1.0.0/org.apache.aries.jmx.blueprint.core-1.0.0.jar
[WARNING] We have a duplicate org/apache/aries/jmx/blueprint/impl/BlueprintMetadata.class
in /home/hudson/hudson-slave/maven-repositories/0/org/apache/aries/jmx/org.apache.aries.jmx.blueprint.core/1.0.0/org.apache.aries.jmx.blueprint.core-1.0.0.jar
[WARNING] We have a duplicate org/apache/aries/jmx/blueprint/impl/BlueprintState$1.class in
/home/hudson/hudson-slave/maven-repositories/0/org/apache/aries/jmx/org.apache.aries.jmx.blueprint.core/1.0.0/org.apache.aries.jmx.blueprint.core-1.0.0.jar
[WARNING] We have a duplicate org/apache/aries/jmx/blueprint/impl/BlueprintState$BlueprintStateListener.class
in /home/hudson/hudson-slave/maven-repositories/0/org/apache/aries/jmx/org.apache.aries.jmx.blueprint.core/1.0.0/org.apache.aries.jmx.blueprint.core-1.0.0.jar
[WARNING] We have a duplicate org/apache/aries/jmx/blueprint/impl/BlueprintState$JMXThreadFactory.class
in /home/hudson/hudson-slave/maven-repositories/0/org/apache/aries/jmx/org.apache.aries.jmx.blueprint.core/1.0.0/org.apache.aries.jmx.blueprint.core-1.0.0.jar
[WARNING] We have a duplicate org/apache/aries/jmx/blueprint/impl/BlueprintState.class in
/home/hudson/hudson-slave/maven-repositories/0/org/apache/aries/jmx/org.apache.aries.jmx.blueprint.core/1.0.0/org.apache.aries.jmx.blueprint.core-1.0.0.jar
[WARNING] We have a duplicate org/apache/aries/jmx/blueprint/impl/RegistrableStandardEmitterMBean.class
in /home/hudson/hudson-slave/maven-repositories/0/org/apache/aries/jmx/org.apache.aries.jmx.blueprint.core/1.0.0/org.apache.aries.jmx.blueprint.core-1.0.0.jar
[INFO] Replacing original artifact with shaded artifact.
[INFO] Replacing <https://builds.apache.org/job/Aries/ws/aries/jmx/jmx-blueprint-bundle/target/org.apache.aries.jmx.blueprint-1.0.0-SNAPSHOT.jar>
with <https://builds.apache.org/job/Aries/ws/aries/jmx/jmx-blueprint-bundle/target/org.apache.aries.jmx.blueprint-1.0.0-SNAPSHOT-shaded.jar>
[INFO] [ianal:verify-legal-files {execution: default}]
[INFO] Checking legal files in: org.apache.aries.jmx.blueprint-1.0.0-SNAPSHOT.jar
[INFO] [install:install {execution: default-install}]
[INFO] Installing <https://builds.apache.org/job/Aries/ws/aries/jmx/jmx-blueprint-bundle/target/org.apache.aries.jmx.blueprint-1.0.0-SNAPSHOT.jar>
to /home/hudson/hudson-slave/maven-repositories/0/org/apache/aries/jmx/org.apache.aries.jmx.blueprint/1.0.0-SNAPSHOT/org.apache.aries.jmx.blueprint-1.0.0-SNAPSHOT.jar
[INFO] [bundle:install {execution: default-install}]
[INFO] Installing org/apache/aries/jmx/org.apache.aries.jmx.blueprint/1.0.0-SNAPSHOT/org.apache.aries.jmx.blueprint-1.0.0-SNAPSHOT.jar
[INFO] Writing OBR metadata
[JENKINS] Archiving <https://builds.apache.org/job/Aries/ws/aries/jmx/jmx-blueprint-bundle/dependency-reduced-pom.xml>
to /home/hudson/hudson/jobs/Aries/modules/org.apache.aries.jmx$org.apache.aries.jmx.blueprint/builds/2012-07-24_23-52-11/archive/org.apache.aries.jmx/org.apache.aries.jmx.blueprint/1.0.0-SNAPSHOT/org.apache.aries.jmx.blueprint-1.0.0-SNAPSHOT.pom
[JENKINS] Archiving <https://builds.apache.org/job/Aries/ws/aries/jmx/jmx-blueprint-bundle/target/org.apache.aries.jmx.blueprint-1.0.0-SNAPSHOT.jar>
to /home/hudson/hudson/jobs/Aries/modules/org.apache.aries.jmx$org.apache.aries.jmx.blueprint/builds/2012-07-24_23-52-11/archive/org.apache.aries.jmx/org.apache.aries.jmx.blueprint/1.0.0-SNAPSHOT/org.apache.aries.jmx.blueprint-1.0.0-SNAPSHOT.jar
[INFO] ------------------------------------------------------------------------
[INFO] Building Apache Aries JMX integration tests
[INFO]    task-segment: [clean, install]
[INFO] ------------------------------------------------------------------------
[INFO] [clean:clean {execution: default-clean}]
[INFO] Deleting file set: <https://builds.apache.org/job/Aries/ws/aries/jmx/jmx-itests/target>
(included: [**], excluded: [])
Downloading: http://download.eclipse.org/rt/eclipselink/maven.repo//org/apache/aries/jmx/org.apache.aries.jmx/1.0.0/org.apache.aries.jmx-1.0.0.pom
[INFO] Unable to find resource 'org.apache.aries.jmx:org.apache.aries.jmx:pom:1.0.0' in repository
EclipseLink Repo (http://download.eclipse.org/rt/eclipselink/maven.repo/)
Downloading: http://repo1.maven.org/maven2/org/apache/aries/jmx/org.apache.aries.jmx/1.0.0/org.apache.aries.jmx-1.0.0.pom
[INFO] Unable to find resource 'org.apache.aries.jmx:org.apache.aries.jmx:pom:1.0.0' in repository
central (http://repo1.maven.org/maven2)
Downloading: http://download.eclipse.org/rt/eclipselink/maven.repo//org/apache/aries/jmx/org.apache.aries.jmx.whiteboard/1.0.0/org.apache.aries.jmx.whiteboard-1.0.0.pom
[INFO] Unable to find resource 'org.apache.aries.jmx:org.apache.aries.jmx.whiteboard:pom:1.0.0'
in repository EclipseLink Repo (http://download.eclipse.org/rt/eclipselink/maven.repo/)
Downloading: http://repo1.maven.org/maven2/org/apache/aries/jmx/org.apache.aries.jmx.whiteboard/1.0.0/org.apache.aries.jmx.whiteboard-1.0.0.pom
8K downloaded  (org.apache.aries.jmx.whiteboard-1.0.0.pom)
Downloading: http://download.eclipse.org/rt/eclipselink/maven.repo//org/apache/aries/jmx/org.apache.aries.jmx.core.whiteboard/1.0.0/org.apache.aries.jmx.core.whiteboard-1.0.0.pom
[INFO] Unable to find resource 'org.apache.aries.jmx:org.apache.aries.jmx.core.whiteboard:pom:1.0.0'
in repository EclipseLink Repo (http://download.eclipse.org/rt/eclipselink/maven.repo/)
Downloading: http://repo1.maven.org/maven2/org/apache/aries/jmx/org.apache.aries.jmx.core.whiteboard/1.0.0/org.apache.aries.jmx.core.whiteboard-1.0.0.pom
4K downloaded  (org.apache.aries.jmx.core.whiteboard-1.0.0.pom)
Downloading: http://download.eclipse.org/rt/eclipselink/maven.repo//org/apache/aries/jmx/org.apache.aries.jmx/1.0.0/org.apache.aries.jmx-1.0.0.jar
[INFO] Unable to find resource 'org.apache.aries.jmx:org.apache.aries.jmx:jar:1.0.0' in repository
EclipseLink Repo (http://download.eclipse.org/rt/eclipselink/maven.repo/)
Downloading: http://repo1.maven.org/maven2/org/apache/aries/jmx/org.apache.aries.jmx/1.0.0/org.apache.aries.jmx-1.0.0.jar
[INFO] Unable to find resource 'org.apache.aries.jmx:org.apache.aries.jmx:jar:1.0.0' in repository
central (http://repo1.maven.org/maven2)
[INFO] snapshot org.apache.aries.jmx:org.apache.aries.jmx.blueprint:1.0.0-SNAPSHOT: checking
for updates from codehaus.snapshots
[INFO] snapshot org.apache.aries.jmx:org.apache.aries.jmx.blueprint:1.0.0-SNAPSHOT: checking
for updates from EclipseLink Repo
[INFO] snapshot org.apache.aries.jmx:org.apache.aries.jmx.blueprint:1.0.0-SNAPSHOT: checking
for updates from apache.snapshots
Downloading: http://download.eclipse.org/rt/eclipselink/maven.repo//org/apache/aries/jmx/org.apache.aries.jmx.whiteboard/1.0.0/org.apache.aries.jmx.whiteboard-1.0.0.jar
[INFO] Unable to find resource 'org.apache.aries.jmx:org.apache.aries.jmx.whiteboard:jar:1.0.0'
in repository EclipseLink Repo (http://download.eclipse.org/rt/eclipselink/maven.repo/)
Downloading: http://repo1.maven.org/maven2/org/apache/aries/jmx/org.apache.aries.jmx.whiteboard/1.0.0/org.apache.aries.jmx.whiteboard-1.0.0.jar
19K downloaded  (org.apache.aries.jmx.whiteboard-1.0.0.jar)
Downloading: http://download.eclipse.org/rt/eclipselink/maven.repo//org/apache/aries/jmx/org.apache.aries.jmx.core.whiteboard/1.0.0/org.apache.aries.jmx.core.whiteboard-1.0.0.jar
[INFO] Unable to find resource 'org.apache.aries.jmx:org.apache.aries.jmx.core.whiteboard:jar:1.0.0'
in repository EclipseLink Repo (http://download.eclipse.org/rt/eclipselink/maven.repo/)
Downloading: http://repo1.maven.org/maven2/org/apache/aries/jmx/org.apache.aries.jmx.core.whiteboard/1.0.0/org.apache.aries.jmx.core.whiteboard-1.0.0.jar
116K downloaded  (org.apache.aries.jmx.core.whiteboard-1.0.0.jar)
[JENKINS] Archiving <https://builds.apache.org/job/Aries/ws/aries/jmx/jmx-itests/pom.xml>
to /home/hudson/hudson/jobs/Aries/modules/org.apache.aries.jmx$org.apache.aries.jmx.itests/builds/2012-07-24_23-52-11/archive/org.apache.aries.jmx/org.apache.aries.jmx.itests/1.0.0-SNAPSHOT/org.apache.aries.jmx.itests-1.0.0-SNAPSHOT.pom
[INFO] ------------------------------------------------------------------------
[ERROR] BUILD ERROR
[INFO] ------------------------------------------------------------------------
[INFO] Failed to resolve artifact.

Missing:
----------
1) org.apache.aries.jmx:org.apache.aries.jmx:jar:1.0.0

  Try downloading the file manually from the project website.

  Then, install it using the command: 
      mvn install:install-file -DgroupId=org.apache.aries.jmx -DartifactId=org.apache.aries.jmx
-Dversion=1.0.0 -Dpackaging=jar -Dfile=/path/to/file

  Alternatively, if you host your own repository you can deploy the file there: 
      mvn deploy:deploy-file -DgroupId=org.apache.aries.jmx -DartifactId=org.apache.aries.jmx
-Dversion=1.0.0 -Dpackaging=jar -Dfile=/path/to/file -Durl=[url] -DrepositoryId=[id]

  Path to dependency: 
  	1) org.apache.aries.jmx:org.apache.aries.jmx.itests:jar:1.0.0-SNAPSHOT
  	2) org.apache.aries.jmx:org.apache.aries.jmx:jar:1.0.0

----------
1 required artifact is missing.

for artifact: 
  org.apache.aries.jmx:org.apache.aries.jmx.itests:jar:1.0.0-SNAPSHOT

from the specified remote repositories:
  codehaus.snapshots (http://snapshots.repository.codehaus.org),
  central (http://repo1.maven.org/maven2),
  Nexus (http://repository.apache.org/snapshots),
  EclipseLink Repo (http://download.eclipse.org/rt/eclipselink/maven.repo/)



[INFO] ------------------------------------------------------------------------
[INFO] Trace
org.apache.maven.lifecycle.LifecycleExecutionException: Missing:
----------
1) org.apache.aries.jmx:org.apache.aries.jmx:jar:1.0.0

  Try downloading the file manually from the project website.

  Then, install it using the command: 
      mvn install:install-file -DgroupId=org.apache.aries.jmx -DartifactId=org.apache.aries.jmx
-Dversion=1.0.0 -Dpackaging=jar -Dfile=/path/to/file

  Alternatively, if you host your own repository you can deploy the file there: 
      mvn deploy:deploy-file -DgroupId=org.apache.aries.jmx -DartifactId=org.apache.aries.jmx
-Dversion=1.0.0 -Dpackaging=jar -Dfile=/path/to/file -Durl=[url] -DrepositoryId=[id]

  Path to dependency: 
  	1) org.apache.aries.jmx:org.apache.aries.jmx.itests:jar:1.0.0-SNAPSHOT
  	2) org.apache.aries.jmx:org.apache.aries.jmx:jar:1.0.0

----------
1 required artifact is missing.

for artifact: 
  org.apache.aries.jmx:org.apache.aries.jmx.itests:jar:1.0.0-SNAPSHOT

from the specified remote repositories:
  codehaus.snapshots (http://snapshots.repository.codehaus.org),
  central (http://repo1.maven.org/maven2),
  Nexus (http://repository.apache.org/snapshots),
  EclipseLink Repo (http://download.eclipse.org/rt/eclipselink/maven.repo/)


	at org.apache.maven.lifecycle.DefaultLifecycleExecutor.executeGoals(DefaultLifecycleExecutor.java:711)
	at org.apache.maven.lifecycle.DefaultLifecycleExecutor.executeGoalWithLifecycle(DefaultLifecycleExecutor.java:556)
	at org.apache.maven.lifecycle.DefaultLifecycleExecutor.executeGoal(DefaultLifecycleExecutor.java:535)
	at org.apache.maven.lifecycle.DefaultLifecycleExecutor.executeGoalAndHandleFailures(DefaultLifecycleExecutor.java:387)
	at org.apache.maven.lifecycle.DefaultLifecycleExecutor.executeTaskSegments(DefaultLifecycleExecutor.java:348)
	at org.apache.maven.lifecycle.DefaultLifecycleExecutor.execute(DefaultLifecycleExecutor.java:180)
	at org.apache.maven.lifecycle.LifecycleExecutorInterceptor.execute(LifecycleExecutorInterceptor.java:65)
	at org.apache.maven.DefaultMaven.doExecute(DefaultMaven.java:328)
	at org.apache.maven.DefaultMaven.execute(DefaultMaven.java:138)
	at org.apache.maven.cli.MavenCli.main(MavenCli.java:362)
	at sun.reflect.NativeMethodAccessorImpl.invoke0(Native Method)
	at sun.reflect.NativeMethodAccessorImpl.invoke(NativeMethodAccessorImpl.java:39)
	at sun.reflect.DelegatingMethodAccessorImpl.invoke(DelegatingMethodAccessorImpl.java:25)
	at java.lang.reflect.Method.invoke(Method.java:597)
	at org.codehaus.classworlds.Launcher.launchEnhanced(Launcher.java:315)
	at org.codehaus.classworlds.Launcher.launch(Launcher.java:255)
	at hudson.maven.agent.Main.launch(Main.java:185)
	at hudson.maven.MavenBuilder.call(MavenBuilder.java:151)
	at hudson.maven.Maven2Builder.call(Maven2Builder.java:77)
	at hudson.maven.Maven2Builder.call(Maven2Builder.java:53)
	at hudson.remoting.UserRequest.perform(UserRequest.java:118)
	at hudson.remoting.UserRequest.perform(UserRequest.java:48)
	at hudson.remoting.Request$2.run(Request.java:326)
	at hudson.remoting.InterceptingExecutorService$1.call(InterceptingExecutorService.java:72)
	at java.util.concurrent.FutureTask$Sync.innerRun(FutureTask.java:303)
	at java.util.concurrent.FutureTask.run(FutureTask.java:138)
	at java.util.concurrent.ThreadPoolExecutor$Worker.runTask(ThreadPoolExecutor.java:886)
	at java.util.concurrent.ThreadPoolExecutor$Worker.run(ThreadPoolExecutor.java:908)
	at java.lang.Thread.run(Thread.java:662)
Caused by: org.apache.maven.artifact.resolver.MultipleArtifactsNotFoundException: Missing:
----------
1) org.apache.aries.jmx:org.apache.aries.jmx:jar:1.0.0

  Try downloading the file manually from the project website.

  Then, install it using the command: 
      mvn install:install-file -DgroupId=org.apache.aries.jmx -DartifactId=org.apache.aries.jmx
-Dversion=1.0.0 -Dpackaging=jar -Dfile=/path/to/file

  Alternatively, if you host your own repository you can deploy the file there: 
      mvn deploy:deploy-file -DgroupId=org.apache.aries.jmx -DartifactId=org.apache.aries.jmx
-Dversion=1.0.0 -Dpackaging=jar -Dfile=/path/to/file -Durl=[url] -DrepositoryId=[id]

  Path to dependency: 
  	1) org.apache.aries.jmx:org.apache.aries.jmx.itests:jar:1.0.0-SNAPSHOT
  	2) org.apache.aries.jmx:org.apache.aries.jmx:jar:1.0.0

----------
1 required artifact is missing.

for artifact: 
  org.apache.aries.jmx:org.apache.aries.jmx.itests:jar:1.0.0-SNAPSHOT

from the specified remote repositories:
  codehaus.snapshots (http://snapshots.repository.codehaus.org),
  central (http://repo1.maven.org/maven2),
  Nexus (http://repository.apache.org/snapshots),
  EclipseLink Repo (http://download.eclipse.org/rt/eclipselink/maven.repo/)


	at org.apache.maven.artifact.resolver.DefaultArtifactResolver.resolveTransitively(DefaultArtifactResolver.java:360)
	at org.apache.maven.artifact.resolver.DefaultArtifactResolver.resolveTransitively(DefaultArtifactResolver.java:304)
	at org.apache.maven.plugin.DefaultPluginManager.resolveTransitiveDependencies(DefaultPluginManager.java:1499)
	at org.apache.maven.plugin.DefaultPluginManager.executeMojo(DefaultPluginManager.java:442)
	at hudson.maven.agent.PluginManagerInterceptor.executeMojo(PluginManagerInterceptor.java:182)
	at org.apache.maven.lifecycle.DefaultLifecycleExecutor.executeGoals(DefaultLifecycleExecutor.java:694)
	... 28 more
[INFO] ------------------------------------------------------------------------
[INFO] Total time: 24 minutes 37 seconds
[INFO] Finished at: Wed Jul 25 00:17:13 UTC 2012
[INFO] Final Memory: 230M/908M
[INFO] ------------------------------------------------------------------------
channel stopped

Mime
View raw message