aries-dev mailing list archives

Site index · List index
Message view « Date » · « Thread »
Top « Date » · « Thread »
From Apache Jenkins Server <jenk...@builds.apache.org>
Subject Build failed in Jenkins: Aries #1571
Date Tue, 17 Jul 2012 22:48:47 GMT
See <https://builds.apache.org/job/Aries/1571/changes>

Changes:

[cumminsh] [ARIES-862] Accidentally rolled forward to non-release release of blueprint-parser.
Rolling back.

------------------------------------------
[...truncated 5221 lines...]
[INFO] Unable to find resource 'org.apache.geronimo.specs:geronimo-jcdi_1.0_spec:jar:sources:1.0'
in repository EclipseLink Repo (http://download.eclipse.org/rt/eclipselink/maven.repo/)
Downloading: http://repo1.maven.org/maven2/org/apache/geronimo/specs/geronimo-jcdi_1.0_spec/1.0/geronimo-jcdi_1.0_spec-1.0-sources.jar
78K downloaded  (geronimo-jcdi_1.0_spec-1.0-sources.jar)
Downloading: http://download.eclipse.org/rt/eclipselink/maven.repo//org/apache/geronimo/specs/geronimo-jms_1.1_spec/1.1.1/geronimo-jms_1.1_spec-1.1.1-sources.jar
[INFO] Unable to find resource 'org.apache.geronimo.specs:geronimo-jms_1.1_spec:jar:sources:1.1.1'
in repository EclipseLink Repo (http://download.eclipse.org/rt/eclipselink/maven.repo/)
Downloading: http://repo1.maven.org/maven2/org/apache/geronimo/specs/geronimo-jms_1.1_spec/1.1.1/geronimo-jms_1.1_spec-1.1.1-sources.jar
56K downloaded  (geronimo-jms_1.1_spec-1.1.1-sources.jar)
Downloading: http://download.eclipse.org/rt/eclipselink/maven.repo//org/apache/geronimo/specs/geronimo-jpa_2.0_spec/1.1/geronimo-jpa_2.0_spec-1.1-sources.jar
[INFO] Unable to find resource 'org.apache.geronimo.specs:geronimo-jpa_2.0_spec:jar:sources:1.1'
in repository EclipseLink Repo (http://download.eclipse.org/rt/eclipselink/maven.repo/)
Downloading: http://repo1.maven.org/maven2/org/apache/geronimo/specs/geronimo-jpa_2.0_spec/1.1/geronimo-jpa_2.0_spec-1.1-sources.jar
152K downloaded  (geronimo-jpa_2.0_spec-1.1-sources.jar)
Downloading: http://download.eclipse.org/rt/eclipselink/maven.repo//org/apache/geronimo/specs/geronimo-jsp_2.2_spec/1.0/geronimo-jsp_2.2_spec-1.0-sources.jar
[INFO] Unable to find resource 'org.apache.geronimo.specs:geronimo-jsp_2.2_spec:jar:sources:1.0'
in repository EclipseLink Repo (http://download.eclipse.org/rt/eclipselink/maven.repo/)
Downloading: http://repo1.maven.org/maven2/org/apache/geronimo/specs/geronimo-jsp_2.2_spec/1.0/geronimo-jsp_2.2_spec-1.0-sources.jar
123K downloaded  (geronimo-jsp_2.2_spec-1.0-sources.jar)
Downloading: http://download.eclipse.org/rt/eclipselink/maven.repo//org/apache/geronimo/specs/geronimo-jta_1.1_spec/1.1.1/geronimo-jta_1.1_spec-1.1.1-sources.jar
[INFO] Unable to find resource 'org.apache.geronimo.specs:geronimo-jta_1.1_spec:jar:sources:1.1.1'
in repository EclipseLink Repo (http://download.eclipse.org/rt/eclipselink/maven.repo/)
Downloading: http://repo1.maven.org/maven2/org/apache/geronimo/specs/geronimo-jta_1.1_spec/1.1.1/geronimo-jta_1.1_spec-1.1.1-sources.jar
21K downloaded  (geronimo-jta_1.1_spec-1.1.1-sources.jar)
Downloading: http://download.eclipse.org/rt/eclipselink/maven.repo//org/apache/geronimo/specs/geronimo-saaj_1.3_spec/1.1/geronimo-saaj_1.3_spec-1.1-sources.jar
[INFO] Unable to find resource 'org.apache.geronimo.specs:geronimo-saaj_1.3_spec:jar:sources:1.1'
in repository EclipseLink Repo (http://download.eclipse.org/rt/eclipselink/maven.repo/)
Downloading: http://repo1.maven.org/maven2/org/apache/geronimo/specs/geronimo-saaj_1.3_spec/1.1/geronimo-saaj_1.3_spec-1.1-sources.jar
54K downloaded  (geronimo-saaj_1.3_spec-1.1-sources.jar)
Downloading: http://download.eclipse.org/rt/eclipselink/maven.repo//org/apache/geronimo/specs/geronimo-servlet_3.0_spec/1.0/geronimo-servlet_3.0_spec-1.0-sources.jar
[INFO] Unable to find resource 'org.apache.geronimo.specs:geronimo-servlet_3.0_spec:jar:sources:1.0'
in repository EclipseLink Repo (http://download.eclipse.org/rt/eclipselink/maven.repo/)
Downloading: http://repo1.maven.org/maven2/org/apache/geronimo/specs/geronimo-servlet_3.0_spec/1.0/geronimo-servlet_3.0_spec-1.0-sources.jar
146K downloaded  (geronimo-servlet_3.0_spec-1.0-sources.jar)
Downloading: http://download.eclipse.org/rt/eclipselink/maven.repo//org/apache/geronimo/specs/geronimo-stax-api_1.2_spec/1.1/geronimo-stax-api_1.2_spec-1.1-sources.jar
[INFO] Unable to find resource 'org.apache.geronimo.specs:geronimo-stax-api_1.2_spec:jar:sources:1.1'
in repository EclipseLink Repo (http://download.eclipse.org/rt/eclipselink/maven.repo/)
Downloading: http://repo1.maven.org/maven2/org/apache/geronimo/specs/geronimo-stax-api_1.2_spec/1.1/geronimo-stax-api_1.2_spec-1.1-sources.jar
37K downloaded  (geronimo-stax-api_1.2_spec-1.1-sources.jar)
Downloading: http://download.eclipse.org/rt/eclipselink/maven.repo//org/apache/geronimo/specs/geronimo-validation_1.0_spec/1.1/geronimo-validation_1.0_spec-1.1-sources.jar
[INFO] Unable to find resource 'org.apache.geronimo.specs:geronimo-validation_1.0_spec:jar:sources:1.1'
in repository EclipseLink Repo (http://download.eclipse.org/rt/eclipselink/maven.repo/)
Downloading: http://repo1.maven.org/maven2/org/apache/geronimo/specs/geronimo-validation_1.0_spec/1.1/geronimo-validation_1.0_spec-1.1-sources.jar
47K downloaded  (geronimo-validation_1.0_spec-1.1-sources.jar)
Downloading: http://download.eclipse.org/rt/eclipselink/maven.repo//org/apache/geronimo/specs/geronimo-ws-metadata_2.0_spec/1.1.3/geronimo-ws-metadata_2.0_spec-1.1.3-sources.jar
[INFO] Unable to find resource 'org.apache.geronimo.specs:geronimo-ws-metadata_2.0_spec:jar:sources:1.1.3'
in repository EclipseLink Repo (http://download.eclipse.org/rt/eclipselink/maven.repo/)
Downloading: http://repo1.maven.org/maven2/org/apache/geronimo/specs/geronimo-ws-metadata_2.0_spec/1.1.3/geronimo-ws-metadata_2.0_spec-1.1.3-sources.jar
13K downloaded  (geronimo-ws-metadata_2.0_spec-1.1.3-sources.jar)
Downloading: http://download.eclipse.org/rt/eclipselink/maven.repo//org/apache/geronimo/specs/geronimo-osgi-locator/1.0/geronimo-osgi-locator-1.0-sources.jar
[INFO] Unable to find resource 'org.apache.geronimo.specs:geronimo-osgi-locator:jar:sources:1.0'
in repository EclipseLink Repo (http://download.eclipse.org/rt/eclipselink/maven.repo/)
Downloading: http://repo1.maven.org/maven2/org/apache/geronimo/specs/geronimo-osgi-locator/1.0/geronimo-osgi-locator-1.0-sources.jar
11K downloaded  (geronimo-osgi-locator-1.0-sources.jar)
[INFO] [enforcer:enforce {execution: default}]
[INFO] [remote-resources:process {execution: default}]
[WARNING] org.apache.velocity.runtime.exception.ReferenceException: reference : template =
META-INF/DEPENDENCIES.vm [line 40,column 14] : $license.name is not a valid reference.
[WARNING] org.apache.velocity.runtime.exception.ReferenceException: reference : template =
META-INF/DEPENDENCIES.vm [line 40,column 14] : $license.name is not a valid reference.
[INFO] [resources:resources {execution: default-resources}]
[INFO] Using 'UTF-8' encoding to copy filtered resources.
[INFO] Copying 2 resources
[INFO] skip non existing resourceDirectory <https://builds.apache.org/job/Aries/ws/aries/ejb/ejb-modeller/src/main/filtered-resources>
[INFO] Copying 0 resource
[INFO] Copying 3 resources
[INFO] [compiler:compile {execution: default-compile}]
[INFO] Compiling 10 source files to <https://builds.apache.org/job/Aries/ws/aries/ejb/ejb-modeller/target/classes>
[INFO] [resources:testResources {execution: default-testResources}]
[INFO] Using 'UTF-8' encoding to copy filtered resources.
[INFO] Copying 5 resources
[INFO] skip non existing resourceDirectory <https://builds.apache.org/job/Aries/ws/aries/ejb/ejb-modeller/src/test/filtered-resources>
[INFO] Copying 3 resources
[INFO] [compiler:testCompile {execution: default-testCompile}]
[INFO] Compiling 6 source files to <https://builds.apache.org/job/Aries/ws/aries/ejb/ejb-modeller/target/test-classes>
[INFO] [surefire:test {execution: default-test}]
[INFO] Surefire report directory: <https://builds.apache.org/job/Aries/ws/aries/ejb/ejb-modeller/target/surefire-reports>

-------------------------------------------------------
 T E S T S
-------------------------------------------------------
Running org.apache.aries.ejb.modelling.impl.EJBModellerTest
Tests run: 4, Failures: 0, Errors: 0, Skipped: 0, Time elapsed: 0.053 sec
Running org.apache.aries.ejb.modelling.impl.EJBLocatorFactoryTest
Tests run: 2, Failures: 0, Errors: 0, Skipped: 0, Time elapsed: 0.072 sec
Running org.apache.aries.ejb.modelling.impl.EJBLocatorTest
Tests run: 12, Failures: 0, Errors: 0, Skipped: 0, Time elapsed: 0.609 sec
Running org.apache.aries.ejb.modelling.impl.ParsedEJBServicesTest
Tests run: 6, Failures: 0, Errors: 0, Skipped: 0, Time elapsed: 0.008 sec

Results :

Tests run: 24, Failures: 0, Errors: 0, Skipped: 0

[JENKINS] Recording test results
[INFO] [enforcer:enforce {execution: check-java15}]
[INFO] Checking unresolved references to org.codehaus.mojo.signature:java15:1.0
[INFO] [bundle:bundle {execution: default-bundle}]
[INFO] [ianal:verify-legal-files {execution: default}]
[INFO] Checking legal files in: org.apache.aries.ejb.modeller-1.0.0-SNAPSHOT.jar
[INFO] [install:install {execution: default-install}]
[INFO] Installing <https://builds.apache.org/job/Aries/ws/aries/ejb/ejb-modeller/target/org.apache.aries.ejb.modeller-1.0.0-SNAPSHOT.jar>
to /home/jenkins/jenkins-slave/maven-repositories/1/org/apache/aries/ejb/org.apache.aries.ejb.modeller/1.0.0-SNAPSHOT/org.apache.aries.ejb.modeller-1.0.0-SNAPSHOT.jar
[INFO] [bundle:install {execution: default-install}]
[INFO] Installing org/apache/aries/ejb/org.apache.aries.ejb.modeller/1.0.0-SNAPSHOT/org.apache.aries.ejb.modeller-1.0.0-SNAPSHOT.jar
[INFO] Writing OBR metadata
[JENKINS] Archiving <https://builds.apache.org/job/Aries/ws/aries/ejb/ejb-modeller/pom.xml>
to /home/hudson/hudson/jobs/Aries/modules/org.apache.aries.ejb$org.apache.aries.ejb.modeller/builds/2012-07-17_22-34-55/archive/org.apache.aries.ejb/org.apache.aries.ejb.modeller/1.0.0-SNAPSHOT/org.apache.aries.ejb.modeller-1.0.0-SNAPSHOT.pom
[JENKINS] Archiving <https://builds.apache.org/job/Aries/ws/aries/ejb/ejb-modeller/target/org.apache.aries.ejb.modeller-1.0.0-SNAPSHOT.jar>
to /home/hudson/hudson/jobs/Aries/modules/org.apache.aries.ejb$org.apache.aries.ejb.modeller/builds/2012-07-17_22-34-55/archive/org.apache.aries.ejb/org.apache.aries.ejb.modeller/1.0.0-SNAPSHOT/org.apache.aries.ejb.modeller-1.0.0-SNAPSHOT.jar
[INFO] ------------------------------------------------------------------------
[INFO] Building Apache Aries Application Modelling Standalone
[INFO]    task-segment: [clean, install]
[INFO] ------------------------------------------------------------------------
[INFO] [clean:clean {execution: default-clean}]
[INFO] Deleting file set: <https://builds.apache.org/job/Aries/ws/aries/application/application-modeller-standalone/target>
(included: [**], excluded: [])
Downloading: http://download.eclipse.org/rt/eclipselink/maven.repo//org/apache/aries/blueprint/blueprint-parser/1.0.0/blueprint-parser-1.0.0.pom
[INFO] Unable to find resource 'org.apache.aries.blueprint:blueprint-parser:pom:1.0.0' in
repository EclipseLink Repo (http://download.eclipse.org/rt/eclipselink/maven.repo/)
Downloading: http://repo1.maven.org/maven2/org/apache/aries/blueprint/blueprint-parser/1.0.0/blueprint-parser-1.0.0.pom
[INFO] Unable to find resource 'org.apache.aries.blueprint:blueprint-parser:pom:1.0.0' in
repository central (http://repo1.maven.org/maven2)
[INFO] snapshot org.apache.aries.ejb:org.apache.aries.ejb.modeller:1.0.0-SNAPSHOT: checking
for updates from codehaus.snapshots
Downloading: http://download.eclipse.org/rt/eclipselink/maven.repo//org/apache/aries/blueprint/blueprint-parser/1.0.0/blueprint-parser-1.0.0.jar
[INFO] Unable to find resource 'org.apache.aries.blueprint:blueprint-parser:jar:1.0.0' in
repository EclipseLink Repo (http://download.eclipse.org/rt/eclipselink/maven.repo/)
Downloading: http://repo1.maven.org/maven2/org/apache/aries/blueprint/blueprint-parser/1.0.0/blueprint-parser-1.0.0.jar
[INFO] Unable to find resource 'org.apache.aries.blueprint:blueprint-parser:jar:1.0.0' in
repository central (http://repo1.maven.org/maven2)
[INFO] snapshot org.apache.aries.ejb:org.apache.aries.ejb.modeller:1.0.0-SNAPSHOT: checking
for updates from EclipseLink Repo
[INFO] snapshot org.apache.aries.ejb:org.apache.aries.ejb.modeller:1.0.0-SNAPSHOT: checking
for updates from apache.snapshots
[JENKINS] Archiving <https://builds.apache.org/job/Aries/ws/aries/application/application-modeller-standalone/pom.xml>
to /home/hudson/hudson/jobs/Aries/modules/org.apache.aries.application$application-modeller-standalone/builds/2012-07-17_22-34-55/archive/org.apache.aries.application/application-modeller-standalone/1.0.0-SNAPSHOT/application-modeller-standalone-1.0.0-SNAPSHOT.pom
[INFO] ------------------------------------------------------------------------
[ERROR] BUILD ERROR
[INFO] ------------------------------------------------------------------------
[INFO] Failed to resolve artifact.

Missing:
----------
1) org.apache.aries.blueprint:blueprint-parser:jar:1.0.0

  Try downloading the file manually from the project website.

  Then, install it using the command: 
      mvn install:install-file -DgroupId=org.apache.aries.blueprint -DartifactId=blueprint-parser
-Dversion=1.0.0 -Dpackaging=jar -Dfile=/path/to/file

  Alternatively, if you host your own repository you can deploy the file there: 
      mvn deploy:deploy-file -DgroupId=org.apache.aries.blueprint -DartifactId=blueprint-parser
-Dversion=1.0.0 -Dpackaging=jar -Dfile=/path/to/file -Durl=[url] -DrepositoryId=[id]

  Path to dependency: 
  	1) org.apache.aries.application:application-modeller-standalone:jar:1.0.0-SNAPSHOT
  	2) org.apache.aries.blueprint:blueprint-parser:jar:1.0.0

----------
1 required artifact is missing.

for artifact: 
  org.apache.aries.application:application-modeller-standalone:jar:1.0.0-SNAPSHOT

from the specified remote repositories:
  codehaus.snapshots (http://snapshots.repository.codehaus.org),
  central (http://repo1.maven.org/maven2),
  Nexus (http://repository.apache.org/snapshots),
  EclipseLink Repo (http://download.eclipse.org/rt/eclipselink/maven.repo/)



[INFO] ------------------------------------------------------------------------
[INFO] Trace
org.apache.maven.lifecycle.LifecycleExecutionException: Missing:
----------
1) org.apache.aries.blueprint:blueprint-parser:jar:1.0.0

  Try downloading the file manually from the project website.

  Then, install it using the command: 
      mvn install:install-file -DgroupId=org.apache.aries.blueprint -DartifactId=blueprint-parser
-Dversion=1.0.0 -Dpackaging=jar -Dfile=/path/to/file

  Alternatively, if you host your own repository you can deploy the file there: 
      mvn deploy:deploy-file -DgroupId=org.apache.aries.blueprint -DartifactId=blueprint-parser
-Dversion=1.0.0 -Dpackaging=jar -Dfile=/path/to/file -Durl=[url] -DrepositoryId=[id]

  Path to dependency: 
  	1) org.apache.aries.application:application-modeller-standalone:jar:1.0.0-SNAPSHOT
  	2) org.apache.aries.blueprint:blueprint-parser:jar:1.0.0

----------
1 required artifact is missing.

for artifact: 
  org.apache.aries.application:application-modeller-standalone:jar:1.0.0-SNAPSHOT

from the specified remote repositories:
  codehaus.snapshots (http://snapshots.repository.codehaus.org),
  central (http://repo1.maven.org/maven2),
  Nexus (http://repository.apache.org/snapshots),
  EclipseLink Repo (http://download.eclipse.org/rt/eclipselink/maven.repo/)


	at org.apache.maven.lifecycle.DefaultLifecycleExecutor.executeGoals(DefaultLifecycleExecutor.java:711)
	at org.apache.maven.lifecycle.DefaultLifecycleExecutor.executeGoalWithLifecycle(DefaultLifecycleExecutor.java:556)
	at org.apache.maven.lifecycle.DefaultLifecycleExecutor.executeGoal(DefaultLifecycleExecutor.java:535)
	at org.apache.maven.lifecycle.DefaultLifecycleExecutor.executeGoalAndHandleFailures(DefaultLifecycleExecutor.java:387)
	at org.apache.maven.lifecycle.DefaultLifecycleExecutor.executeTaskSegments(DefaultLifecycleExecutor.java:348)
	at org.apache.maven.lifecycle.DefaultLifecycleExecutor.execute(DefaultLifecycleExecutor.java:180)
	at org.apache.maven.lifecycle.LifecycleExecutorInterceptor.execute(LifecycleExecutorInterceptor.java:65)
	at org.apache.maven.DefaultMaven.doExecute(DefaultMaven.java:328)
	at org.apache.maven.DefaultMaven.execute(DefaultMaven.java:138)
	at org.apache.maven.cli.MavenCli.main(MavenCli.java:362)
	at sun.reflect.NativeMethodAccessorImpl.invoke0(Native Method)
	at sun.reflect.NativeMethodAccessorImpl.invoke(NativeMethodAccessorImpl.java:39)
	at sun.reflect.DelegatingMethodAccessorImpl.invoke(DelegatingMethodAccessorImpl.java:25)
	at java.lang.reflect.Method.invoke(Method.java:597)
	at org.codehaus.classworlds.Launcher.launchEnhanced(Launcher.java:315)
	at org.codehaus.classworlds.Launcher.launch(Launcher.java:255)
	at hudson.maven.agent.Main.launch(Main.java:185)
	at hudson.maven.MavenBuilder.call(MavenBuilder.java:151)
	at hudson.maven.Maven2Builder.call(Maven2Builder.java:77)
	at hudson.maven.Maven2Builder.call(Maven2Builder.java:53)
	at hudson.remoting.UserRequest.perform(UserRequest.java:118)
	at hudson.remoting.UserRequest.perform(UserRequest.java:48)
	at hudson.remoting.Request$2.run(Request.java:326)
	at hudson.remoting.InterceptingExecutorService$1.call(InterceptingExecutorService.java:72)
	at java.util.concurrent.FutureTask$Sync.innerRun(FutureTask.java:303)
	at java.util.concurrent.FutureTask.run(FutureTask.java:138)
	at java.util.concurrent.ThreadPoolExecutor$Worker.runTask(ThreadPoolExecutor.java:886)
	at java.util.concurrent.ThreadPoolExecutor$Worker.run(ThreadPoolExecutor.java:908)
	at java.lang.Thread.run(Thread.java:662)
Caused by: org.apache.maven.artifact.resolver.MultipleArtifactsNotFoundException: Missing:
----------
1) org.apache.aries.blueprint:blueprint-parser:jar:1.0.0

  Try downloading the file manually from the project website.

  Then, install it using the command: 
      mvn install:install-file -DgroupId=org.apache.aries.blueprint -DartifactId=blueprint-parser
-Dversion=1.0.0 -Dpackaging=jar -Dfile=/path/to/file

  Alternatively, if you host your own repository you can deploy the file there: 
      mvn deploy:deploy-file -DgroupId=org.apache.aries.blueprint -DartifactId=blueprint-parser
-Dversion=1.0.0 -Dpackaging=jar -Dfile=/path/to/file -Durl=[url] -DrepositoryId=[id]

  Path to dependency: 
  	1) org.apache.aries.application:application-modeller-standalone:jar:1.0.0-SNAPSHOT
  	2) org.apache.aries.blueprint:blueprint-parser:jar:1.0.0

----------
1 required artifact is missing.

for artifact: 
  org.apache.aries.application:application-modeller-standalone:jar:1.0.0-SNAPSHOT

from the specified remote repositories:
  codehaus.snapshots (http://snapshots.repository.codehaus.org),
  central (http://repo1.maven.org/maven2),
  Nexus (http://repository.apache.org/snapshots),
  EclipseLink Repo (http://download.eclipse.org/rt/eclipselink/maven.repo/)


	at org.apache.maven.artifact.resolver.DefaultArtifactResolver.resolveTransitively(DefaultArtifactResolver.java:360)
	at org.apache.maven.artifact.resolver.DefaultArtifactResolver.resolveTransitively(DefaultArtifactResolver.java:304)
	at org.apache.maven.plugin.DefaultPluginManager.resolveTransitiveDependencies(DefaultPluginManager.java:1499)
	at org.apache.maven.plugin.DefaultPluginManager.executeMojo(DefaultPluginManager.java:442)
	at hudson.maven.agent.PluginManagerInterceptor.executeMojo(PluginManagerInterceptor.java:182)
	at org.apache.maven.lifecycle.DefaultLifecycleExecutor.executeGoals(DefaultLifecycleExecutor.java:694)
	... 28 more
[INFO] ------------------------------------------------------------------------
[INFO] Total time: 13 minutes 42 seconds
[INFO] Finished at: Tue Jul 17 22:48:44 UTC 2012
[INFO] Final Memory: 192M/894M
[INFO] ------------------------------------------------------------------------
channel stopped

Mime
View raw message