aries-dev mailing list archives

Site index · List index
Message view « Date » · « Thread »
Top « Date » · « Thread »
From Apache Jenkins Server <jenk...@builds.apache.org>
Subject Build failed in Jenkins: Aries #1573
Date Tue, 17 Jul 2012 23:43:13 GMT
See <https://builds.apache.org/job/Aries/1573/changes>

Changes:

[cumminsh] [ARIES-862][maven-release-plugin]prepare for next development iteration

[cumminsh] [ARIES-862][maven-release-plugin]prepare release org.apache.aries.application.resolver.noop-1.0.0

[cumminsh] [ARIES-862] Rolling back botched release commit

[cumminsh] [ARIES-862] Accidentally rolled forward to non-release release of blueprint-parser.
Rolling back.

------------------------------------------
[...truncated 3515 lines...]

[WARNING] <https://builds.apache.org/job/Aries/ws/aries/application/application-modeller/src/main/java/org/apache/aries/application/modelling/impl/ModelledResourceImpl.java>:[186,30]
[deprecation] ExportedServiceImpl(java.lang.String,java.util.Map<java.lang.String,java.lang.String>)
in org.apache.aries.application.modelling.impl.ExportedServiceImpl has been deprecated

[WARNING] <https://builds.apache.org/job/Aries/ws/aries/application/application-modeller/src/main/java/org/apache/aries/application/modelling/impl/ModelledResourceImpl.java>:[192,49]
[deprecation] IMPORT_SERVICE in org.osgi.framework.Constants has been deprecated

[WARNING] <https://builds.apache.org/job/Aries/ws/aries/application/application-modeller/src/main/java/org/apache/aries/application/modelling/impl/ModelledResourceImpl.java>:[198,30]
[deprecation] ImportedServiceImpl(java.lang.String,java.util.Map<java.lang.String,java.lang.String>)
in org.apache.aries.application.modelling.impl.ImportedServiceImpl has been deprecated

[INFO] [resources:testResources {execution: default-testResources}]
[INFO] Using 'UTF-8' encoding to copy filtered resources.
[INFO] skip non existing resourceDirectory <https://builds.apache.org/job/Aries/ws/aries/application/application-modeller/src/test/resources>
[INFO] skip non existing resourceDirectory <https://builds.apache.org/job/Aries/ws/aries/application/application-modeller/src/test/filtered-resources>
[INFO] Copying 3 resources
[INFO] [compiler:testCompile {execution: default-testCompile}]
[INFO] No sources to compile
[INFO] [surefire:test {execution: default-test}]
[INFO] Surefire report directory: <https://builds.apache.org/job/Aries/ws/aries/application/application-modeller/target/surefire-reports>

-------------------------------------------------------
 T E S T S
-------------------------------------------------------
There are no tests to run.

Results :

Tests run: 0, Failures: 0, Errors: 0, Skipped: 0

[JENKINS] Recording test results[INFO] [enforcer:enforce {execution: check-java15}]
[INFO] Checking unresolved references to org.codehaus.mojo.signature:java15:1.0

[INFO] [bundle:bundle {execution: default-bundle}]
[INFO] [ianal:verify-legal-files {execution: default}]
[INFO] Checking legal files in: org.apache.aries.application.modeller-1.0.0-SNAPSHOT.jar
[INFO] [install:install {execution: default-install}]
[INFO] Installing <https://builds.apache.org/job/Aries/ws/aries/application/application-modeller/target/org.apache.aries.application.modeller-1.0.0-SNAPSHOT.jar>
to /home/jenkins/jenkins-slave/maven-repositories/1/org/apache/aries/application/org.apache.aries.application.modeller/1.0.0-SNAPSHOT/org.apache.aries.application.modeller-1.0.0-SNAPSHOT.jar
[INFO] [bundle:install {execution: default-install}]
[INFO] Installing org/apache/aries/application/org.apache.aries.application.modeller/1.0.0-SNAPSHOT/org.apache.aries.application.modeller-1.0.0-SNAPSHOT.jar
[INFO] Writing OBR metadata
[JENKINS] Archiving <https://builds.apache.org/job/Aries/ws/aries/application/application-modeller/pom.xml>
to /home/hudson/hudson/jobs/Aries/modules/org.apache.aries.application$org.apache.aries.application.modeller/builds/2012-07-17_23-31-43/archive/org.apache.aries.application/org.apache.aries.application.modeller/1.0.0-SNAPSHOT/org.apache.aries.application.modeller-1.0.0-SNAPSHOT.pom
[JENKINS] Archiving <https://builds.apache.org/job/Aries/ws/aries/application/application-modeller/target/org.apache.aries.application.modeller-1.0.0-SNAPSHOT.jar>
to /home/hudson/hudson/jobs/Aries/modules/org.apache.aries.application$org.apache.aries.application.modeller/builds/2012-07-17_23-31-43/archive/org.apache.aries.application/org.apache.aries.application.modeller/1.0.0-SNAPSHOT/org.apache.aries.application.modeller-1.0.0-SNAPSHOT.jar
[INFO] ------------------------------------------------------------------------
[INFO] Building Apache Aries Application Deployment Management
[INFO]    task-segment: [clean, install]
[INFO] ------------------------------------------------------------------------
[INFO] [clean:clean {execution: default-clean}]
[INFO] Deleting file set: <https://builds.apache.org/job/Aries/ws/aries/application/application-deployment-management/target>
(included: [**], excluded: [])
[INFO] snapshot org.apache.aries.application:org.apache.aries.application.modeller:1.0.0-SNAPSHOT:
checking for updates from codehaus.snapshots
[INFO] snapshot org.apache.aries.application:org.apache.aries.application.modeller:1.0.0-SNAPSHOT:
checking for updates from EclipseLink Repo
[INFO] snapshot org.apache.aries.application:org.apache.aries.application.modeller:1.0.0-SNAPSHOT:
checking for updates from apache.snapshots
[INFO] [enforcer:enforce {execution: default}]
[INFO] [remote-resources:process {execution: default}]
[INFO] [resources:resources {execution: default-resources}]
[INFO] Using 'UTF-8' encoding to copy filtered resources.
[INFO] Copying 2 resources
[INFO] skip non existing resourceDirectory <https://builds.apache.org/job/Aries/ws/aries/application/application-deployment-management/src/main/filtered-resources>
[INFO] Copying 0 resource
[INFO] Copying 3 resources
[INFO] [compiler:compile {execution: default-compile}]
[INFO] Compiling 3 source files to <https://builds.apache.org/job/Aries/ws/aries/application/application-deployment-management/target/classes>
[INFO] [resources:testResources {execution: default-testResources}]
[INFO] Using 'UTF-8' encoding to copy filtered resources.
[INFO] skip non existing resourceDirectory <https://builds.apache.org/job/Aries/ws/aries/application/application-deployment-management/src/test/resources>
[INFO] skip non existing resourceDirectory <https://builds.apache.org/job/Aries/ws/aries/application/application-deployment-management/src/test/filtered-resources>
[INFO] Copying 3 resources
[INFO] [compiler:testCompile {execution: default-testCompile}]
[INFO] Compiling 1 source file to <https://builds.apache.org/job/Aries/ws/aries/application/application-deployment-management/target/test-classes>
[WARNING] <https://builds.apache.org/job/Aries/ws/aries/application/application-deployment-management/src/test/java/org/apache/aries/application/deployment/management/DeploymentGeneratorTest.java>:[136,27]
[deprecation] resolve(org.apache.aries.application.management.AriesApplication,org.apache.aries.application.management.ResolveConstraint...)
in org.apache.aries.application.management.spi.resolve.AriesApplicationResolver has been deprecated

[INFO] [surefire:test {execution: default-test}]
[INFO] Surefire report directory: <https://builds.apache.org/job/Aries/ws/aries/application/application-deployment-management/target/surefire-reports>

-------------------------------------------------------
 T E S T S
-------------------------------------------------------
Running org.apache.aries.application.deployment.management.DeploymentGeneratorTest
Tests run: 6, Failures: 0, Errors: 0, Skipped: 0, Time elapsed: 0.152 sec

Results :

Tests run: 6, Failures: 0, Errors: 0, Skipped: 0

[JENKINS] Recording test results
[INFO] [bundle:bundle {execution: default-bundle}]
[INFO] [ianal:verify-legal-files {execution: default}]
[INFO] Checking legal files in: org.apache.aries.application.deployment.management-1.0.0-SNAPSHOT.jar
[INFO] [install:install {execution: default-install}]
[INFO] Installing <https://builds.apache.org/job/Aries/ws/aries/application/application-deployment-management/target/org.apache.aries.application.deployment.management-1.0.0-SNAPSHOT.jar>
to /home/jenkins/jenkins-slave/maven-repositories/1/org/apache/aries/application/org.apache.aries.application.deployment.management/1.0.0-SNAPSHOT/org.apache.aries.application.deployment.management-1.0.0-SNAPSHOT.jar
[INFO] [bundle:install {execution: default-install}]
[INFO] Installing org/apache/aries/application/org.apache.aries.application.deployment.management/1.0.0-SNAPSHOT/org.apache.aries.application.deployment.management-1.0.0-SNAPSHOT.jar
[INFO] Writing OBR metadata
[JENKINS] Archiving <https://builds.apache.org/job/Aries/ws/aries/application/application-deployment-management/pom.xml>
to /home/hudson/hudson/jobs/Aries/modules/org.apache.aries.application$org.apache.aries.application.deployment.management/builds/2012-07-17_23-31-43/archive/org.apache.aries.application/org.apache.aries.application.deployment.management/1.0.0-SNAPSHOT/org.apache.aries.application.deployment.management-1.0.0-SNAPSHOT.pom
[JENKINS] Archiving <https://builds.apache.org/job/Aries/ws/aries/application/application-deployment-management/target/org.apache.aries.application.deployment.management-1.0.0-SNAPSHOT.jar>
to /home/hudson/hudson/jobs/Aries/modules/org.apache.aries.application$org.apache.aries.application.deployment.management/builds/2012-07-17_23-31-43/archive/org.apache.aries.application/org.apache.aries.application.deployment.management/1.0.0-SNAPSHOT/org.apache.aries.application.deployment.management-1.0.0-SNAPSHOT.jar
[INFO] ------------------------------------------------------------------------
[INFO] Building Apache Aries Application Management
[INFO]    task-segment: [clean, install]
[INFO] ------------------------------------------------------------------------
[INFO] [clean:clean {execution: default-clean}]
[INFO] Deleting file set: <https://builds.apache.org/job/Aries/ws/aries/application/application-management/target>
(included: [**], excluded: [])
Downloading: http://snapshots.repository.codehaus.org/org/apache/aries/org.apache.aries.util/1.0.0-SNAPSHOT/org.apache.aries.util-1.0.0-SNAPSHOT.jar
Downloading: http://repository.apache.org/snapshots/org/apache/aries/application/org.apache.aries.application.api/1.0.0-SNAPSHOT/org.apache.aries.application.api-1.0.0-20120713.033542-35.jar
[INFO] Unable to find resource 'org.apache.aries:org.apache.aries.util:jar:1.0.0-SNAPSHOT'
in repository codehaus.snapshots (http://snapshots.repository.codehaus.org)
Downloading: http://download.eclipse.org/rt/eclipselink/maven.repo//org/apache/aries/org.apache.aries.util/1.0.0-SNAPSHOT/org.apache.aries.util-1.0.0-SNAPSHOT.jar
52K downloaded  (org.apache.aries.application.api-1.0.0-20120713.033542-35.jar)
[INFO] snapshot org.apache.aries.application:org.apache.aries.application.deployment.management:1.0.0-SNAPSHOT:
checking for updates from codehaus.snapshots
[INFO] snapshot org.apache.aries.application:org.apache.aries.application.deployment.management:1.0.0-SNAPSHOT:
checking for updates from EclipseLink Repo
[INFO] Unable to find resource 'org.apache.aries:org.apache.aries.util:jar:1.0.0-SNAPSHOT'
in repository EclipseLink Repo (http://download.eclipse.org/rt/eclipselink/maven.repo/)
Downloading: http://repository.apache.org/snapshots/org/apache/aries/org.apache.aries.util/1.0.0-SNAPSHOT/org.apache.aries.util-1.0.0-SNAPSHOT.jar
[INFO] Unable to find resource 'org.apache.aries:org.apache.aries.util:jar:1.0.0-SNAPSHOT'
in repository apache.snapshots (http://repository.apache.org/snapshots)
[INFO] snapshot org.apache.aries.application:org.apache.aries.application.deployment.management:1.0.0-SNAPSHOT:
checking for updates from apache.snapshots
[JENKINS] Archiving <https://builds.apache.org/job/Aries/ws/aries/application/application-management/pom.xml>
to /home/hudson/hudson/jobs/Aries/modules/org.apache.aries.application$org.apache.aries.application.management/builds/2012-07-17_23-31-43/archive/org.apache.aries.application/org.apache.aries.application.management/1.0.0-SNAPSHOT/org.apache.aries.application.management-1.0.0-SNAPSHOT.pom
[INFO] ------------------------------------------------------------------------
[ERROR] BUILD ERROR
[INFO] ------------------------------------------------------------------------
[INFO] Failed to resolve artifact.

Missing:
----------
1) org.apache.aries:org.apache.aries.util:jar:1.0.0-SNAPSHOT

  Try downloading the file manually from the project website.

  Then, install it using the command: 
      mvn install:install-file -DgroupId=org.apache.aries -DartifactId=org.apache.aries.util
-Dversion=1.0.0-SNAPSHOT -Dpackaging=jar -Dfile=/path/to/file

  Alternatively, if you host your own repository you can deploy the file there: 
      mvn deploy:deploy-file -DgroupId=org.apache.aries -DartifactId=org.apache.aries.util
-Dversion=1.0.0-SNAPSHOT -Dpackaging=jar -Dfile=/path/to/file -Durl=[url] -DrepositoryId=[id]

  Path to dependency: 
  	1) org.apache.aries.application:org.apache.aries.application.management:bundle:1.0.0-SNAPSHOT
  	2) org.apache.aries.application:org.apache.aries.application.utils:jar:1.0.0-SNAPSHOT
  	3) org.apache.aries:org.apache.aries.util:jar:1.0.0-SNAPSHOT

----------
1 required artifact is missing.

for artifact: 
  org.apache.aries.application:org.apache.aries.application.management:bundle:1.0.0-SNAPSHOT

from the specified remote repositories:
  codehaus.snapshots (http://snapshots.repository.codehaus.org),
  central (http://repo1.maven.org/maven2),
  Nexus (http://repository.apache.org/snapshots),
  EclipseLink Repo (http://download.eclipse.org/rt/eclipselink/maven.repo/)



[INFO] ------------------------------------------------------------------------
[INFO] Trace
org.apache.maven.lifecycle.LifecycleExecutionException: Missing:
----------
1) org.apache.aries:org.apache.aries.util:jar:1.0.0-SNAPSHOT

  Try downloading the file manually from the project website.

  Then, install it using the command: 
      mvn install:install-file -DgroupId=org.apache.aries -DartifactId=org.apache.aries.util
-Dversion=1.0.0-SNAPSHOT -Dpackaging=jar -Dfile=/path/to/file

  Alternatively, if you host your own repository you can deploy the file there: 
      mvn deploy:deploy-file -DgroupId=org.apache.aries -DartifactId=org.apache.aries.util
-Dversion=1.0.0-SNAPSHOT -Dpackaging=jar -Dfile=/path/to/file -Durl=[url] -DrepositoryId=[id]

  Path to dependency: 
  	1) org.apache.aries.application:org.apache.aries.application.management:bundle:1.0.0-SNAPSHOT
  	2) org.apache.aries.application:org.apache.aries.application.utils:jar:1.0.0-SNAPSHOT
  	3) org.apache.aries:org.apache.aries.util:jar:1.0.0-SNAPSHOT

----------
1 required artifact is missing.

for artifact: 
  org.apache.aries.application:org.apache.aries.application.management:bundle:1.0.0-SNAPSHOT

from the specified remote repositories:
  codehaus.snapshots (http://snapshots.repository.codehaus.org),
  central (http://repo1.maven.org/maven2),
  Nexus (http://repository.apache.org/snapshots),
  EclipseLink Repo (http://download.eclipse.org/rt/eclipselink/maven.repo/)


	at org.apache.maven.lifecycle.DefaultLifecycleExecutor.executeGoals(DefaultLifecycleExecutor.java:711)
	at org.apache.maven.lifecycle.DefaultLifecycleExecutor.executeGoalWithLifecycle(DefaultLifecycleExecutor.java:556)
	at org.apache.maven.lifecycle.DefaultLifecycleExecutor.executeGoal(DefaultLifecycleExecutor.java:535)
	at org.apache.maven.lifecycle.DefaultLifecycleExecutor.executeGoalAndHandleFailures(DefaultLifecycleExecutor.java:387)
	at org.apache.maven.lifecycle.DefaultLifecycleExecutor.executeTaskSegments(DefaultLifecycleExecutor.java:348)
	at org.apache.maven.lifecycle.DefaultLifecycleExecutor.execute(DefaultLifecycleExecutor.java:180)
	at org.apache.maven.lifecycle.LifecycleExecutorInterceptor.execute(LifecycleExecutorInterceptor.java:65)
	at org.apache.maven.DefaultMaven.doExecute(DefaultMaven.java:328)
	at org.apache.maven.DefaultMaven.execute(DefaultMaven.java:138)
	at org.apache.maven.cli.MavenCli.main(MavenCli.java:362)
	at sun.reflect.NativeMethodAccessorImpl.invoke0(Native Method)
	at sun.reflect.NativeMethodAccessorImpl.invoke(NativeMethodAccessorImpl.java:39)
	at sun.reflect.DelegatingMethodAccessorImpl.invoke(DelegatingMethodAccessorImpl.java:25)
	at java.lang.reflect.Method.invoke(Method.java:597)
	at org.codehaus.classworlds.Launcher.launchEnhanced(Launcher.java:315)
	at org.codehaus.classworlds.Launcher.launch(Launcher.java:255)
	at hudson.maven.agent.Main.launch(Main.java:185)
	at hudson.maven.MavenBuilder.call(MavenBuilder.java:151)
	at hudson.maven.Maven2Builder.call(Maven2Builder.java:77)
	at hudson.maven.Maven2Builder.call(Maven2Builder.java:53)
	at hudson.remoting.UserRequest.perform(UserRequest.java:118)
	at hudson.remoting.UserRequest.perform(UserRequest.java:48)
	at hudson.remoting.Request$2.run(Request.java:326)
	at hudson.remoting.InterceptingExecutorService$1.call(InterceptingExecutorService.java:72)
	at java.util.concurrent.FutureTask$Sync.innerRun(FutureTask.java:303)
	at java.util.concurrent.FutureTask.run(FutureTask.java:138)
	at java.util.concurrent.ThreadPoolExecutor$Worker.runTask(ThreadPoolExecutor.java:886)
	at java.util.concurrent.ThreadPoolExecutor$Worker.run(ThreadPoolExecutor.java:908)
	at java.lang.Thread.run(Thread.java:662)
Caused by: org.apache.maven.artifact.resolver.MultipleArtifactsNotFoundException: Missing:
----------
1) org.apache.aries:org.apache.aries.util:jar:1.0.0-SNAPSHOT

  Try downloading the file manually from the project website.

  Then, install it using the command: 
      mvn install:install-file -DgroupId=org.apache.aries -DartifactId=org.apache.aries.util
-Dversion=1.0.0-SNAPSHOT -Dpackaging=jar -Dfile=/path/to/file

  Alternatively, if you host your own repository you can deploy the file there: 
      mvn deploy:deploy-file -DgroupId=org.apache.aries -DartifactId=org.apache.aries.util
-Dversion=1.0.0-SNAPSHOT -Dpackaging=jar -Dfile=/path/to/file -Durl=[url] -DrepositoryId=[id]

  Path to dependency: 
  	1) org.apache.aries.application:org.apache.aries.application.management:bundle:1.0.0-SNAPSHOT
  	2) org.apache.aries.application:org.apache.aries.application.utils:jar:1.0.0-SNAPSHOT
  	3) org.apache.aries:org.apache.aries.util:jar:1.0.0-SNAPSHOT

----------
1 required artifact is missing.

for artifact: 
  org.apache.aries.application:org.apache.aries.application.management:bundle:1.0.0-SNAPSHOT

from the specified remote repositories:
  codehaus.snapshots (http://snapshots.repository.codehaus.org),
  central (http://repo1.maven.org/maven2),
  Nexus (http://repository.apache.org/snapshots),
  EclipseLink Repo (http://download.eclipse.org/rt/eclipselink/maven.repo/)


	at org.apache.maven.artifact.resolver.DefaultArtifactResolver.resolveTransitively(DefaultArtifactResolver.java:360)
	at org.apache.maven.artifact.resolver.DefaultArtifactResolver.resolveTransitively(DefaultArtifactResolver.java:304)
	at org.apache.maven.plugin.DefaultPluginManager.resolveTransitiveDependencies(DefaultPluginManager.java:1499)
	at org.apache.maven.plugin.DefaultPluginManager.executeMojo(DefaultPluginManager.java:442)
	at hudson.maven.agent.PluginManagerInterceptor.executeMojo(PluginManagerInterceptor.java:182)
	at org.apache.maven.lifecycle.DefaultLifecycleExecutor.executeGoals(DefaultLifecycleExecutor.java:694)
	... 28 more
[INFO] ------------------------------------------------------------------------
[INFO] Total time: 11 minutes 1 second
[INFO] Finished at: Tue Jul 17 23:43:09 UTC 2012
[INFO] Final Memory: 176M/667M
[INFO] ------------------------------------------------------------------------
channel stopped

Mime
View raw message