aries-dev mailing list archives

Site index · List index
Message view « Date » · « Thread »
Top « Date » · « Thread »
From Apache Jenkins Server <jenk...@builds.apache.org>
Subject Build failed in Jenkins: Aries #1624
Date Tue, 31 Jul 2012 20:19:40 GMT
See <https://builds.apache.org/job/Aries/1624/changes>

Changes:

[cumminsh] [ARIES-862] Moving to versions released earlier on samples

------------------------------------------
[...truncated 7294 lines...]
[INFO] Installing <https://builds.apache.org/job/Aries/ws/aries/jpa/jpa-container-itest/target/org.apache.aries.jpa.container.itest-1.0.0-SNAPSHOT.jar>
to /home/jenkins/jenkins-slave/maven-repositories/1/org/apache/aries/jpa/org.apache.aries.jpa.container.itest/1.0.0-SNAPSHOT/org.apache.aries.jpa.container.itest-1.0.0-SNAPSHOT.jar
[JENKINS] Archiving <https://builds.apache.org/job/Aries/ws/aries/jpa/jpa-container-itest/pom.xml>
to /home/hudson/hudson/jobs/Aries/modules/org.apache.aries.jpa$org.apache.aries.jpa.container.itest/builds/2012-07-31_19-53-03/archive/org.apache.aries.jpa/org.apache.aries.jpa.container.itest/1.0.0-SNAPSHOT/org.apache.aries.jpa.container.itest-1.0.0-SNAPSHOT.pom
[JENKINS] Archiving <https://builds.apache.org/job/Aries/ws/aries/jpa/jpa-container-itest/target/org.apache.aries.jpa.container.itest-1.0.0-SNAPSHOT.jar>
to /home/hudson/hudson/jobs/Aries/modules/org.apache.aries.jpa$org.apache.aries.jpa.container.itest/builds/2012-07-31_19-53-03/archive/org.apache.aries.jpa/org.apache.aries.jpa.container.itest/1.0.0-SNAPSHOT/org.apache.aries.jpa.container.itest-1.0.0-SNAPSHOT.jar
[INFO] ------------------------------------------------------------------------
[INFO] Building Aries JPA Component
[INFO]    task-segment: [clean, install]
[INFO] ------------------------------------------------------------------------
[INFO] [clean:clean {execution: default-clean}]
[INFO] Deleting file set: <https://builds.apache.org/job/Aries/ws/aries/jpa/target>
(included: [**], excluded: [])
[INFO] [enforcer:enforce {execution: default}]
[INFO] [remote-resources:process {execution: default}]
[INFO] [enforcer:enforce {execution: check-java15}]
[INFO] Checking unresolved references to org.codehaus.mojo.signature:java15:1.0
[INFO] [site:attach-descriptor {execution: default-attach-descriptor}]
[INFO] [ianal:verify-legal-files {execution: default}]
[INFO] [install:install {execution: default-install}]
[INFO] Installing <https://builds.apache.org/job/Aries/ws/aries/jpa/pom.xml> to /home/jenkins/jenkins-slave/maven-repositories/1/org/apache/aries/jpa/jpa/1.0.0-SNAPSHOT/jpa-1.0.0-SNAPSHOT.pom
[JENKINS] Archiving <https://builds.apache.org/job/Aries/ws/aries/jpa/pom.xml> to /home/hudson/hudson/jobs/Aries/modules/org.apache.aries.jpa$jpa/builds/2012-07-31_19-53-03/archive/org.apache.aries.jpa/jpa/1.0.0-SNAPSHOT/jpa-1.0.0-SNAPSHOT.pom
[INFO] ------------------------------------------------------------------------
[INFO] Building Apache Aries Samples
[INFO]    task-segment: [clean, install]
[INFO] ------------------------------------------------------------------------
[INFO] [clean:clean {execution: default-clean}]
[INFO] Deleting file set: <https://builds.apache.org/job/Aries/ws/aries/samples/target>
(included: [**], excluded: [])
[INFO] [enforcer:enforce {execution: default}]
[INFO] [remote-resources:process {execution: default}]
[INFO] [enforcer:enforce {execution: check-java15}]
[INFO] Checking unresolved references to org.codehaus.mojo.signature:java15:1.0
[INFO] [site:attach-descriptor {execution: default-attach-descriptor}]
[INFO] [ianal:verify-legal-files {execution: default}]
[INFO] [install:install {execution: default-install}]
[INFO] Installing <https://builds.apache.org/job/Aries/ws/aries/samples/pom.xml> to
/home/jenkins/jenkins-slave/maven-repositories/1/org/apache/aries/samples/samples/1.0.0-SNAPSHOT/samples-1.0.0-SNAPSHOT.pom
[JENKINS] Archiving <https://builds.apache.org/job/Aries/ws/aries/samples/pom.xml> to
/home/hudson/hudson/jobs/Aries/modules/org.apache.aries.samples$samples/builds/2012-07-31_19-53-03/archive/org.apache.aries.samples/samples/1.0.0-SNAPSHOT/samples-1.0.0-SNAPSHOT.pom
[INFO] ------------------------------------------------------------------------
[INFO] Building Apache Aries blog sample
[INFO]    task-segment: [clean, install]
[INFO] ------------------------------------------------------------------------
[INFO] [clean:clean {execution: default-clean}]
[INFO] Deleting file set: <https://builds.apache.org/job/Aries/ws/aries/samples/blog/target>
(included: [**], excluded: [])
[INFO] [enforcer:enforce {execution: default}]
[INFO] [remote-resources:process {execution: default}]
[INFO] [enforcer:enforce {execution: check-java15}]
[INFO] Checking unresolved references to org.codehaus.mojo.signature:java15:1.0
[INFO] [site:attach-descriptor {execution: default-attach-descriptor}]
[INFO] [ianal:verify-legal-files {execution: default}]
[INFO] [install:install {execution: default-install}]
[INFO] Installing <https://builds.apache.org/job/Aries/ws/aries/samples/blog/pom.xml>
to /home/jenkins/jenkins-slave/maven-repositories/1/org/apache/aries/samples/blog/blog/1.0.0-SNAPSHOT/blog-1.0.0-SNAPSHOT.pom
[JENKINS] Archiving <https://builds.apache.org/job/Aries/ws/aries/samples/blog/pom.xml>
to /home/hudson/hudson/jobs/Aries/modules/org.apache.aries.samples.blog$blog/builds/2012-07-31_19-53-03/archive/org.apache.aries.samples.blog/blog/1.0.0-SNAPSHOT/blog-1.0.0-SNAPSHOT.pom
[INFO] ------------------------------------------------------------------------
[INFO] Building Apache Aries blog sample API
[INFO]    task-segment: [clean, install]
[INFO] ------------------------------------------------------------------------
[INFO] [clean:clean {execution: default-clean}]
[INFO] Deleting file set: <https://builds.apache.org/job/Aries/ws/aries/samples/blog/blog-api/target>
(included: [**], excluded: [])
[INFO] [enforcer:enforce {execution: default}]
[INFO] [remote-resources:process {execution: default}]
[INFO] [resources:resources {execution: default-resources}]
[INFO] Using 'UTF-8' encoding to copy filtered resources.
[INFO] skip non existing resourceDirectory <https://builds.apache.org/job/Aries/ws/aries/samples/blog/blog-api/src/main/resources>
[INFO] skip non existing resourceDirectory <https://builds.apache.org/job/Aries/ws/aries/samples/blog/blog-api/src/main/filtered-resources>
[INFO] Copying 3 resources
[INFO] Copying 3 resources
[INFO] [compiler:compile {execution: default-compile}]
[INFO] Compiling 13 source files to <https://builds.apache.org/job/Aries/ws/aries/samples/blog/blog-api/target/classes>
[INFO] [resources:testResources {execution: default-testResources}]
[INFO] Using 'UTF-8' encoding to copy filtered resources.
[INFO] skip non existing resourceDirectory <https://builds.apache.org/job/Aries/ws/aries/samples/blog/blog-api/src/test/resources>
[INFO] skip non existing resourceDirectory <https://builds.apache.org/job/Aries/ws/aries/samples/blog/blog-api/src/test/filtered-resources>
[INFO] Copying 3 resources
[INFO] [compiler:testCompile {execution: default-testCompile}]
[INFO] No sources to compile
[INFO] [surefire:test {execution: default-test}]
[INFO] Surefire report directory: <https://builds.apache.org/job/Aries/ws/aries/samples/blog/blog-api/target/surefire-reports>

-------------------------------------------------------
 T E S T S
-------------------------------------------------------
There are no tests to run.

Results :

Tests run: 0, Failures: 0, Errors: 0, Skipped: 0

[INFO] [enforcer:enforce {execution: check-java15}]
[INFO] Checking unresolved references to org.codehaus.mojo.signature:java15:1.0
[JENKINS] Recording test results
[INFO] [bundle:bundle {execution: default-bundle}]
[WARNING] Warning building bundle org.apache.aries.samples.blog:org.apache.aries.samples.blog.api:bundle:1.0.0-SNAPSHOT
: Did not find matching referal for org.apache.aries.*
[INFO] [ianal:verify-legal-files {execution: default}]
[INFO] Checking legal files in: org.apache.aries.samples.blog.api-1.0.0-SNAPSHOT.jar
[INFO] [install:install {execution: default-install}]
[INFO] Installing <https://builds.apache.org/job/Aries/ws/aries/samples/blog/blog-api/target/org.apache.aries.samples.blog.api-1.0.0-SNAPSHOT.jar>
to /home/jenkins/jenkins-slave/maven-repositories/1/org/apache/aries/samples/blog/org.apache.aries.samples.blog.api/1.0.0-SNAPSHOT/org.apache.aries.samples.blog.api-1.0.0-SNAPSHOT.jar
[INFO] [bundle:install {execution: default-install}]
[INFO] Installing org/apache/aries/samples/blog/org.apache.aries.samples.blog.api/1.0.0-SNAPSHOT/org.apache.aries.samples.blog.api-1.0.0-SNAPSHOT.jar
[INFO] Writing OBR metadata
[JENKINS] Archiving <https://builds.apache.org/job/Aries/ws/aries/samples/blog/blog-api/pom.xml>
to /home/hudson/hudson/jobs/Aries/modules/org.apache.aries.samples.blog$org.apache.aries.samples.blog.api/builds/2012-07-31_19-53-03/archive/org.apache.aries.samples.blog/org.apache.aries.samples.blog.api/1.0.0-SNAPSHOT/org.apache.aries.samples.blog.api-1.0.0-SNAPSHOT.pom
[JENKINS] Archiving <https://builds.apache.org/job/Aries/ws/aries/samples/blog/blog-api/target/org.apache.aries.samples.blog.api-1.0.0-SNAPSHOT.jar>
to /home/hudson/hudson/jobs/Aries/modules/org.apache.aries.samples.blog$org.apache.aries.samples.blog.api/builds/2012-07-31_19-53-03/archive/org.apache.aries.samples.blog/org.apache.aries.samples.blog.api/1.0.0-SNAPSHOT/org.apache.aries.samples.blog.api-1.0.0-SNAPSHOT.jar
[INFO] ------------------------------------------------------------------------
[INFO] Building Apache Aries blog sample transaction enlisting JDBC datasource
[INFO]    task-segment: [clean, install]
[INFO] ------------------------------------------------------------------------
[INFO] [clean:clean {execution: default-clean}]
[INFO] Deleting file set: <https://builds.apache.org/job/Aries/ws/aries/samples/blog/blog-datasource/target>
(included: [**], excluded: [])
Downloading: http://download.eclipse.org/rt/eclipselink/maven.repo//org/apache/aries/transaction/org.apache.aries.transaction.blueprint/1.0.0/org.apache.aries.transaction.blueprint-1.0.0.pom
[INFO] Unable to find resource 'org.apache.aries.transaction:org.apache.aries.transaction.blueprint:pom:1.0.0'
in repository EclipseLink Repo (http://download.eclipse.org/rt/eclipselink/maven.repo/)
Downloading: http://repo1.maven.org/maven2/org/apache/aries/transaction/org.apache.aries.transaction.blueprint/1.0.0/org.apache.aries.transaction.blueprint-1.0.0.pom
[INFO] Unable to find resource 'org.apache.aries.transaction:org.apache.aries.transaction.blueprint:pom:1.0.0'
in repository central (http://repo1.maven.org/maven2)
Downloading: http://download.eclipse.org/rt/eclipselink/maven.repo//org/apache/aries/transaction/org.apache.aries.transaction.blueprint/1.0.0/org.apache.aries.transaction.blueprint-1.0.0.jar
[INFO] Unable to find resource 'org.apache.aries.transaction:org.apache.aries.transaction.blueprint:jar:1.0.0'
in repository EclipseLink Repo (http://download.eclipse.org/rt/eclipselink/maven.repo/)
Downloading: http://repo1.maven.org/maven2/org/apache/aries/transaction/org.apache.aries.transaction.blueprint/1.0.0/org.apache.aries.transaction.blueprint-1.0.0.jar
[INFO] Unable to find resource 'org.apache.aries.transaction:org.apache.aries.transaction.blueprint:jar:1.0.0'
in repository central (http://repo1.maven.org/maven2)
[JENKINS] Archiving <https://builds.apache.org/job/Aries/ws/aries/samples/blog/blog-datasource/pom.xml>
to /home/hudson/hudson/jobs/Aries/modules/org.apache.aries.samples.blog$org.apache.aries.samples.blog.datasource/builds/2012-07-31_19-53-03/archive/org.apache.aries.samples.blog/org.apache.aries.samples.blog.datasource/1.0.0-SNAPSHOT/org.apache.aries.samples.blog.datasource-1.0.0-SNAPSHOT.pom
[INFO] ------------------------------------------------------------------------
[ERROR] BUILD ERROR
[INFO] ------------------------------------------------------------------------
[INFO] Failed to resolve artifact.

Missing:
----------
1) org.apache.aries.transaction:org.apache.aries.transaction.blueprint:jar:1.0.0

  Try downloading the file manually from the project website.

  Then, install it using the command: 
      mvn install:install-file -DgroupId=org.apache.aries.transaction -DartifactId=org.apache.aries.transaction.blueprint
-Dversion=1.0.0 -Dpackaging=jar -Dfile=/path/to/file

  Alternatively, if you host your own repository you can deploy the file there: 
      mvn deploy:deploy-file -DgroupId=org.apache.aries.transaction -DartifactId=org.apache.aries.transaction.blueprint
-Dversion=1.0.0 -Dpackaging=jar -Dfile=/path/to/file -Durl=[url] -DrepositoryId=[id]

  Path to dependency: 
  	1) org.apache.aries.samples.blog:org.apache.aries.samples.blog.datasource:bundle:1.0.0-SNAPSHOT
  	2) org.apache.aries.transaction:org.apache.aries.transaction.blueprint:jar:1.0.0

----------
1 required artifact is missing.

for artifact: 
  org.apache.aries.samples.blog:org.apache.aries.samples.blog.datasource:bundle:1.0.0-SNAPSHOT

from the specified remote repositories:
  codehaus.snapshots (http://snapshots.repository.codehaus.org),
  central (http://repo1.maven.org/maven2),
  Nexus (http://repository.apache.org/snapshots),
  EclipseLink Repo (http://download.eclipse.org/rt/eclipselink/maven.repo/)



[INFO] ------------------------------------------------------------------------
[INFO] Trace
org.apache.maven.lifecycle.LifecycleExecutionException: Missing:
----------
1) org.apache.aries.transaction:org.apache.aries.transaction.blueprint:jar:1.0.0

  Try downloading the file manually from the project website.

  Then, install it using the command: 
      mvn install:install-file -DgroupId=org.apache.aries.transaction -DartifactId=org.apache.aries.transaction.blueprint
-Dversion=1.0.0 -Dpackaging=jar -Dfile=/path/to/file

  Alternatively, if you host your own repository you can deploy the file there: 
      mvn deploy:deploy-file -DgroupId=org.apache.aries.transaction -DartifactId=org.apache.aries.transaction.blueprint
-Dversion=1.0.0 -Dpackaging=jar -Dfile=/path/to/file -Durl=[url] -DrepositoryId=[id]

  Path to dependency: 
  	1) org.apache.aries.samples.blog:org.apache.aries.samples.blog.datasource:bundle:1.0.0-SNAPSHOT
  	2) org.apache.aries.transaction:org.apache.aries.transaction.blueprint:jar:1.0.0

----------
1 required artifact is missing.

for artifact: 
  org.apache.aries.samples.blog:org.apache.aries.samples.blog.datasource:bundle:1.0.0-SNAPSHOT

from the specified remote repositories:
  codehaus.snapshots (http://snapshots.repository.codehaus.org),
  central (http://repo1.maven.org/maven2),
  Nexus (http://repository.apache.org/snapshots),
  EclipseLink Repo (http://download.eclipse.org/rt/eclipselink/maven.repo/)


	at org.apache.maven.lifecycle.DefaultLifecycleExecutor.executeGoals(DefaultLifecycleExecutor.java:711)
	at org.apache.maven.lifecycle.DefaultLifecycleExecutor.executeGoalWithLifecycle(DefaultLifecycleExecutor.java:556)
	at org.apache.maven.lifecycle.DefaultLifecycleExecutor.executeGoal(DefaultLifecycleExecutor.java:535)
	at org.apache.maven.lifecycle.DefaultLifecycleExecutor.executeGoalAndHandleFailures(DefaultLifecycleExecutor.java:387)
	at org.apache.maven.lifecycle.DefaultLifecycleExecutor.executeTaskSegments(DefaultLifecycleExecutor.java:348)
	at org.apache.maven.lifecycle.DefaultLifecycleExecutor.execute(DefaultLifecycleExecutor.java:180)
	at org.apache.maven.lifecycle.LifecycleExecutorInterceptor.execute(LifecycleExecutorInterceptor.java:65)
	at org.apache.maven.DefaultMaven.doExecute(DefaultMaven.java:328)
	at org.apache.maven.DefaultMaven.execute(DefaultMaven.java:138)
	at org.apache.maven.cli.MavenCli.main(MavenCli.java:362)
	at sun.reflect.NativeMethodAccessorImpl.invoke0(Native Method)
	at sun.reflect.NativeMethodAccessorImpl.invoke(NativeMethodAccessorImpl.java:39)
	at sun.reflect.DelegatingMethodAccessorImpl.invoke(DelegatingMethodAccessorImpl.java:25)
	at java.lang.reflect.Method.invoke(Method.java:597)
	at org.codehaus.classworlds.Launcher.launchEnhanced(Launcher.java:315)
	at org.codehaus.classworlds.Launcher.launch(Launcher.java:255)
	at hudson.maven.agent.Main.launch(Main.java:185)
	at hudson.maven.MavenBuilder.call(MavenBuilder.java:151)
	at hudson.maven.Maven2Builder.call(Maven2Builder.java:77)
	at hudson.maven.Maven2Builder.call(Maven2Builder.java:53)
	at hudson.remoting.UserRequest.perform(UserRequest.java:118)
	at hudson.remoting.UserRequest.perform(UserRequest.java:48)
	at hudson.remoting.Request$2.run(Request.java:326)
	at hudson.remoting.InterceptingExecutorService$1.call(InterceptingExecutorService.java:72)
	at java.util.concurrent.FutureTask$Sync.innerRun(FutureTask.java:303)
	at java.util.concurrent.FutureTask.run(FutureTask.java:138)
	at java.util.concurrent.ThreadPoolExecutor$Worker.runTask(ThreadPoolExecutor.java:886)
	at java.util.concurrent.ThreadPoolExecutor$Worker.run(ThreadPoolExecutor.java:908)
	at java.lang.Thread.run(Thread.java:662)
Caused by: org.apache.maven.artifact.resolver.MultipleArtifactsNotFoundException: Missing:
----------
1) org.apache.aries.transaction:org.apache.aries.transaction.blueprint:jar:1.0.0

  Try downloading the file manually from the project website.

  Then, install it using the command: 
      mvn install:install-file -DgroupId=org.apache.aries.transaction -DartifactId=org.apache.aries.transaction.blueprint
-Dversion=1.0.0 -Dpackaging=jar -Dfile=/path/to/file

  Alternatively, if you host your own repository you can deploy the file there: 
      mvn deploy:deploy-file -DgroupId=org.apache.aries.transaction -DartifactId=org.apache.aries.transaction.blueprint
-Dversion=1.0.0 -Dpackaging=jar -Dfile=/path/to/file -Durl=[url] -DrepositoryId=[id]

  Path to dependency: 
  	1) org.apache.aries.samples.blog:org.apache.aries.samples.blog.datasource:bundle:1.0.0-SNAPSHOT
  	2) org.apache.aries.transaction:org.apache.aries.transaction.blueprint:jar:1.0.0

----------
1 required artifact is missing.

for artifact: 
  org.apache.aries.samples.blog:org.apache.aries.samples.blog.datasource:bundle:1.0.0-SNAPSHOT

from the specified remote repositories:
  codehaus.snapshots (http://snapshots.repository.codehaus.org),
  central (http://repo1.maven.org/maven2),
  Nexus (http://repository.apache.org/snapshots),
  EclipseLink Repo (http://download.eclipse.org/rt/eclipselink/maven.repo/)


	at org.apache.maven.artifact.resolver.DefaultArtifactResolver.resolveTransitively(DefaultArtifactResolver.java:360)
	at org.apache.maven.artifact.resolver.DefaultArtifactResolver.resolveTransitively(DefaultArtifactResolver.java:304)
	at org.apache.maven.plugin.DefaultPluginManager.resolveTransitiveDependencies(DefaultPluginManager.java:1499)
	at org.apache.maven.plugin.DefaultPluginManager.executeMojo(DefaultPluginManager.java:442)
	at hudson.maven.agent.PluginManagerInterceptor.executeMojo(PluginManagerInterceptor.java:182)
	at org.apache.maven.lifecycle.DefaultLifecycleExecutor.executeGoals(DefaultLifecycleExecutor.java:694)
	... 28 more
[INFO] ------------------------------------------------------------------------
[INFO] Total time: 26 minutes 4 seconds
[INFO] Finished at: Tue Jul 31 20:19:36 UTC 2012
[INFO] Final Memory: 204M/938M
[INFO] ------------------------------------------------------------------------
channel stopped

Mime
View raw message