aries-dev mailing list archives

Site index · List index
Message view « Date » · « Thread »
Top « Date » · « Thread »
From Apache Jenkins Server <jenk...@builds.apache.org>
Subject Build failed in Jenkins: AriesWithSnapshotDependencies #254
Date Fri, 28 Sep 2012 00:48:47 GMT
See <https://builds.apache.org/job/AriesWithSnapshotDependencies/254/changes>

Changes:

[jwross] ARIES-927: Added an additional check for determining whether or not composite bundle
support is available. The additional check is necessary because Equinox will register the
CompositeBundleFactory service even though the org.osgi.service.framework package is not exported
due to a strict resolution mode.

------------------------------------------
[...truncated 51325 lines...]
[INFO] [compiler:compile {execution: default-compile}]
[INFO] Compiling 1 source file to <https://builds.apache.org/job/AriesWithSnapshotDependencies/ws/aries-current-snapshots/spi-fly/spi-fly-weaver/target/classes>
[debug] execute contextualize
[INFO] [resources:testResources {execution: default-testResources}]
[INFO] Using 'UTF-8' encoding to copy filtered resources.
[INFO] skip non existing resourceDirectory <https://builds.apache.org/job/AriesWithSnapshotDependencies/ws/aries-current-snapshots/spi-fly/spi-fly-weaver/src/test/resources>
[INFO] skip non existing resourceDirectory <https://builds.apache.org/job/AriesWithSnapshotDependencies/ws/aries-current-snapshots/spi-fly/spi-fly-weaver/src/test/filtered-resources>
[INFO] Copying 3 resources
[INFO] [compiler:testCompile {execution: default-testCompile}]
[INFO] No sources to compile
[INFO] [surefire:test {execution: default-test}]
[INFO] Surefire report directory: <https://builds.apache.org/job/AriesWithSnapshotDependencies/ws/aries-current-snapshots/spi-fly/spi-fly-weaver/target/surefire-reports>

-------------------------------------------------------
 T E S T S
-------------------------------------------------------
[JENKINS] Recording test results
Results :

Tests run: 0, Failures: 0, Errors: 0, Skipped: 0


[JENKINS] Archiving <https://builds.apache.org/job/AriesWithSnapshotDependencies/ws/aries-current-snapshots/spi-fly/spi-fly-weaver/pom.xml>
to /home/hudson/hudson/jobs/AriesWithSnapshotDependencies/modules/org.apache.aries.spifly$org.apache.aries.spifly.weaver-internal/builds/2012-09-27_22-26-04/archive/org.apache.aries.spifly/org.apache.aries.spifly.weaver-internal/1.0.0-SNAPSHOT/org.apache.aries.spifly.weaver-internal-1.0.0-SNAPSHOT.pom
[JENKINS] Archiving <https://builds.apache.org/job/AriesWithSnapshotDependencies/ws/aries-current-snapshots/spi-fly/spi-fly-weaver/target/org.apache.aries.spifly.weaver-internal-1.0.0-SNAPSHOT.jar>
to /home/hudson/hudson/jobs/AriesWithSnapshotDependencies/modules/org.apache.aries.spifly$org.apache.aries.spifly.weaver-internal/builds/2012-09-27_22-26-04/archive/org.apache.aries.spifly/org.apache.aries.spifly.weaver-internal/1.0.0-SNAPSHOT/org.apache.aries.spifly.weaver-internal-1.0.0-SNAPSHOT.jar
[INFO] [jar:jar {execution: default-jar}]
[INFO] Building jar: <https://builds.apache.org/job/AriesWithSnapshotDependencies/ws/aries-current-snapshots/spi-fly/spi-fly-weaver/target/org.apache.aries.spifly.weaver-internal-1.0.0-SNAPSHOT.jar>
[INFO] [ianal:verify-legal-files {execution: default}]
[INFO] Checking legal files in: org.apache.aries.spifly.weaver-internal-1.0.0-SNAPSHOT.jar
[INFO] [install:install {execution: default-install}]
[INFO] Installing <https://builds.apache.org/job/AriesWithSnapshotDependencies/ws/aries-current-snapshots/spi-fly/spi-fly-weaver/target/org.apache.aries.spifly.weaver-internal-1.0.0-SNAPSHOT.jar>
to <https://builds.apache.org/job/AriesWithSnapshotDependencies/ws/.repository/org/apache/aries/spifly/org.apache.aries.spifly.weaver-internal/1.0.0-SNAPSHOT/org.apache.aries.spifly.weaver-internal-1.0.0-SNAPSHOT.jar>
[INFO] ------------------------------------------------------------------------
[INFO] Building Apache Aries SPI Fly Dynamic Weaving Bundle
[INFO]    task-segment: [clean, install]
[INFO] ------------------------------------------------------------------------
[JENKINS] Recording test results[INFO] [clean:clean {execution: default-clean}]
[INFO] Deleting <https://builds.apache.org/job/AriesWithSnapshotDependencies/ws/aries-current-snapshots/spi-fly/spi-fly-dynamic-bundle/target>
[INFO] [enforcer:enforce {execution: default}]
[WARNING] The parameter expression: 'project.build.resources' used in mojo: 'process' has
been deprecated. Use 'project.resources' instead.
[INFO] [remote-resources:process {execution: default}]
[debug] execute contextualize
[INFO] [resources:resources {execution: default-resources}]
[INFO] Using 'UTF-8' encoding to copy filtered resources.
[INFO] skip non existing resourceDirectory <https://builds.apache.org/job/AriesWithSnapshotDependencies/ws/aries-current-snapshots/spi-fly/spi-fly-dynamic-bundle/src/main/resources>
[INFO] skip non existing resourceDirectory <https://builds.apache.org/job/AriesWithSnapshotDependencies/ws/aries-current-snapshots/spi-fly/spi-fly-dynamic-bundle/src/main/filtered-resources>
[INFO] Copying 0 resource
[INFO] Copying 3 resources
[INFO] [compiler:compile {execution: default-compile}]
[INFO] Compiling 3 source files to <https://builds.apache.org/job/AriesWithSnapshotDependencies/ws/aries-current-snapshots/spi-fly/spi-fly-dynamic-bundle/target/classes>
[debug] execute contextualize
[INFO] [resources:testResources {execution: default-testResources}]
[INFO] Using 'UTF-8' encoding to copy filtered resources.
[INFO] Copying 8 resources
[INFO] skip non existing resourceDirectory <https://builds.apache.org/job/AriesWithSnapshotDependencies/ws/aries-current-snapshots/spi-fly/spi-fly-dynamic-bundle/src/test/filtered-resources>
[INFO] Copying 3 resources
[INFO] [compiler:testCompile {execution: default-testCompile}]
[INFO] Compiling 18 source files to <https://builds.apache.org/job/AriesWithSnapshotDependencies/ws/aries-current-snapshots/spi-fly/spi-fly-dynamic-bundle/target/test-classes>
[INFO] [surefire:test {execution: default-test}]
[INFO] Surefire report directory: <https://builds.apache.org/job/AriesWithSnapshotDependencies/ws/aries-current-snapshots/spi-fly/spi-fly-dynamic-bundle/target/surefire-reports>

-------------------------------------------------------
 T E S T S
-------------------------------------------------------
Running org.apache.aries.spifly.dynamic.ClientWeavingHookGenericCapabilityTest

Tests run: 9, Failures: 0, Errors: 0, Skipped: 0, Time elapsed: 0.267 sec
Running org.apache.aries.spifly.dynamic.ClientWeavingHookOSGi43Test
Tests run: 1, Failures: 0, Errors: 0, Skipped: 0, Time elapsed: 0.01 sec
Running org.apache.aries.spifly.dynamic.ClientWeavingHookTest
Tests run: 15, Failures: 0, Errors: 0, Skipped: 0, Time elapsed: 0.095 sec

Results :

Tests run: 25, Failures: 0, Errors: 0, Skipped: 0

[INFO] [bundle:bundle {execution: default-bundle}]
[WARNING] Warning building bundle org.apache.aries.spifly:org.apache.aries.spifly.dynamic.bundle:bundle:1.0.0-SNAPSHOT
: Instructions in Export-Package that are never used: org\.apache\.aries\.spifly\.api
Classpath: Jar:.,Jar:asm-all,Jar:org.apache.aries.spifly.core-internal,Jar:org.apache.aries.util,Jar:org.apache.aries.spifly.weaver-internal,Jar:org.osgi.core,Jar:org.osgi.compendium

[WARNING] Warning building bundle org.apache.aries.spifly:org.apache.aries.spifly.dynamic.bundle:bundle:1.0.0-SNAPSHOT
: Superfluous export-package instructions: [org.apache.aries.spifly.api]
[INFO] [ianal:verify-legal-files {execution: default}]
[INFO] Checking legal files in: org.apache.aries.spifly.dynamic.bundle-1.0.0-SNAPSHOT.jar
[INFO] [install:install {execution: default-install}]
[INFO] Installing <https://builds.apache.org/job/AriesWithSnapshotDependencies/ws/aries-current-snapshots/spi-fly/spi-fly-dynamic-bundle/target/org.apache.aries.spifly.dynamic.bundle-1.0.0-SNAPSHOT.jar>
to <https://builds.apache.org/job/AriesWithSnapshotDependencies/ws/.repository/org/apache/aries/spifly/org.apache.aries.spifly.dynamic.bundle/1.0.0-SNAPSHOT/org.apache.aries.spifly.dynamic.bundle-1.0.0-SNAPSHOT.jar>
[INFO] [bundle:install {execution: default-install}]
[INFO] Installing org/apache/aries/spifly/org.apache.aries.spifly.dynamic.bundle/1.0.0-SNAPSHOT/org.apache.aries.spifly.dynamic.bundle-1.0.0-SNAPSHOT.jar
[INFO] Writing OBR metadata
[JENKINS] Archiving <https://builds.apache.org/job/AriesWithSnapshotDependencies/ws/aries-current-snapshots/spi-fly/spi-fly-dynamic-bundle/pom.xml>
to /home/hudson/hudson/jobs/AriesWithSnapshotDependencies/modules/org.apache.aries.spifly$org.apache.aries.spifly.dynamic.bundle/builds/2012-09-27_22-26-04/archive/org.apache.aries.spifly/org.apache.aries.spifly.dynamic.bundle/1.0.0-SNAPSHOT/org.apache.aries.spifly.dynamic.bundle-1.0.0-SNAPSHOT.pom
[JENKINS] Archiving <https://builds.apache.org/job/AriesWithSnapshotDependencies/ws/aries-current-snapshots/spi-fly/spi-fly-dynamic-bundle/target/org.apache.aries.spifly.dynamic.bundle-1.0.0-SNAPSHOT.jar>
to /home/hudson/hudson/jobs/AriesWithSnapshotDependencies/modules/org.apache.aries.spifly$org.apache.aries.spifly.dynamic.bundle/builds/2012-09-27_22-26-04/archive/org.apache.aries.spifly/org.apache.aries.spifly.dynamic.bundle/1.0.0-SNAPSHOT/org.apache.aries.spifly.dynamic.bundle-1.0.0-SNAPSHOT.jar
[INFO] ------------------------------------------------------------------------
[INFO] Building Apache Aries SPI Fly Static Weaving Tool
[INFO]    task-segment: [clean, install]
[INFO] ------------------------------------------------------------------------
[INFO] [clean:clean {execution: default-clean}]
[INFO] Deleting <https://builds.apache.org/job/AriesWithSnapshotDependencies/ws/aries-current-snapshots/spi-fly/spi-fly-static-tool/target>
[INFO] [enforcer:enforce {execution: default}]
[WARNING] The parameter expression: 'project.build.resources' used in mojo: 'process' has
been deprecated. Use 'project.resources' instead.
[INFO] [remote-resources:process {execution: default}]
[debug] execute contextualize
[INFO] [resources:resources {execution: default-resources}]
[INFO] Using 'UTF-8' encoding to copy filtered resources.
[INFO] skip non existing resourceDirectory <https://builds.apache.org/job/AriesWithSnapshotDependencies/ws/aries-current-snapshots/spi-fly/spi-fly-static-tool/src/main/resources>
[INFO] skip non existing resourceDirectory <https://builds.apache.org/job/AriesWithSnapshotDependencies/ws/aries-current-snapshots/spi-fly/spi-fly-static-tool/src/main/filtered-resources>
[INFO] Copying 0 resource
[INFO] Copying 3 resources
[INFO] [compiler:compile {execution: default-compile}]
[INFO] Compiling 3 source files to <https://builds.apache.org/job/AriesWithSnapshotDependencies/ws/aries-current-snapshots/spi-fly/spi-fly-static-tool/target/classes>
[debug] execute contextualize
[INFO] [resources:testResources {execution: default-testResources}]
[INFO] Using 'UTF-8' encoding to copy filtered resources.
[INFO] Copying 1 resource
[INFO] skip non existing resourceDirectory <https://builds.apache.org/job/AriesWithSnapshotDependencies/ws/aries-current-snapshots/spi-fly/spi-fly-static-tool/src/test/filtered-resources>
[INFO] Copying 3 resources
[INFO] [compiler:testCompile {execution: default-testCompile}]
[INFO] Compiling 6 source files to <https://builds.apache.org/job/AriesWithSnapshotDependencies/ws/aries-current-snapshots/spi-fly/spi-fly-static-tool/target/test-classes>
[INFO] [surefire:test {execution: default-test}]
[INFO] Surefire report directory: <https://builds.apache.org/job/AriesWithSnapshotDependencies/ws/aries-current-snapshots/spi-fly/spi-fly-static-tool/target/surefire-reports>

-------------------------------------------------------
 T E S T S
-------------------------------------------------------
[JENKINS] Recording test resultsRunning org.apache.aries.spifly.statictool.MainTest
Tests run: 2, Failures: 0, Errors: 0, Skipped: 0, Time elapsed: 0.062 sec
Running org.apache.aries.spifly.statictool.ConsumerTest
Tests run: 1, Failures: 0, Errors: 0, Skipped: 0, Time elapsed: 0.057 sec
Running org.apache.aries.spifly.statictool.RequirementTest
Tests run: 1, Failures: 0, Errors: 0, Skipped: 0, Time elapsed: 0.027 sec

Results :

Tests run: 4, Failures: 0, Errors: 0, Skipped: 0


[JENKINS] Archiving <https://builds.apache.org/job/AriesWithSnapshotDependencies/ws/aries-current-snapshots/spi-fly/spi-fly-static-tool/pom.xml>
to /home/hudson/hudson/jobs/AriesWithSnapshotDependencies/modules/org.apache.aries.spifly$org.apache.aries.spifly.static.tool/builds/2012-09-27_22-26-04/archive/org.apache.aries.spifly/org.apache.aries.spifly.static.tool/1.0.0-SNAPSHOT/org.apache.aries.spifly.static.tool-1.0.0-SNAPSHOT.pom
[JENKINS] Archiving <https://builds.apache.org/job/AriesWithSnapshotDependencies/ws/aries-current-snapshots/spi-fly/spi-fly-static-tool/target/org.apache.aries.spifly.static.tool-1.0.0-SNAPSHOT.jar>
to /home/hudson/hudson/jobs/AriesWithSnapshotDependencies/modules/org.apache.aries.spifly$org.apache.aries.spifly.static.tool/builds/2012-09-27_22-26-04/archive/org.apache.aries.spifly/org.apache.aries.spifly.static.tool/1.0.0-SNAPSHOT/org.apache.aries.spifly.static.tool-1.0.0-SNAPSHOT.jar
[INFO] [jar:jar {execution: default-jar}]
[INFO] Building jar: <https://builds.apache.org/job/AriesWithSnapshotDependencies/ws/aries-current-snapshots/spi-fly/spi-fly-static-tool/target/org.apache.aries.spifly.static.tool-1.0.0-SNAPSHOT.jar>
[INFO] [assembly:single {execution: default}]
[INFO] META-INF/MANIFEST.MF already added, skipping
[INFO] META-INF/MANIFEST.MF already added, skipping
[INFO] META-INF/ already added, skipping
[INFO] META-INF/DEPENDENCIES already added, skipping
[INFO] META-INF/LICENSE already added, skipping
[INFO] META-INF/NOTICE already added, skipping
[INFO] META-INF/maven/ already added, skipping
[INFO] org/ already added, skipping
[INFO] org/apache/ already added, skipping
[INFO] org/apache/aries/ already added, skipping
[INFO] META-INF/ already added, skipping
[INFO] META-INF/MANIFEST.MF already added, skipping
[INFO] org/ already added, skipping
[INFO] org/apache/ already added, skipping
[INFO] org/apache/aries/ already added, skipping
[INFO] org/apache/aries/spifly/ already added, skipping
[INFO] META-INF/LICENSE already added, skipping
[INFO] META-INF/DEPENDENCIES already added, skipping
[INFO] META-INF/NOTICE already added, skipping
[INFO] META-INF/maven/ already added, skipping
[INFO] META-INF/maven/org.apache.aries.spifly/ already added, skipping
[INFO] META-INF/MANIFEST.MF already added, skipping
[INFO] org/ already added, skipping
[INFO] META-INF/ already added, skipping
[INFO] META-INF/MANIFEST.MF already added, skipping
[INFO] org/ already added, skipping
[INFO] org/apache/ already added, skipping
[INFO] org/apache/aries/ already added, skipping
[INFO] org/apache/aries/spifly/ already added, skipping
[INFO] META-INF/LICENSE already added, skipping
[INFO] META-INF/DEPENDENCIES already added, skipping
[INFO] META-INF/NOTICE already added, skipping
[INFO] META-INF/maven/ already added, skipping
[INFO] META-INF/maven/org.apache.aries.spifly/ already added, skipping
[INFO] Building jar: <https://builds.apache.org/job/AriesWithSnapshotDependencies/ws/aries-current-snapshots/spi-fly/spi-fly-static-tool/target/org.apache.aries.spifly.static.tool-1.0.0-SNAPSHOT-jar-with-dependencies.jar>
[INFO] META-INF/MANIFEST.MF already added, skipping
[INFO] META-INF/MANIFEST.MF already added, skipping
[INFO] META-INF/ already added, skipping
[INFO] META-INF/DEPENDENCIES already added, skipping
[INFO] META-INF/LICENSE already added, skipping
[INFO] META-INF/NOTICE already added, skipping
[INFO] META-INF/maven/ already added, skipping
[INFO] ------------------------------------------------------------------------
[ERROR] BUILD ERROR
[INFO] ------------------------------------------------------------------------
[INFO] Failed to create assembly: Error creating assembly archive jar-with-dependencies: Problem
creating jar: JAR entry META-INF/maven/org.apache.aries/org.apache.aries.util/pom.properties
not found in <https://builds.apache.org/job/AriesWithSnapshotDependencies/ws/.repository/org/apache/aries/org.apache.aries.util/1.0.1-SNAPSHOT/org.apache.aries.util-1.0.1-SNAPSHOT.jar>

[INFO] ------------------------------------------------------------------------
[INFO] Trace
org.apache.maven.lifecycle.LifecycleExecutionException: Failed to create assembly: Error creating
assembly archive jar-with-dependencies: Problem creating jar: JAR entry META-INF/maven/org.apache.aries/org.apache.aries.util/pom.properties
not found in <https://builds.apache.org/job/AriesWithSnapshotDependencies/ws/.repository/org/apache/aries/org.apache.aries.util/1.0.1-SNAPSHOT/org.apache.aries.util-1.0.1-SNAPSHOT.jar>
	at org.apache.maven.lifecycle.DefaultLifecycleExecutor.executeGoals(DefaultLifecycleExecutor.java:719)
	at org.apache.maven.lifecycle.DefaultLifecycleExecutor.executeGoalWithLifecycle(DefaultLifecycleExecutor.java:556)
	at org.apache.maven.lifecycle.DefaultLifecycleExecutor.executeGoal(DefaultLifecycleExecutor.java:535)
	at org.apache.maven.lifecycle.DefaultLifecycleExecutor.executeGoalAndHandleFailures(DefaultLifecycleExecutor.java:387)
	at org.apache.maven.lifecycle.DefaultLifecycleExecutor.executeTaskSegments(DefaultLifecycleExecutor.java:348)
	at org.apache.maven.lifecycle.DefaultLifecycleExecutor.execute(DefaultLifecycleExecutor.java:180)
	at org.apache.maven.lifecycle.LifecycleExecutorInterceptor.execute(LifecycleExecutorInterceptor.java:65)
	at org.apache.maven.DefaultMaven.doExecute(DefaultMaven.java:328)
	at org.apache.maven.DefaultMaven.execute(DefaultMaven.java:138)
	at org.apache.maven.cli.MavenCli.main(MavenCli.java:362)
	at sun.reflect.NativeMethodAccessorImpl.invoke0(Native Method)
	at sun.reflect.NativeMethodAccessorImpl.invoke(NativeMethodAccessorImpl.java:39)
	at sun.reflect.DelegatingMethodAccessorImpl.invoke(DelegatingMethodAccessorImpl.java:25)
	at java.lang.reflect.Method.invoke(Method.java:597)
	at org.codehaus.classworlds.Launcher.launchEnhanced(Launcher.java:315)
	at org.codehaus.classworlds.Launcher.launch(Launcher.java:255)
	at hudson.maven.agent.Main.launch(Main.java:185)
	at hudson.maven.MavenBuilder.call(MavenBuilder.java:151)
	at hudson.maven.Maven2Builder.call(Maven2Builder.java:77)
	at hudson.maven.Maven2Builder.call(Maven2Builder.java:53)
	at hudson.remoting.UserRequest.perform(UserRequest.java:118)
	at hudson.remoting.UserRequest.perform(UserRequest.java:48)
	at hudson.remoting.Request$2.run(Request.java:326)
	at hudson.remoting.InterceptingExecutorService$1.call(InterceptingExecutorService.java:72)
	at java.util.concurrent.FutureTask$Sync.innerRun(FutureTask.java:303)
	at java.util.concurrent.FutureTask.run(FutureTask.java:138)
	at java.util.concurrent.ThreadPoolExecutor$Worker.runTask(ThreadPoolExecutor.java:886)
	at java.util.concurrent.ThreadPoolExecutor$Worker.run(ThreadPoolExecutor.java:908)
	at java.lang.Thread.run(Thread.java:662)
Caused by: org.apache.maven.plugin.MojoExecutionException: Failed to create assembly: Error
creating assembly archive jar-with-dependencies: Problem creating jar: JAR entry META-INF/maven/org.apache.aries/org.apache.aries.util/pom.properties
not found in <https://builds.apache.org/job/AriesWithSnapshotDependencies/ws/.repository/org/apache/aries/org.apache.aries.util/1.0.1-SNAPSHOT/org.apache.aries.util-1.0.1-SNAPSHOT.jar>
	at org.apache.maven.plugin.assembly.mojos.AbstractAssemblyMojo.execute(AbstractAssemblyMojo.java:472)
	at org.apache.maven.plugin.DefaultPluginManager.executeMojo(DefaultPluginManager.java:490)
	at hudson.maven.agent.PluginManagerInterceptor.executeMojo(PluginManagerInterceptor.java:182)
	at org.apache.maven.lifecycle.DefaultLifecycleExecutor.executeGoals(DefaultLifecycleExecutor.java:694)
	... 28 more
Caused by: org.apache.maven.plugin.assembly.archive.ArchiveCreationException: Error creating
assembly archive jar-with-dependencies: Problem creating jar: JAR entry META-INF/maven/org.apache.aries/org.apache.aries.util/pom.properties
not found in <https://builds.apache.org/job/AriesWithSnapshotDependencies/ws/.repository/org/apache/aries/org.apache.aries.util/1.0.1-SNAPSHOT/org.apache.aries.util-1.0.1-SNAPSHOT.jar>
	at org.apache.maven.plugin.assembly.archive.DefaultAssemblyArchiver.createArchive(DefaultAssemblyArchiver.java:196)
	at org.apache.maven.plugin.assembly.mojos.AbstractAssemblyMojo.execute(AbstractAssemblyMojo.java:413)
	... 31 more
Caused by: org.codehaus.plexus.archiver.ArchiverException: Problem creating jar: JAR entry
META-INF/maven/org.apache.aries/org.apache.aries.util/pom.properties not found in <https://builds.apache.org/job/AriesWithSnapshotDependencies/ws/.repository/org/apache/aries/org.apache.aries.util/1.0.1-SNAPSHOT/org.apache.aries.util-1.0.1-SNAPSHOT.jar>
	at org.codehaus.plexus.archiver.AbstractArchiver.createArchive(AbstractArchiver.java:888)
	at org.apache.maven.plugin.assembly.archive.archiver.AssemblyProxyArchiver.createArchive(AssemblyProxyArchiver.java:512)
	at org.apache.maven.plugin.assembly.archive.DefaultAssemblyArchiver.createArchive(DefaultAssemblyArchiver.java:192)
	... 32 more
Caused by: java.io.FileNotFoundException: JAR entry META-INF/maven/org.apache.aries/org.apache.aries.util/pom.properties
not found in <https://builds.apache.org/job/AriesWithSnapshotDependencies/ws/.repository/org/apache/aries/org.apache.aries.util/1.0.1-SNAPSHOT/org.apache.aries.util-1.0.1-SNAPSHOT.jar>
	at sun.net.www.protocol.jar.JarURLConnection.connect(JarURLConnection.java:122)
	at sun.net.www.protocol.jar.JarURLConnection.getInputStream(JarURLConnection.java:132)
	at java.net.URL.openStream(URL.java:1010)
	at org.codehaus.plexus.components.io.resources.PlexusIoURLResource.getContents(PlexusIoURLResource.java:30)
	at org.codehaus.plexus.archiver.ArchiveEntry.getInputStream(ArchiveEntry.java:104)
	at org.codehaus.plexus.archiver.zip.AbstractZipArchiver.zipFile(AbstractZipArchiver.java:590)
	at org.codehaus.plexus.archiver.zip.AbstractZipArchiver.addResources(AbstractZipArchiver.java:426)
	at org.codehaus.plexus.archiver.zip.AbstractZipArchiver.createArchiveMain(AbstractZipArchiver.java:349)
	at org.codehaus.plexus.archiver.zip.AbstractZipArchiver.execute(AbstractZipArchiver.java:250)
	at org.codehaus.plexus.archiver.AbstractArchiver.createArchive(AbstractArchiver.java:871)
	... 34 more
[INFO] ------------------------------------------------------------------------
[INFO] Total time: 131 minutes 32 seconds
[INFO] Finished at: Fri Sep 28 00:48:30 UTC 2012
[INFO] Final Memory: 423M/1367M
[INFO] ------------------------------------------------------------------------
channel stopped

Mime
View raw message